You are viewing a plain text version of this content. The canonical link for it is here.
Posted to builds@mesos.apache.org by Apache Jenkins Server <je...@builds.apache.org> on 2017/03/07 01:21:00 UTC
Build failed in Jenkins: Mesos-Reviewbot #17330
See <https://builds.apache.org/job/Mesos-Reviewbot/17330/display/redirect>
------------------------------------------
[...truncated 25.67 MB...]
I0307 01:20:24.966913 30430 containerizer.cpp:600] Recovering containerizer
I0307 01:20:24.968587 30443 provisioner.cpp:410] Provisioner recovery complete
I0307 01:20:24.969070 30432 slave.cpp:5572] Finished recovery
I0307 01:20:24.969662 30432 slave.cpp:5754] Querying resource estimator for oversubscribable resources
I0307 01:20:24.970212 30430 slave.cpp:5768] Received oversubscribable resources {} from the resource estimator
I0307 01:20:24.973423 30443 process.cpp:3705] Handling HTTP event for process 'slave(706)' with path: '/slave(706)/monitor/statistics.json'
I0307 01:20:24.975312 30430 http.cpp:916] Authorizing principal 'test-principal' to GET the '/monitor/statistics.json' endpoint
I0307 01:20:24.979990 30410 slave.cpp:808] Agent terminating
[ OK ] Endpoint/SlaveEndpointTest.AuthorizedRequest/1 (37 ms)
[ RUN ] Endpoint/SlaveEndpointTest.AuthorizedRequest/2
I0307 01:20:24.994226 30410 containerizer.cpp:221] Using isolation: posix/cpu,posix/mem,filesystem/posix,network/cni
W0307 01:20:24.994814 30410 backend.cpp:76] Failed to create 'aufs' backend: AufsBackend requires root privileges
W0307 01:20:24.994927 30410 backend.cpp:76] Failed to create 'bind' backend: BindBackend requires root privileges
I0307 01:20:24.994979 30410 provisioner.cpp:249] Using default backend 'copy'
I0307 01:20:24.998488 30435 slave.cpp:215] Mesos agent started on (707)@172.17.0.2:57074
I0307 01:20:24.998518 30435 slave.cpp:216] Flags at startup: --acls="" --appc_simple_discovery_uri_prefix="http://" --appc_store_dir="/tmp/mesos/store/appc" --authenticate_http_readonly="true" --authenticate_http_readwrite="true" --authenticatee="crammd5" --authentication_backoff_factor="1secs" --authorizer="local" --cgroups_cpu_enable_pids_and_tids_count="false" --cgroups_enable_cfs="false" --cgroups_hierarchy="/sys/fs/cgroup" --cgroups_limit_swap="false" --cgroups_root="mesos" --container_disk_watch_interval="15secs" --containerizers="mesos" --credential="/tmp/Endpoint_SlaveEndpointTest_AuthorizedRequest_2_1lrbtB/credential" --default_role="*" --disk_watch_interval="1mins" --docker="docker" --docker_kill_orphans="true" --docker_registry="https://registry-1.docker.io" --docker_remove_delay="6hrs" --docker_socket="/var/run/docker.sock" --docker_stop_timeout="0ns" --docker_store_dir="/tmp/mesos/store/docker" --docker_volume_checkpoint_dir="/var/run/mesos/isolators/docker/volume" --enforce_container_disk_quota="false" --executor_registration_timeout="1mins" --executor_shutdown_grace_period="5secs" --fetcher_cache_dir="/tmp/Endpoint_SlaveEndpointTest_AuthorizedRequest_2_1lrbtB/fetch" --fetcher_cache_size="2GB" --frameworks_home="" --gc_delay="1weeks" --gc_disk_headroom="0.1" --hadoop_home="" --help="false" --hostname_lookup="true" --http_authenticators="basic" --http_command_executor="false" --http_credentials="/tmp/Endpoint_SlaveEndpointTest_AuthorizedRequest_2_1lrbtB/http_credentials" --http_heartbeat_interval="30secs" --initialize_driver_logging="true" --isolation="posix/cpu,posix/mem" --launcher="posix" --launcher_dir="/mesos/mesos-1.3.0/_build/src" --logbufsecs="0" --logging_level="INFO" --max_completed_executors_per_framework="150" --oversubscribed_resources_interval="15secs" --perf_duration="10secs" --perf_interval="1mins" --qos_correction_interval_min="0ns" --quiet="false" --recover="reconnect" --recovery_timeout="15mins" --registration_backoff_factor="10ms" --resources="cpus:2;gpus:0;mem:1024;disk:1024;ports:[31000-32000]" --revocable_cpu_low_priority="true" --runtime_dir="/tmp/Endpoint_SlaveEndpointTest_AuthorizedRequest_2_1lrbtB" --sandbox_directory="/mnt/mesos/sandbox" --strict="true" --switch_user="true" --systemd_enable_support="true" --systemd_runtime_directory="/run/systemd/system" --version="false" --work_dir="/tmp/Endpoint_SlaveEndpointTest_AuthorizedRequest_2_10e36w"
I0307 01:20:24.999172 30435 credentials.hpp:86] Loading credential for authentication from '/tmp/Endpoint_SlaveEndpointTest_AuthorizedRequest_2_1lrbtB/credential'
I0307 01:20:24.999336 30435 slave.cpp:358] Agent using credential for: test-principal
I0307 01:20:24.999363 30435 credentials.hpp:37] Loading credentials for authentication from '/tmp/Endpoint_SlaveEndpointTest_AuthorizedRequest_2_1lrbtB/http_credentials'
I0307 01:20:24.999629 30435 http.cpp:964] Using default 'basic' HTTP authenticator for realm 'mesos-agent-readonly'
I0307 01:20:24.999768 30435 http.cpp:964] Using default 'basic' HTTP authenticator for realm 'mesos-agent-readwrite'
I0307 01:20:25.001338 30435 slave.cpp:545] Agent resources: cpus(*):2; mem(*):1024; disk(*):1024; ports(*):[31000-32000]
I0307 01:20:25.001437 30435 slave.cpp:553] Agent attributes: [ ]
I0307 01:20:25.001451 30435 slave.cpp:558] Agent hostname: 0bc3e1b5a88f
I0307 01:20:25.001644 30431 status_update_manager.cpp:177] Pausing sending status updates
I0307 01:20:25.002943 30437 state.cpp:62] Recovering state from '/tmp/Endpoint_SlaveEndpointTest_AuthorizedRequest_2_10e36w/meta'
I0307 01:20:25.003290 30437 status_update_manager.cpp:203] Recovering status update manager
I0307 01:20:25.003901 30438 containerizer.cpp:600] Recovering containerizer
I0307 01:20:25.005955 30430 provisioner.cpp:410] Provisioner recovery complete
I0307 01:20:25.006453 30442 slave.cpp:5572] Finished recovery
I0307 01:20:25.007014 30442 slave.cpp:5754] Querying resource estimator for oversubscribable resources
I0307 01:20:25.007454 30443 slave.cpp:5768] Received oversubscribable resources {} from the resource estimator
I0307 01:20:25.010160 30438 process.cpp:3705] Handling HTTP event for process 'slave(707)' with path: '/slave(707)/containers'
I0307 01:20:25.011685 30431 http.cpp:916] Authorizing principal 'test-principal' to GET the '/containers' endpoint
I0307 01:20:25.016309 30444 slave.cpp:808] Agent terminating
[ OK ] Endpoint/SlaveEndpointTest.AuthorizedRequest/2 (33 ms)
[ RUN ] Endpoint/SlaveEndpointTest.UnauthorizedRequest/0
I0307 01:20:25.027633 30410 containerizer.cpp:221] Using isolation: posix/cpu,posix/mem,filesystem/posix,network/cni
W0307 01:20:25.028210 30410 backend.cpp:76] Failed to create 'aufs' backend: AufsBackend requires root privileges
W0307 01:20:25.028321 30410 backend.cpp:76] Failed to create 'bind' backend: BindBackend requires root privileges
I0307 01:20:25.028360 30410 provisioner.cpp:249] Using default backend 'copy'
I0307 01:20:25.032553 30437 slave.cpp:215] Mesos agent started on (708)@172.17.0.2:57074
I0307 01:20:25.032583 30437 slave.cpp:216] Flags at startup: --acls="" --appc_simple_discovery_uri_prefix="http://" --appc_store_dir="/tmp/mesos/store/appc" --authenticate_http_readonly="true" --authenticate_http_readwrite="true" --authenticatee="crammd5" --authentication_backoff_factor="1secs" --authorizer="local" --cgroups_cpu_enable_pids_and_tids_count="false" --cgroups_enable_cfs="false" --cgroups_hierarchy="/sys/fs/cgroup" --cgroups_limit_swap="false" --cgroups_root="mesos" --container_disk_watch_interval="15secs" --containerizers="mesos" --credential="/tmp/Endpoint_SlaveEndpointTest_UnauthorizedRequest_0_L0d7bT/credential" --default_role="*" --disk_watch_interval="1mins" --docker="docker" --docker_kill_orphans="true" --docker_registry="https://registry-1.docker.io" --docker_remove_delay="6hrs" --docker_socket="/var/run/docker.sock" --docker_stop_timeout="0ns" --docker_store_dir="/tmp/mesos/store/docker" --docker_volume_checkpoint_dir="/var/run/mesos/isolators/docker/volume" --enforce_container_disk_quota="false" --executor_registration_timeout="1mins" --executor_shutdown_grace_period="5secs" --fetcher_cache_dir="/tmp/Endpoint_SlaveEndpointTest_UnauthorizedRequest_0_L0d7bT/fetch" --fetcher_cache_size="2GB" --frameworks_home="" --gc_delay="1weeks" --gc_disk_headroom="0.1" --hadoop_home="" --help="false" --hostname_lookup="true" --http_authenticators="basic" --http_command_executor="false" --http_credentials="/tmp/Endpoint_SlaveEndpointTest_UnauthorizedRequest_0_L0d7bT/http_credentials" --http_heartbeat_interval="30secs" --initialize_driver_logging="true" --isolation="posix/cpu,posix/mem" --launcher="posix" --launcher_dir="/mesos/mesos-1.3.0/_build/src" --logbufsecs="0" --logging_level="INFO" --max_completed_executors_per_framework="150" --oversubscribed_resources_interval="15secs" --perf_duration="10secs" --perf_interval="1mins" --qos_correction_interval_min="0ns" --quiet="false" --recover="reconnect" --recovery_timeout="15mins" --registration_backoff_factor="10ms" --resources="cpus:2;gpus:0;mem:1024;disk:1024;ports:[31000-32000]" --revocable_cpu_low_priority="true" --runtime_dir="/tmp/Endpoint_SlaveEndpointTest_UnauthorizedRequest_0_L0d7bT" --sandbox_directory="/mnt/mesos/sandbox" --strict="true" --switch_user="true" --systemd_enable_support="true" --systemd_runtime_directory="/run/systemd/system" --version="false" --work_dir="/tmp/Endpoint_SlaveEndpointTest_UnauthorizedRequest_0_3dnyKO"
I0307 01:20:25.033267 30437 credentials.hpp:86] Loading credential for authentication from '/tmp/Endpoint_SlaveEndpointTest_UnauthorizedRequest_0_L0d7bT/credential'
I0307 01:20:25.033429 30437 slave.cpp:358] Agent using credential for: test-principal
I0307 01:20:25.033457 30437 credentials.hpp:37] Loading credentials for authentication from '/tmp/Endpoint_SlaveEndpointTest_UnauthorizedRequest_0_L0d7bT/http_credentials'
I0307 01:20:25.033720 30437 http.cpp:964] Using default 'basic' HTTP authenticator for realm 'mesos-agent-readonly'
I0307 01:20:25.033910 30437 http.cpp:964] Using default 'basic' HTTP authenticator for realm 'mesos-agent-readwrite'
I0307 01:20:25.035559 30437 slave.cpp:545] Agent resources: cpus(*):2; mem(*):1024; disk(*):1024; ports(*):[31000-32000]
I0307 01:20:25.035660 30437 slave.cpp:553] Agent attributes: [ ]
I0307 01:20:25.035673 30437 slave.cpp:558] Agent hostname: 0bc3e1b5a88f
I0307 01:20:25.035856 30434 status_update_manager.cpp:177] Pausing sending status updates
I0307 01:20:25.037214 30440 state.cpp:62] Recovering state from '/tmp/Endpoint_SlaveEndpointTest_UnauthorizedRequest_0_3dnyKO/meta'
I0307 01:20:25.037613 30429 status_update_manager.cpp:203] Recovering status update manager
I0307 01:20:25.037894 30444 containerizer.cpp:600] Recovering containerizer
I0307 01:20:25.039932 30444 provisioner.cpp:410] Provisioner recovery complete
I0307 01:20:25.040447 30434 slave.cpp:5572] Finished recovery
I0307 01:20:25.041002 30434 slave.cpp:5754] Querying resource estimator for oversubscribable resources
I0307 01:20:25.041471 30433 slave.cpp:5768] Received oversubscribable resources {} from the resource estimator
I0307 01:20:25.044023 30440 process.cpp:3705] Handling HTTP event for process 'slave(708)' with path: '/slave(708)/monitor/statistics'
I0307 01:20:25.046010 30444 http.cpp:916] Authorizing principal 'test-principal' to GET the '/monitor/statistics' endpoint
I0307 01:20:25.049916 30437 slave.cpp:808] Agent terminating
[ OK ] Endpoint/SlaveEndpointTest.UnauthorizedRequest/0 (33 ms)
[ RUN ] Endpoint/SlaveEndpointTest.UnauthorizedRequest/1
I0307 01:20:25.060855 30410 containerizer.cpp:221] Using isolation: posix/cpu,posix/mem,filesystem/posix,network/cni
W0307 01:20:25.061431 30410 backend.cpp:76] Failed to create 'aufs' backend: AufsBackend requires root privileges
W0307 01:20:25.061542 30410 backend.cpp:76] Failed to create 'bind' backend: BindBackend requires root privileges
I0307 01:20:25.061614 30410 provisioner.cpp:249] Using default backend 'copy'
I0307 01:20:25.065696 30442 slave.cpp:215] Mesos agent started on (709)@172.17.0.2:57074
I0307 01:20:25.065729 30442 slave.cpp:216] Flags at startup: --acls="" --appc_simple_discovery_uri_prefix="http://" --appc_store_dir="/tmp/mesos/store/appc" --authenticate_http_readonly="true" --authenticate_http_readwrite="true" --authenticatee="crammd5" --authentication_backoff_factor="1secs" --authorizer="local" --cgroups_cpu_enable_pids_and_tids_count="false" --cgroups_enable_cfs="false" --cgroups_hierarchy="/sys/fs/cgroup" --cgroups_limit_swap="false" --cgroups_root="mesos" --container_disk_watch_interval="15secs" --containerizers="mesos" --credential="/tmp/Endpoint_SlaveEndpointTest_UnauthorizedRequest_1_rmoKgb/credential" --default_role="*" --disk_watch_interval="1mins" --docker="docker" --docker_kill_orphans="true" --docker_registry="https://registry-1.docker.io" --docker_remove_delay="6hrs" --docker_socket="/var/run/docker.sock" --docker_stop_timeout="0ns" --docker_store_dir="/tmp/mesos/store/docker" --docker_volume_checkpoint_dir="/var/run/mesos/isolators/docker/volume" --enforce_container_disk_quota="false" --executor_registration_timeout="1mins" --executor_shutdown_grace_period="5secs" --fetcher_cache_dir="/tmp/Endpoint_SlaveEndpointTest_UnauthorizedRequest_1_rmoKgb/fetch" --fetcher_cache_size="2GB" --frameworks_home="" --gc_delay="1weeks" --gc_disk_headroom="0.1" --hadoop_home="" --help="false" --hostname_lookup="true" --http_authenticators="basic" --http_command_executor="false" --http_credentials="/tmp/Endpoint_SlaveEndpointTest_UnauthorizedRequest_1_rmoKgb/http_credentials" --http_heartbeat_interval="30secs" --initialize_driver_logging="true" --isolation="posix/cpu,posix/mem" --launcher="posix" --launcher_dir="/mesos/mesos-1.3.0/_build/src" --logbufsecs="0" --logging_level="INFO" --max_completed_executors_per_framework="150" --oversubscribed_resources_interval="15secs" --perf_duration="10secs" --perf_interval="1mins" --qos_correction_interval_min="0ns" --quiet="false" --recover="reconnect" --recovery_timeout="15mins" --registration_backoff_factor="10ms" --resources="cpus:2;gpus:0;mem:1024;disk:1024;ports:[31000-32000]" --revocable_cpu_low_priority="true" --runtime_dir="/tmp/Endpoint_SlaveEndpointTest_UnauthorizedRequest_1_rmoKgb" --sandbox_directory="/mnt/mesos/sandbox" --strict="true" --switch_user="true" --systemd_enable_support="true" --systemd_runtime_directory="/run/systemd/system" --version="false" --work_dir="/tmp/Endpoint_SlaveEndpointTest_UnauthorizedRequest_1_tkdNJ6"
I0307 01:20:25.066493 30442 credentials.hpp:86] Loading credential for authentication from '/tmp/Endpoint_SlaveEndpointTest_UnauthorizedRequest_1_rmoKgb/credential'
I0307 01:20:25.066699 30442 slave.cpp:358] Agent using credential for: test-principal
I0307 01:20:25.066727 30442 credentials.hpp:37] Loading credentials for authentication from '/tmp/Endpoint_SlaveEndpointTest_UnauthorizedRequest_1_rmoKgb/http_credentials'
I0307 01:20:25.067029 30442 http.cpp:964] Using default 'basic' HTTP authenticator for realm 'mesos-agent-readonly'
I0307 01:20:25.067220 30442 http.cpp:964] Using default 'basic' HTTP authenticator for realm 'mesos-agent-readwrite'
I0307 01:20:25.068948 30442 slave.cpp:545] Agent resources: cpus(*):2; mem(*):1024; disk(*):1024; ports(*):[31000-32000]
I0307 01:20:25.069052 30442 slave.cpp:553] Agent attributes: [ ]
I0307 01:20:25.069077 30442 slave.cpp:558] Agent hostname: 0bc3e1b5a88f
I0307 01:20:25.069254 30437 status_update_manager.cpp:177] Pausing sending status updates
I0307 01:20:25.070540 30431 state.cpp:62] Recovering state from '/tmp/Endpoint_SlaveEndpointTest_UnauthorizedRequest_1_tkdNJ6/meta'
I0307 01:20:25.070935 30443 status_update_manager.cpp:203] Recovering status update manager
I0307 01:20:25.071135 30433 containerizer.cpp:600] Recovering containerizer
I0307 01:20:25.072753 30439 provisioner.cpp:410] Provisioner recovery complete
I0307 01:20:25.073201 30430 slave.cpp:5572] Finished recovery
I0307 01:20:25.073720 30430 slave.cpp:5754] Querying resource estimator for oversubscribable resources
I0307 01:20:25.074060 30436 slave.cpp:5768] Received oversubscribable resources {} from the resource estimator
I0307 01:20:25.076483 30438 process.cpp:3705] Handling HTTP event for process 'slave(709)' with path: '/slave(709)/monitor/statistics.json'
I0307 01:20:25.077880 30439 http.cpp:916] Authorizing principal 'test-principal' to GET the '/monitor/statistics.json' endpoint
I0307 01:20:25.080292 30429 slave.cpp:808] Agent terminating
[ OK ] Endpoint/SlaveEndpointTest.UnauthorizedRequest/1 (30 ms)
[ RUN ] Endpoint/SlaveEndpointTest.UnauthorizedRequest/2
I0307 01:20:25.091225 30410 containerizer.cpp:221] Using isolation: posix/cpu,posix/mem,filesystem/posix,network/cni
W0307 01:20:25.091852 30410 backend.cpp:76] Failed to create 'aufs' backend: AufsBackend requires root privileges
W0307 01:20:25.091989 30410 backend.cpp:76] Failed to create 'bind' backend: BindBackend requires root privileges
I0307 01:20:25.092036 30410 provisioner.cpp:249] Using default backend 'copy'
I0307 01:20:25.095425 30438 slave.cpp:215] Mesos agent started on (710)@172.17.0.2:57074
I0307 01:20:25.095511 30438 slave.cpp:216] Flags at startup: --acls="" --appc_simple_discovery_uri_prefix="http://" --appc_store_dir="/tmp/mesos/store/appc" --authenticate_http_readonly="true" --authenticate_http_readwrite="true" --authenticatee="crammd5" --authentication_backoff_factor="1secs" --authorizer="local" --cgroups_cpu_enable_pids_and_tids_count="false" --cgroups_enable_cfs="false" --cgroups_hierarchy="/sys/fs/cgroup" --cgroups_limit_swap="false" --cgroups_root="mesos" --container_disk_watch_interval="15secs" --containerizers="mesos" --credential="/tmp/Endpoint_SlaveEndpointTest_UnauthorizedRequest_2_FaCrFt/credential" --default_role="*" --disk_watch_interval="1mins" --docker="docker" --docker_kill_orphans="true" --docker_registry="https://registry-1.docker.io" --docker_remove_delay="6hrs" --docker_socket="/var/run/docker.sock" --docker_stop_timeout="0ns" --docker_store_dir="/tmp/mesos/store/docker" --docker_volume_checkpoint_dir="/var/run/mesos/isolators/docker/volume" --enforce_container_disk_quota="false" --executor_registration_timeout="1mins" --executor_shutdown_grace_period="5secs" --fetcher_cache_dir="/tmp/Endpoint_SlaveEndpointTest_UnauthorizedRequest_2_FaCrFt/fetch" --fetcher_cache_size="2GB" --frameworks_home="" --gc_delay="1weeks" --gc_disk_headroom="0.1" --hadoop_home="" --help="false" --hostname_lookup="true" --http_authenticators="basic" --http_command_executor="false" --http_credentials="/tmp/Endpoint_SlaveEndpointTest_UnauthorizedRequest_2_FaCrFt/http_credentials" --http_heartbeat_interval="30secs" --initialize_driver_logging="true" --isolation="posix/cpu,posix/mem" --launcher="posix" --launcher_dir="/mesos/mesos-1.3.0/_build/src" --logbufsecs="0" --logging_level="INFO" --max_completed_executors_per_framework="150" --oversubscribed_resources_interval="15secs" --perf_duration="10secs" --perf_interval="1mins" --qos_correction_interval_min="0ns" --quiet="false" --recover="reconnect" --recovery_timeout="15mins" --registration_backoff_factor="10ms" --resources="cpus:2;gpus:0;mem:1024;disk:1024;ports:[31000-32000]" --revocable_cpu_low_priority="true" --runtime_dir="/tmp/Endpoint_SlaveEndpointTest_UnauthorizedRequest_2_FaCrFt" --sandbox_directory="/mnt/mesos/sandbox" --strict="true" --switch_user="true" --systemd_enable_support="true" --systemd_runtime_directory="/run/systemd/system" --version="false" --work_dir="/tmp/Endpoint_SlaveEndpointTest_UnauthorizedRequest_2_nRpz3o"
I0307 01:20:25.096088 30438 credentials.hpp:86] Loading credential for authentication from '/tmp/Endpoint_SlaveEndpointTest_UnauthorizedRequest_2_FaCrFt/credential'
I0307 01:20:25.096240 30438 slave.cpp:358] Agent using credential for: test-principal
I0307 01:20:25.096264 30438 credentials.hpp:37] Loading credentials for authentication from '/tmp/Endpoint_SlaveEndpointTest_UnauthorizedRequest_2_FaCrFt/http_credentials'
I0307 01:20:25.096513 30438 http.cpp:964] Using default 'basic' HTTP authenticator for realm 'mesos-agent-readonly'
I0307 01:20:25.096660 30438 http.cpp:964] Using default 'basic' HTTP authenticator for realm 'mesos-agent-readwrite'
I0307 01:20:25.098106 30438 slave.cpp:545] Agent resources: cpus(*):2; mem(*):1024; disk(*):1024; ports(*):[31000-32000]
I0307 01:20:25.098199 30438 slave.cpp:553] Agent attributes: [ ]
I0307 01:20:25.098214 30438 slave.cpp:558] Agent hostname: 0bc3e1b5a88f
I0307 01:20:25.098335 30437 status_update_manager.cpp:177] Pausing sending status updates
I0307 01:20:25.099607 30439 state.cpp:62] Recovering state from '/tmp/Endpoint_SlaveEndpointTest_UnauthorizedRequest_2_nRpz3o/meta'
I0307 01:20:25.099964 30440 status_update_manager.cpp:203] Recovering status update manager
I0307 01:20:25.100183 30429 containerizer.cpp:600] Recovering containerizer
I0307 01:20:25.101729 30438 provisioner.cpp:410] Provisioner recovery complete
I0307 01:20:25.102169 30437 slave.cpp:5572] Finished recovery
I0307 01:20:25.102681 30437 slave.cpp:5754] Querying resource estimator for oversubscribable resources
I0307 01:20:25.102952 30436 slave.cpp:5768] Received oversubscribable resources {} from the resource estimator
I0307 01:20:25.105088 30431 process.cpp:3705] Handling HTTP event for process 'slave(710)' with path: '/slave(710)/containers'
I0307 01:20:25.106482 30441 http.cpp:916] Authorizing principal 'test-principal' to GET the '/containers' endpoint
I0307 01:20:25.109212 30435 slave.cpp:808] Agent terminating
[ OK ] Endpoint/SlaveEndpointTest.UnauthorizedRequest/2 (30 ms)
[ RUN ] Endpoint/SlaveEndpointTest.NoAuthorizer/0
I0307 01:20:25.121901 30410 containerizer.cpp:221] Using isolation: posix/cpu,posix/mem,filesystem/posix,network/cni
W0307 01:20:25.122478 30410 backend.cpp:76] Failed to create 'aufs' backend: AufsBackend requires root privileges
W0307 01:20:25.122591 30410 backend.cpp:76] Failed to create 'bind' backend: BindBackend requires root privileges
I0307 01:20:25.122633 30410 provisioner.cpp:249] Using default backend 'copy'
I0307 01:20:25.124770 30410 cluster.cpp:446] Creating default 'local' authorizer
I0307 01:20:25.126619 30440 slave.cpp:215] Mesos agent started on (711)@172.17.0.2:57074
I0307 01:20:25.126641 30440 slave.cpp:216] Flags at startup: --acls="" --appc_simple_discovery_uri_prefix="http://" --appc_store_dir="/tmp/mesos/store/appc" --authenticate_http_readonly="true" --authenticate_http_readwrite="true" --authenticatee="crammd5" --authentication_backoff_factor="1secs" --authorizer="local" --cgroups_cpu_enable_pids_and_tids_count="false" --cgroups_enable_cfs="false" --cgroups_hierarchy="/sys/fs/cgroup" --cgroups_limit_swap="false" --cgroups_root="mesos" --container_disk_watch_interval="15secs" --containerizers="mesos" --credential="/tmp/Endpoint_SlaveEndpointTest_NoAuthorizer_0_PYEFnM/credential" --default_role="*" --disk_watch_interval="1mins" --docker="docker" --docker_kill_orphans="true" --docker_registry="https://registry-1.docker.io" --docker_remove_delay="6hrs" --docker_socket="/var/run/docker.sock" --docker_stop_timeout="0ns" --docker_store_dir="/tmp/mesos/store/docker" --docker_volume_checkpoint_dir="/var/run/mesos/isolators/docker/volume" --enforce_container_disk_quota="false" --executor_registration_timeout="1mins" --executor_shutdown_grace_period="5secs" --fetcher_cache_dir="/tmp/Endpoint_SlaveEndpointTest_NoAuthorizer_0_PYEFnM/fetch" --fetcher_cache_size="2GB" --frameworks_home="" --gc_delay="1weeks" --gc_disk_headroom="0.1" --hadoop_home="" --help="false" --hostname_lookup="true" --http_authenticators="basic" --http_command_executor="false" --http_credentials="/tmp/Endpoint_SlaveEndpointTest_NoAuthorizer_0_PYEFnM/http_credentials" --http_heartbeat_interval="30secs" --initialize_driver_logging="true" --isolation="posix/cpu,posix/mem" --launcher="posix" --launcher_dir="/mesos/mesos-1.3.0/_build/src" --logbufsecs="0" --logging_level="INFO" --max_completed_executors_per_framework="150" --oversubscribed_resources_interval="15secs" --perf_duration="10secs" --perf_interval="1mins" --qos_correction_interval_min="0ns" --quiet="false" --recover="reconnect" --recovery_timeout="15mins" --registration_backoff_factor="10ms" --resources="cpus:2;gpus:0;mem:1024;disk:1024;ports:[31000-32000]" --revocable_cpu_low_priority="true" --runtime_dir="/tmp/Endpoint_SlaveEndpointTest_NoAuthorizer_0_PYEFnM" --sandbox_directory="/mnt/mesos/sandbox" --strict="true" --switch_user="true" --systemd_enable_support="true" --systemd_runtime_directory="/run/systemd/system" --version="false" --work_dir="/tmp/Endpoint_SlaveEndpointTest_NoAuthorizer_0_5nyRGH"
I0307 01:20:25.127254 30440 credentials.hpp:86] Loading credential for authentication from '/tmp/Endpoint_SlaveEndpointTest_NoAuthorizer_0_PYEFnM/credential'
I0307 01:20:25.127414 30440 slave.cpp:358] Agent using credential for: test-principal
I0307 01:20:25.127440 30440 credentials.hpp:37] Loading credentials for authentication from '/tmp/Endpoint_SlaveEndpointTest_NoAuthorizer_0_PYEFnM/http_credentials'
I0307 01:20:25.127713 30440 http.cpp:964] Using default 'basic' HTTP authenticator for realm 'mesos-agent-readonly'
I0307 01:20:25.127877 30440 http.cpp:964] Using default 'basic' HTTP authenticator for realm 'mesos-agent-readwrite'
I0307 01:20:25.129292 30440 slave.cpp:545] Agent resources: cpus(*):2; mem(*):1024; disk(*):1024; ports(*):[31000-32000]
I0307 01:20:25.129386 30440 slave.cpp:553] Agent attributes: [ ]
I0307 01:20:25.129403 30440 slave.cpp:558] Agent hostname: 0bc3e1b5a88f
I0307 01:20:25.129534 30433 status_update_manager.cpp:177] Pausing sending status updates
I0307 01:20:25.131012 30433 state.cpp:62] Recovering state from '/tmp/Endpoint_SlaveEndpointTest_NoAuthorizer_0_5nyRGH/meta'
I0307 01:20:25.131299 30430 status_update_manager.cpp:203] Recovering status update manager
I0307 01:20:25.131603 30439 containerizer.cpp:600] Recovering containerizer
I0307 01:20:25.133244 30444 provisioner.cpp:410] Provisioner recovery complete
I0307 01:20:25.133877 30436 slave.cpp:5572] Finished recovery
I0307 01:20:25.134424 30436 slave.cpp:5754] Querying resource estimator for oversubscribable resources
I0307 01:20:25.134732 30440 slave.cpp:5768] Received oversubscribable resources {} from the resource estimator
I0307 01:20:25.137136 30431 process.cpp:3705] Handling HTTP event for process 'slave(711)' with path: '/slave(711)/monitor/statistics'
I0307 01:20:25.138609 30443 http.cpp:916] Authorizing principal 'test-principal' to GET the '/monitor/statistics' endpoint
I0307 01:20:25.143398 30435 slave.cpp:808] Agent terminating
[ OK ] Endpoint/SlaveEndpointTest.NoAuthorizer/0 (34 ms)
[ RUN ] Endpoint/SlaveEndpointTest.NoAuthorizer/1
I0307 01:20:25.156396 30410 containerizer.cpp:221] Using isolation: posix/cpu,posix/mem,filesystem/posix,network/cni
W0307 01:20:25.156970 30410 backend.cpp:76] Failed to create 'aufs' backend: AufsBackend requires root privileges
W0307 01:20:25.157085 30410 backend.cpp:76] Failed to create 'bind' backend: BindBackend requires root privileges
I0307 01:20:25.157132 30410 provisioner.cpp:249] Using default backend 'copy'
I0307 01:20:25.159474 30410 cluster.cpp:446] Creating default 'local' authorizer
I0307 01:20:25.161559 30439 slave.cpp:215] Mesos agent started on (712)@172.17.0.2:57074
I0307 01:20:25.161588 30439 slave.cpp:216] Flags at startup: --acls="" --appc_simple_discovery_uri_prefix="http://" --appc_store_dir="/tmp/mesos/store/appc" --authenticate_http_readonly="true" --authenticate_http_readwrite="true" --authenticatee="crammd5" --authentication_backoff_factor="1secs" --authorizer="local" --cgroups_cpu_enable_pids_and_tids_count="false" --cgroups_enable_cfs="false" --cgroups_hierarchy="/sys/fs/cgroup" --cgroups_limit_swap="false" --cgroups_root="mesos" --container_disk_watch_interval="15secs" --containerizers="mesos" --credential="/tmp/Endpoint_SlaveEndpointTest_NoAuthorizer_1_14FRr5/credential" --default_role="*" --disk_watch_interval="1mins" --docker="docker" --docker_kill_orphans="true" --docker_registry="https://registry-1.docker.io" --docker_remove_delay="6hrs" --docker_socket="/var/run/docker.sock" --docker_stop_timeout="0ns" --docker_store_dir="/tmp/mesos/store/docker" --docker_volume_checkpoint_dir="/var/run/mesos/isolators/docker/volume" --enforce_container_disk_quota="false" --executor_registration_timeout="1mins" --executor_shutdown_grace_period="5secs" --fetcher_cache_dir="/tmp/Endpoint_SlaveEndpointTest_NoAuthorizer_1_14FRr5/fetch" --fetcher_cache_size="2GB" --frameworks_home="" --gc_delay="1weeks" --gc_disk_headroom="0.1" --hadoop_home="" --help="false" --hostname_lookup="true" --http_authenticators="basic" --http_command_executor="false" --http_credentials="/tmp/Endpoint_SlaveEndpointTest_NoAuthorizer_1_14FRr5/http_credentials" --http_heartbeat_interval="30secs" --initialize_driver_logging="true" --isolation="posix/cpu,posix/mem" --launcher="posix" --launcher_dir="/mesos/mesos-1.3.0/_build/src" --logbufsecs="0" --logging_level="INFO" --max_completed_executors_per_framework="150" --oversubscribed_resources_interval="15secs" --perf_duration="10secs" --perf_interval="1mins" --qos_correction_interval_min="0ns" --quiet="false" --recover="reconnect" --recovery_timeout="15mins" --registration_backoff_factor="10ms" --resources="cpus:2;gpus:0;mem:1024;disk:1024;ports:[31000-32000]" --revocable_cpu_low_priority="true" --runtime_dir="/tmp/Endpoint_SlaveEndpointTest_NoAuthorizer_1_14FRr5" --sandbox_directory="/mnt/mesos/sandbox" --strict="true" --switch_user="true" --systemd_enable_support="true" --systemd_runtime_directory="/run/systemd/system" --version="false" --work_dir="/tmp/Endpoint_SlaveEndpointTest_NoAuthorizer_1_JD0rF0"
I0307 01:20:25.162278 30439 credentials.hpp:86] Loading credential for authentication from '/tmp/Endpoint_SlaveEndpointTest_NoAuthorizer_1_14FRr5/credential'
I0307 01:20:25.162442 30439 slave.cpp:358] Agent using credential for: test-principal
I0307 01:20:25.162468 30439 credentials.hpp:37] Loading credentials for authentication from '/tmp/Endpoint_SlaveEndpointTest_NoAuthorizer_1_14FRr5/http_credentials'
I0307 01:20:25.162734 30439 http.cpp:964] Using default 'basic' HTTP authenticator for realm 'mesos-agent-readonly'
I0307 01:20:25.162870 30439 http.cpp:964] Using default 'basic' HTTP authenticator for realm 'mesos-agent-readwrite'
I0307 01:20:25.164585 30439 slave.cpp:545] Agent resources: cpus(*):2; mem(*):1024; disk(*):1024; ports(*):[31000-32000]
I0307 01:20:25.164685 30439 slave.cpp:553] Agent attributes: [ ]
I0307 01:20:25.164697 30439 slave.cpp:558] Agent hostname: 0bc3e1b5a88f
I0307 01:20:25.164858 30435 status_update_manager.cpp:177] Pausing sending status updates
I0307 01:20:25.166237 30432 state.cpp:62] Recovering state from '/tmp/Endpoint_SlaveEndpointTest_NoAuthorizer_1_JD0rF0/meta'
I0307 01:20:25.166591 30441 status_update_manager.cpp:203] Recovering status update manager
I0307 01:20:25.166851 30444 containerizer.cpp:600] Recovering containerizer
I0307 01:20:25.168458 30441 provisioner.cpp:410] Provisioner recovery complete
I0307 01:20:25.168931 30431 slave.cpp:5572] Finished recovery
I0307 01:20:25.169471 30431 slave.cpp:5754] Querying resource estimator for oversubscribable resources
I0307 01:20:25.169783 30443 slave.cpp:5768] Received oversubscribable resources {} from the resource estimator
I0307 01:20:25.171905 30437 process.cpp:3705] Handling HTTP event for process 'slave(712)' with path: '/slave(712)/monitor/statistics.json'
I0307 01:20:25.173322 30437 http.cpp:916] Authorizing principal 'test-principal' to GET the '/monitor/statistics.json' endpoint
I0307 01:20:25.176779 30436 slave.cpp:808] Agent terminating
[ OK ] Endpoint/SlaveEndpointTest.NoAuthorizer/1 (31 ms)
[ RUN ] Endpoint/SlaveEndpointTest.NoAuthorizer/2
I0307 01:20:25.188040 30410 containerizer.cpp:221] Using isolation: posix/cpu,posix/mem,filesystem/posix,network/cni
W0307 01:20:25.188612 30410 backend.cpp:76] Failed to create 'aufs' backend: AufsBackend requires root privileges
W0307 01:20:25.188722 30410 backend.cpp:76] Failed to create 'bind' backend: BindBackend requires root privileges
I0307 01:20:25.188761 30410 provisioner.cpp:249] Using default backend 'copy'
I0307 01:20:25.190537 30410 cluster.cpp:446] Creating default 'local' authorizer
I0307 01:20:25.192343 30431 slave.cpp:215] Mesos agent started on (713)@172.17.0.2:57074
I0307 01:20:25.192376 30431 slave.cpp:216] Flags at startup: --acls="" --appc_simple_discovery_uri_prefix="http://" --appc_store_dir="/tmp/mesos/store/appc" --authenticate_http_readonly="true" --authenticate_http_readwrite="true" --authenticatee="crammd5" --authentication_backoff_factor="1secs" --authorizer="local" --cgroups_cpu_enable_pids_and_tids_count="false" --cgroups_enable_cfs="false" --cgroups_hierarchy="/sys/fs/cgroup" --cgroups_limit_swap="false" --cgroups_root="mesos" --container_disk_watch_interval="15secs" --containerizers="mesos" --credential="/tmp/Endpoint_SlaveEndpointTest_NoAuthorizer_2_pDLdRo/credential" --default_role="*" --disk_watch_interval="1mins" --docker="docker" --docker_kill_orphans="true" --docker_registry="https://registry-1.docker.io" --docker_remove_delay="6hrs" --docker_socket="/var/run/docker.sock" --docker_stop_timeout="0ns" --docker_store_dir="/tmp/mesos/store/docker" --docker_volume_checkpoint_dir="/var/run/mesos/isolators/docker/volume" --enforce_container_disk_quota="false" --executor_registration_timeout="1mins" --executor_shutdown_grace_period="5secs" --fetcher_cache_dir="/tmp/Endpoint_SlaveEndpointTest_NoAuthorizer_2_pDLdRo/fetch" --fetcher_cache_size="2GB" --frameworks_home="" --gc_delay="1weeks" --gc_disk_headroom="0.1" --hadoop_home="" --help="false" --hostname_lookup="true" --http_authenticators="basic" --http_command_executor="false" --http_credentials="/tmp/Endpoint_SlaveEndpointTest_NoAuthorizer_2_pDLdRo/http_credentials" --http_heartbeat_interval="30secs" --initialize_driver_logging="true" --isolation="posix/cpu,posix/mem" --launcher="posix" --launcher_dir="/mesos/mesos-1.3.0/_build/src" --logbufsecs="0" --logging_level="INFO" --max_completed_executors_per_framework="150" --oversubscribed_resources_interval="15secs" --perf_duration="10secs" --perf_interval="1mins" --qos_correction_interval_min="0ns" --quiet="false" --recover="reconnect" --recovery_timeout="15mins" --registration_backoff_factor="10ms" --resources="cpus:2;gpus:0;mem:1024;disk:1024;ports:[31000-32000]" --revocable_cpu_low_priority="true" --runtime_dir="/tmp/Endpoint_SlaveEndpointTest_NoAuthorizer_2_pDLdRo" --sandbox_directory="/mnt/mesos/sandbox" --strict="true" --switch_user="true" --systemd_enable_support="true" --systemd_runtime_directory="/run/systemd/system" --version="false" --work_dir="/tmp/Endpoint_SlaveEndpointTest_NoAuthorizer_2_r7IEZj"
I0307 01:20:25.193177 30431 credentials.hpp:86] Loading credential for authentication from '/tmp/Endpoint_SlaveEndpointTest_NoAuthorizer_2_pDLdRo/credential'
I0307 01:20:25.193387 30431 slave.cpp:358] Agent using credential for: test-principal
I0307 01:20:25.193421 30431 credentials.hpp:37] Loading credentials for authentication from '/tmp/Endpoint_SlaveEndpointTest_NoAuthorizer_2_pDLdRo/http_credentials'
I0307 01:20:25.193877 30431 http.cpp:964] Using default 'basic' HTTP authenticator for realm 'mesos-agent-readonly'
I0307 01:20:25.194038 30431 http.cpp:964] Using default 'basic' HTTP authenticator for realm 'mesos-agent-readwrite'
I0307 01:20:25.195237 30431 slave.cpp:545] Agent resources: cpus(*):2; mem(*):1024; disk(*):1024; ports(*):[31000-32000]
I0307 01:20:25.195313 30431 slave.cpp:553] Agent attributes: [ ]
I0307 01:20:25.195323 30431 slave.cpp:558] Agent hostname: 0bc3e1b5a88f
I0307 01:20:25.195523 30440 status_update_manager.cpp:177] Pausing sending status updates
I0307 01:20:25.196876 30430 state.cpp:62] Recovering state from '/tmp/Endpoint_SlaveEndpointTest_NoAuthorizer_2_r7IEZj/meta'
I0307 01:20:25.197213 30435 status_update_manager.cpp:203] Recovering status update manager
I0307 01:20:25.197480 30429 containerizer.cpp:600] Recovering containerizer
I0307 01:20:25.198772 30431 provisioner.cpp:410] Provisioner recovery complete
I0307 01:20:25.199231 30438 slave.cpp:5572] Finished recovery
I0307 01:20:25.199653 30438 slave.cpp:5754] Querying resource estimator for oversubscribable resources
I0307 01:20:25.199906 30442 slave.cpp:5768] Received oversubscribable resources {} from the resource estimator
I0307 01:20:25.202283 30435 process.cpp:3705] Handling HTTP event for process 'slave(713)' with path: '/slave(713)/containers'
I0307 01:20:25.203505 30434 http.cpp:916] Authorizing principal 'test-principal' to GET the '/containers' endpoint
I0307 01:20:25.206867 30429 slave.cpp:808] Agent terminating
[ OK ] Endpoint/SlaveEndpointTest.NoAuthorizer/2 (29 ms)
[----------] 9 tests from Endpoint/SlaveEndpointTest (296 ms total)
[----------] Global test environment tear-down
[==========] 1514 tests from 169 test cases ran. (503914 ms total)
[ PASSED ] 1512 tests.
[ FAILED ] 2 tests, listed below:
[ FAILED ] MasterTest.TaskRunning
[ FAILED ] PersistentVolumeEndpointsTest.EndpointCreateThenOfferRemove
2 FAILED TESTS
YOU HAVE 12 DISABLED TESTS
make[4]: *** [check-local] Error 1
make[4]: Leaving directory `/mesos/mesos-1.3.0/_build/src'
make[3]: *** [check-am] Error 2
make[3]: Leaving directory `/mesos/mesos-1.3.0/_build/src'
make[2]: *** [check] Error 2
make[2]: Leaving directory `/mesos/mesos-1.3.0/_build/src'
make[1]: *** [check-recursive] Error 1
make[1]: Leaving directory `/mesos/mesos-1.3.0/_build'
make: *** [distcheck] Error 1
+ docker rmi mesos-1488846674-20081
Untagged: mesos-1488846674-20081:latest
Deleted: sha256:dd02fcd5eafa9573838184b78fa14eeef80446a7e50649ce4b8e6d9d41fcdc5b
Deleted: sha256:c371654615c188a865704434bae799dbd7fa44b5712b34e624788e420a69bbec
Deleted: sha256:2f14db44a968caa0d7522f14d5ec3a3b48d5d023814b2414fcc7880ad39223eb
Deleted: sha256:9065c6c321c446052b580afde61a4a27bdf84aad3e4a1e42b9fa6b630151fd53
Deleted: sha256:ddc5af54f1fec41e27a062685c95ed8fe2fd3572d247fa8e52cdd6a3ab464cd4
Deleted: sha256:74085f5d06327cf758df3eef128b3eeb6f70703d58c23f6277a28e4dd0224dcb
Deleted: sha256:ed76c8f4f6bc2ad4b5aa7448ca22b2617c32e87fc9e6e988068f55cad67ff7a8
Deleted: sha256:59d063c6d45f3e4f0aa73966cbe6017abd7587f001dc96b4d6f8ae5b0bbed2c5
Deleted: sha256:430b7060fe460a9e7bcba2a914d425efa40603262e541c5934a6b5b0d6b0ad30
Deleted: sha256:10c23f43f0a30e4176185d4ccf2b624fad448c95e93cf64469b178978d696cf9
Deleted: sha256:9ab0b51f3a854b0fb0c1026d57942959498561942fdb2170a17e90379e823f94
Deleted: sha256:46227372c618c8ad6d539fbebfc2d493aa8e0f89ac68e0bd87bc37cefc653a4a
Deleted: sha256:5a34d302e138a4a8e79adb813cbe3d39d2440e86755eada7ced30c9f5bb3add2
Deleted: sha256:e4dc3c6148e385db8c66b61d27a8c2fc001e5b07874f1a6ea6dbb3178a2ace1b
Deleted: sha256:eb9ca27544a5e8f0ef5e9e483f5a79319c60f6ef3e0f48a6d84a66af82cdc4a0
Deleted: sha256:84803b8638e03e188268ed7f658daf5ec3c71fc5c7136e6b3e1eb385e089943b
Deleted: sha256:f6ddd85de9ac7371a15cf39f610dc80f937f10d22bb498fff8a49743158b6952
Deleted: sha256:b96eb2d0963ab7b39ef914863648e7fcbf5d17ac37df9a1b6f31bfb5402cd104
Deleted: sha256:fd20640285b8235623dc7534acbb1e70905ad981883d3e97f79649b14ee5abb6
Deleted: sha256:a6d0fc03cb6fc50842c705acd7adb3d1e9bd2ed1c5dfb0c877a89f53e61ed045
Deleted: sha256:c92e6812dcc5709d1ec0169c4bdec68dac7aad2659a72f80bca1c156bc108caf
Deleted: sha256:9dabf8c9e5351686eeee75edfe63fd6c6898f75e4b94461577153069c4553fa8
Deleted: sha256:b9b9f12342af1075c955fdb578d5cb44ed2a863d091e055b05be5c85866408bb
Deleted: sha256:e4bb329784290ffc0385f489eef330c4548520e6892b49f0be6420ac673a82f0
Build step 'Execute shell' marked build as failure
Jenkins build is back to normal : Mesos-Reviewbot #17331
Posted by Apache Jenkins Server <je...@builds.apache.org>.
See <https://builds.apache.org/job/Mesos-Reviewbot/17331/display/redirect?page=changes>