You are viewing a plain text version of this content. The canonical link for it is here.
Posted to commits@tamaya.apache.org by Apache Jenkins Server <je...@builds.apache.org> on 2016/05/24 14:26:19 UTC
Build failed in Jenkins: Tamaya-Site-Master #5
See <https://builds.apache.org/job/Tamaya-Site-Master/5/>
------------------------------------------
[...truncated 5866 lines...]
at org.apache.maven.DefaultMaven.execute(DefaultMaven.java:106)
at org.jvnet.hudson.maven3.launcher.Maven32Launcher.main(Maven32Launcher.java:132)
at sun.reflect.NativeMethodAccessorImpl.invoke0(Native Method)
at sun.reflect.NativeMethodAccessorImpl.invoke(NativeMethodAccessorImpl.java:57)
at sun.reflect.DelegatingMethodAccessorImpl.invoke(DelegatingMethodAccessorImpl.java:43)
at java.lang.reflect.Method.invoke(Method.java:606)
at org.codehaus.plexus.classworlds.launcher.Launcher.launchStandard(Launcher.java:330)
at org.codehaus.plexus.classworlds.launcher.Launcher.launch(Launcher.java:238)
at jenkins.maven3.agent.Maven32Main.launch(Maven32Main.java:186)
at sun.reflect.NativeMethodAccessorImpl.invoke0(Native Method)
at sun.reflect.NativeMethodAccessorImpl.invoke(NativeMethodAccessorImpl.java:57)
at sun.reflect.DelegatingMethodAccessorImpl.invoke(DelegatingMethodAccessorImpl.java:43)
at java.lang.reflect.Method.invoke(Method.java:606)
at hudson.maven.Maven3Builder.call(Maven3Builder.java:136)
at hudson.maven.Maven3Builder.call(Maven3Builder.java:71)
at hudson.remoting.UserRequest.perform(UserRequest.java:120)
at hudson.remoting.UserRequest.perform(UserRequest.java:48)
at hudson.remoting.Request$2.run(Request.java:326)
at hudson.remoting.InterceptingExecutorService$1.call(InterceptingExecutorService.java:68)
at java.util.concurrent.FutureTask.run(FutureTask.java:262)
at java.util.concurrent.ThreadPoolExecutor.runWorker(ThreadPoolExecutor.java:1145)
at java.util.concurrent.ThreadPoolExecutor$Worker.run(ThreadPoolExecutor.java:615)
at java.lang.Thread.run(Thread.java:745)
[INFO] Generating "JIRA Report" report --- maven-changes-plugin:2.9:jira-report
[INFO] Falling back to RSS for issue download: This JIRA server does not support version 2 of the REST API, which maven-changes-plugin requires.
[INFO] Downloading from JIRA at: http://issues.apache.org/jira/sr/jira.issueviews:searchrequest-xml/temp/SearchRequest.xml?tempMax=200&reset=true&jqlQuery=project+%3D+TAMAYA+AND+fixVersion+%3D+%220.3-incubating%22+AND+status+in+%28Closed%2C+Resolved%29+AND+resolution+in+%28Fixed%29+ORDER+BY+type+ASC
[INFO] The JIRA version is '6.3.4'
[INFO] The JIRA Report will contain issues only for the current version.
[INFO] Generating "Rat Report" report --- apache-rat-plugin:0.11:rat
[INFO] 57 implicit excludes (use -debug for more details).
[INFO] Exclude: DEPENDENCIES
[INFO] 233 resources included (use -debug for more details)
Warning: org.apache.xerces.jaxp.SAXParserImpl$JAXPSAXParser: Property 'http://www.oracle.com/xml/jaxp/properties/entityExpansionLimit' is not recognized.
Compiler warnings:
WARNING: 'org.apache.xerces.jaxp.SAXParserImpl: Property 'http://javax.xml.XMLConstants/property/accessExternalDTD' is not recognized.'
[FINDBUGS] No report found for mojo site
[JENKINS] Archiving site from <https://builds.apache.org/job/Tamaya-Site-Master/ws/target/site> to /x1/jenkins/jenkins-home/jobs/Tamaya-Site-Master/site
[INFO]
[INFO] ------------------------------------------------------------------------
[INFO] Building Apache Tamaya Build Configuration 0.3-incubating-SNAPSHOT
[INFO] ------------------------------------------------------------------------
[INFO]
[INFO] --- maven-clean-plugin:3.0.0:clean (default-clean) @ buildconfigurations ---
[INFO] Deleting <https://builds.apache.org/job/Tamaya-Site-Master/ws/buildconfigurations/target>
[INFO]
[INFO] --- maven-site-plugin:3.4:site (default-cli) @ buildconfigurations ---
[INFO] configuring report plugin org.apache.maven.plugins:maven-project-info-reports-plugin:2.9
[INFO] configuring report plugin org.apache.maven.plugins:maven-javadoc-plugin:2.9.1
[INFO] preparing 'javadoc' report requires 'generate-sources' forked phase execution
[INFO]
[INFO] >>> maven-javadoc-plugin:2.9.1:javadoc > generate-sources @ buildconfigurations >>>
[INFO]
[INFO] --- maven-enforcer-plugin:1.4:enforce (enforce-versions) @ buildconfigurations ---
[INFO]
[INFO] --- apache-rat-plugin:0.11:check (default) @ buildconfigurations ---
[INFO] 51 implicit excludes (use -debug for more details).
[INFO] Exclude: **/*banner.txt
[INFO] Exclude: banner.txt
[INFO] Exclude: .git
[INFO] Exclude: derby.log
[INFO] Exclude: **/bootstrap-*
[INFO] Exclude: **/js/jquery-*
[INFO] Exclude: **/*.json
[INFO] Exclude: **/*.md
[INFO] Exclude: **/*.md.vm
[INFO] Exclude: src/site/asciidoc/temp-properties-files-for-site/attributes.adoc
[INFO] 3 resources included (use -debug for more details)
[INFO] Rat check: Summary of files. Unapproved: 0 unknown: 0 generated: 0 approved: 3 licence.
[INFO]
[INFO] <<< maven-javadoc-plugin:2.9.1:javadoc < generate-sources @ buildconfigurations <<<
[INFO] configuring report plugin org.apache.rat:apache-rat-plugin:0.11
[INFO] configuring report plugin org.codehaus.mojo:findbugs-maven-plugin:3.0.1
[INFO] Parent project loaded from repository: org.apache:apache:pom:18
[INFO] Relativizing decoration links with respect to project URL: http://tamaya.incubator.apache.org/buildconfigurations
[INFO] Rendering site with lt.velykis.maven.skins:reflow-maven-skin:jar:1.1.1 skin.
[INFO] Generating "About" report --- maven-project-info-reports-plugin:2.9:index
[INFO] Generating "Team" report --- maven-project-info-reports-plugin:2.9:project-team
[INFO] Generating "Licenses" report --- maven-project-info-reports-plugin:2.9:license
[INFO] Generating "Mailing Lists" report --- maven-project-info-reports-plugin:2.9:mailing-list
[INFO] Generating "Issue Management" report --- maven-project-info-reports-plugin:2.9:issue-tracking
[INFO] Generating "Source Code Management" report --- maven-project-info-reports-plugin:2.9:scm
[INFO] Generating "Rat Report" report --- apache-rat-plugin:0.11:rat
[INFO] 51 implicit excludes (use -debug for more details).
[INFO] Exclude: DEPENDENCIES
[INFO] 3 resources included (use -debug for more details)
Warning: org.apache.xerces.jaxp.SAXParserImpl$JAXPSAXParser: Property 'http://www.oracle.com/xml/jaxp/properties/entityExpansionLimit' is not recognized.
Compiler warnings:
WARNING: 'org.apache.xerces.jaxp.SAXParserImpl: Property 'http://javax.xml.XMLConstants/property/accessExternalDTD' is not recognized.'
[FINDBUGS] No report found for mojo site
[JENKINS] Archiving site from <https://builds.apache.org/job/Tamaya-Site-Master/ws/buildconfigurations/target/site> to /x1/jenkins/jenkins-home/jobs/Tamaya-Site-Master/site/buildconfigurations
[INFO]
[INFO] ------------------------------------------------------------------------
[INFO] Building Apache Tamaya Code - all 0.3-incubating-SNAPSHOT
[INFO] ------------------------------------------------------------------------
[INFO]
[INFO] --- maven-clean-plugin:3.0.0:clean (default-clean) @ tamaya-code ---
[INFO] Deleting <https://builds.apache.org/job/Tamaya-Site-Master/ws/code/target>
[INFO]
[INFO] --- maven-site-plugin:3.4:site (default-cli) @ tamaya-code ---
[INFO] configuring report plugin org.apache.maven.plugins:maven-project-info-reports-plugin:2.9
[INFO] configuring report plugin org.apache.maven.plugins:maven-javadoc-plugin:2.9.1
[INFO] preparing 'javadoc' report requires 'generate-sources' forked phase execution
[INFO]
[INFO] >>> maven-javadoc-plugin:2.9.1:javadoc > generate-sources @ tamaya-code >>>
[INFO]
[INFO] --- maven-enforcer-plugin:1.4:enforce (enforce-versions) @ tamaya-code ---
[INFO]
[INFO] --- apache-rat-plugin:0.11:check (default) @ tamaya-code ---
[INFO] 53 implicit excludes (use -debug for more details).
[INFO] Exclude: **/*banner.txt
[INFO] Exclude: banner.txt
[INFO] Exclude: .git
[INFO] Exclude: derby.log
[INFO] Exclude: **/bootstrap-*
[INFO] Exclude: **/js/jquery-*
[INFO] Exclude: **/*.json
[INFO] Exclude: **/*.md
[INFO] Exclude: **/*.md.vm
[INFO] Exclude: src/site/asciidoc/temp-properties-files-for-site/attributes.adoc
[INFO] 1 resources included (use -debug for more details)
[INFO] Rat check: Summary of files. Unapproved: 0 unknown: 0 generated: 0 approved: 1 licence.
[INFO]
[INFO] <<< maven-javadoc-plugin:2.9.1:javadoc < generate-sources @ tamaya-code <<<
[INFO] configuring report plugin org.apache.rat:apache-rat-plugin:0.11
[INFO] configuring report plugin org.codehaus.mojo:findbugs-maven-plugin:3.0.1
[INFO] Downloading: http://nexus.codehaus.org/snapshots/org/apache/tamaya/buildconfigurations/0.3-incubating-SNAPSHOT/maven-metadata.xml
[WARNING] Could not transfer metadata org.apache.tamaya:buildconfigurations:0.3-incubating-SNAPSHOT/maven-metadata.xml from/to codehaus-snapshots (http://nexus.codehaus.org/snapshots/): nexus.codehaus.org: Name or service not known
[WARNING] Failure to transfer org.apache.tamaya:buildconfigurations:0.3-incubating-SNAPSHOT/maven-metadata.xml from http://nexus.codehaus.org/snapshots/ was cached in the local repository, resolution will not be reattempted until the update interval of codehaus-snapshots has elapsed or updates are forced. Original error: Could not transfer metadata org.apache.tamaya:buildconfigurations:0.3-incubating-SNAPSHOT/maven-metadata.xml from/to codehaus-snapshots (http://nexus.codehaus.org/snapshots/): nexus.codehaus.org: Name or service not known
[INFO] Downloading: http://nexus.codehaus.org/snapshots/org/apache/tamaya/buildconfigurations/0.3-incubating-SNAPSHOT/buildconfigurations-0.3-incubating-SNAPSHOT.jar
[FINDBUGS] No report found for mojo site
[INFO] ------------------------------------------------------------------------
[INFO] Reactor Summary:
[INFO]
[INFO] Apache Tamaya ...................................... SUCCESS [03:32 min]
[INFO] Apache Tamaya Build Configuration .................. SUCCESS [ 4.064 s]
[INFO] Apache Tamaya Code - all ........................... FAILURE [ 2.358 s]
[INFO] Apache Tamaya API .................................. SKIPPED
[INFO] Apache Tamaya Core Implementation .................. SKIPPED
[INFO] Apache Tamaya Extension Modules - all .............. SKIPPED
[INFO] Apache Tamaya Modules - Resource Services .......... SKIPPED
[INFO] Apache Tamaya Modules - Formats .................... SKIPPED
[INFO] Apache Tamaya Modules - Common Support Classes ..... SKIPPED
[INFO] Apache Tamaya Modules - JSON Support ............... SKIPPED
[INFO] Apache Tamaya Modules - Builder .................... SKIPPED
[INFO] Apache Tamaya Modules - Classloader Support ........ SKIPPED
[INFO] Apache Tamaya Modules - Collections Support ........ SKIPPED
[INFO] Apache Tamaya Modules - Common Functional Extensions SKIPPED
[INFO] Apache Tamaya Modules - UI ......................... SKIPPED
[INFO] Apache Tamaya Modules - Event and dynamic Update Extensions SKIPPED
[INFO] Apache Tamaya Modules - Adaptive Configuration Filtering SKIPPED
[INFO] Apache Tamaya Modules - Injection Support API ...... SKIPPED
[INFO] Apache Tamaya Modules - Resolver Services .......... SKIPPED
[INFO] Apache Tamaya Modules - Injection Support .......... SKIPPED
[INFO] Apache Tamaya Integration - all .................... SKIPPED
[INFO] Apache Tamaya Integration - Spring ................. SKIPPED
[INFO] Apache Tamaya Integration - CDI (Using SE Injection) SKIPPED
[INFO] Apache Tamaya Integration - CDI (Java EE) .......... SKIPPED
[INFO] Apache Tamaya Integration - OSGi Services :: Tamaya Config SKIPPED
[INFO] Apache Tamaya Integration - Apache Camel ........... SKIPPED
[INFO] Apache Tamaya Modules - Mutable Configuration Support SKIPPED
[INFO] Apache Tamaya Integration - etcd ................... SKIPPED
[INFO] Apache Tamaya Integration - consul ................. SKIPPED
[INFO] Apache Tamaya Modules - Java Management Extensions . SKIPPED
[INFO] Apache Tamaya Modules - Configuration Model Infrastructure SKIPPED
[INFO] Apache Tamaya Modules - Optional Configuration Backend SKIPPED
[INFO] Apache Tamaya Modules - YAML Support ............... SKIPPED
[INFO] Apache Tamaya Integration - Karaf Features ......... SKIPPED
[INFO] Apache Tamaya Modules - Server Extension ........... SKIPPED
[INFO] Apache Tamaya Documentation ........................ SKIPPED
[INFO] Apache Tamaya Example - all ........................ SKIPPED
[INFO] Apache Tamaya Example: Minimal Version ............. SKIPPED
[INFO] Apache Tamaya Example: Simple Property Source Version SKIPPED
[INFO] Apache Tamaya Example: Resource Location ........... SKIPPED
[INFO] Apache Tamaya Example: Value Resolution ............ SKIPPED
[INFO] Apache Tamaya Example: File Observer ............... SKIPPED
[INFO] Apache Tamaya Example: Configuration Injection ..... SKIPPED
[INFO] Apache Tamaya Example: Builder ..................... SKIPPED
[INFO] Apache Tamaya Example: Remote ...................... SKIPPED
[INFO] Apache Tamaya Example: Remote (Server) ............. SKIPPED
[INFO] Apache Tamaya Example: Remote (Client) ............. SKIPPED
[INFO] Apache Tamaya Distribution ......................... SKIPPED
[INFO] ------------------------------------------------------------------------
[INFO] BUILD FAILURE
[INFO] ------------------------------------------------------------------------
[INFO] Total time: 04:17 min
[INFO] Finished at: 2016-05-24T14:22:51+00:00
[INFO] Final Memory: 113M/590M
[INFO] ------------------------------------------------------------------------
Waiting for Jenkins to finish collecting data
[ERROR] Failed to execute goal org.apache.maven.plugins:maven-site-plugin:3.4:site (default-cli) on project tamaya-code: failed to get report for org.codehaus.mojo:findbugs-maven-plugin: Plugin org.codehaus.mojo:findbugs-maven-plugin:3.0.1 or one of its dependencies could not be resolved: Could not transfer artifact org.apache.tamaya:buildconfigurations:jar:0.3-incubating-SNAPSHOT from/to codehaus-snapshots (http://nexus.codehaus.org/snapshots/): nexus.codehaus.org: Unknown host nexus.codehaus.org -> [Help 1]
[ERROR]
[ERROR] To see the full stack trace of the errors, re-run Maven with the -e switch.
[ERROR] Re-run Maven using the -X switch to enable full debug logging.
[ERROR]
[ERROR] For more information about the errors and possible solutions, please read the following articles:
[ERROR] [Help 1] http://cwiki.apache.org/confluence/display/MAVEN/MojoExecutionException
[ERROR]
[ERROR] After correcting the problems, you can resume the build with the command
[ERROR] mvn <goals> -rf :tamaya-code
[JENKINS] Archiving <https://builds.apache.org/job/Tamaya-Site-Master/ws/modules/injection/pom.xml> to org.apache.tamaya.ext/tamaya-injection/0.3-incubating-SNAPSHOT/tamaya-injection-0.3-incubating-SNAPSHOT.pom
[JENKINS] Archiving <https://builds.apache.org/job/Tamaya-Site-Master/ws/examples/6-fileobserver-example/pom.xml> to org.apache.tamaya.examples/tamaya-example-fileobserver/0.3-incubating-SNAPSHOT/tamaya-example-fileobserver-0.3-incubating-SNAPSHOT.pom
[JENKINS] Archiving <https://builds.apache.org/job/Tamaya-Site-Master/ws/modules/integration/osgi/pom.xml> to org.apache.tamaya.ext/tamaya-osgi/0.3-incubating-SNAPSHOT/tamaya-osgi-0.3-incubating-SNAPSHOT.pom
[JENKINS] Archiving <https://builds.apache.org/job/Tamaya-Site-Master/ws/examples/8-remote-example/pom.xml> to org.apache.tamaya.examples/tamaya-example-remote/0.3-incubating-SNAPSHOT/tamaya-example-remote-0.3-incubating-SNAPSHOT.pom
[JENKINS] Archiving <https://builds.apache.org/job/Tamaya-Site-Master/ws/modules/json/pom.xml> to org.apache.tamaya.ext/tamaya-json/0.3-incubating-SNAPSHOT/tamaya-json-0.3-incubating-SNAPSHOT.pom
[JENKINS] Archiving <https://builds.apache.org/job/Tamaya-Site-Master/ws/code/pom.xml> to org.apache.tamaya/tamaya-code/0.3-incubating-SNAPSHOT/tamaya-code-0.3-incubating-SNAPSHOT.pom
[JENKINS] Archiving <https://builds.apache.org/job/Tamaya-Site-Master/ws/modules/mutable-config/pom.xml> to org.apache.tamaya.ext/tamaya-mutable-config/0.3-incubating-SNAPSHOT/tamaya-mutable-config-0.3-incubating-SNAPSHOT.pom
[JENKINS] Archiving <https://builds.apache.org/job/Tamaya-Site-Master/ws/modules/integration/camel/pom.xml> to org.apache.tamaya.ext/tamaya-camel/0.3-incubating-SNAPSHOT/tamaya-camel-0.3-incubating-SNAPSHOT.pom
[JENKINS] Archiving <https://builds.apache.org/job/Tamaya-Site-Master/ws/examples/7-builder-example/pom.xml> to org.apache.tamaya.examples/tamaya-example-builder/0.3-incubating-SNAPSHOT/tamaya-example-builder-0.3-incubating-SNAPSHOT.pom
[JENKINS] Archiving <https://builds.apache.org/job/Tamaya-Site-Master/ws/modules/spi-support/pom.xml> to org.apache.tamaya.ext/tamaya-spisupport/0.3-incubating-SNAPSHOT/tamaya-spisupport-0.3-incubating-SNAPSHOT.pom
[JENKINS] Archiving <https://builds.apache.org/job/Tamaya-Site-Master/ws/examples/1-minimal-example/pom.xml> to org.apache.tamaya.examples/tamaya-example-minimal/0.3-incubating-SNAPSHOT/tamaya-example-minimal-0.3-incubating-SNAPSHOT.pom
[JENKINS] Archiving <https://builds.apache.org/job/Tamaya-Site-Master/ws/buildconfigurations/pom.xml> to org.apache.tamaya/buildconfigurations/0.3-incubating-SNAPSHOT/buildconfigurations-0.3-incubating-SNAPSHOT.pom
[JENKINS] Archiving <https://builds.apache.org/job/Tamaya-Site-Master/ws/examples/3-resources-example/pom.xml> to org.apache.tamaya.examples/tamaya-example-resources/0.3-incubating-SNAPSHOT/tamaya-example-resources-0.3-incubating-SNAPSHOT.pom
[JENKINS] Archiving <https://builds.apache.org/job/Tamaya-Site-Master/ws/modules/integration/karaf/pom.xml> to org.apache.tamaya.ext/tamaya-karaf/0.3-incubating-SNAPSHOT/tamaya-karaf-0.3-incubating-SNAPSHOT.pom
[JENKINS] Archiving <https://builds.apache.org/job/Tamaya-Site-Master/ws/examples/8-remote-example/server/pom.xml> to org.apache.tamaya.examples/tamaya-example-remote-server/0.3-incubating-SNAPSHOT/tamaya-example-remote-server-0.3-incubating-SNAPSHOT.pom
[JENKINS] Archiving <https://builds.apache.org/job/Tamaya-Site-Master/ws/modules/collections/pom.xml> to org.apache.tamaya.ext/tamaya-collections/0.3-incubating-SNAPSHOT/tamaya-collections-0.3-incubating-SNAPSHOT.pom
[JENKINS] Archiving <https://builds.apache.org/job/Tamaya-Site-Master/ws/examples/pom.xml> to org.apache.tamaya.ext/tamaya-examples/0.3-incubating-SNAPSHOT/tamaya-examples-0.3-incubating-SNAPSHOT.pom
[JENKINS] Archiving <https://builds.apache.org/job/Tamaya-Site-Master/ws/examples/8-remote-example/client/pom.xml> to org.apache.tamaya.examples/tamaya-example-remote-client/0.3-incubating-SNAPSHOT/tamaya-example-remote-client-0.3-incubating-SNAPSHOT.pom
[JENKINS] Archiving <https://builds.apache.org/job/Tamaya-Site-Master/ws/modules/optional/pom.xml> to org.apache.tamaya.ext/tamaya-optional/0.3-incubating-SNAPSHOT/tamaya-optional-0.3-incubating-SNAPSHOT.pom
[JENKINS] Archiving <https://builds.apache.org/job/Tamaya-Site-Master/ws/modules/filter/pom.xml> to org.apache.tamaya.ext/tamaya-filter/0.3-incubating-SNAPSHOT/tamaya-filter-0.3-incubating-SNAPSHOT.pom
[JENKINS] Archiving <https://builds.apache.org/job/Tamaya-Site-Master/ws/modules/injection-api/pom.xml> to org.apache.tamaya.ext/tamaya-injection-api/0.3-incubating-SNAPSHOT/tamaya-injection-api-0.3-incubating-SNAPSHOT.pom
[JENKINS] Archiving <https://builds.apache.org/job/Tamaya-Site-Master/ws/modules/integration/cdi-se/pom.xml> to org.apache.tamaya.ext/tamaya-cdi-se/0.3-incubating-SNAPSHOT/tamaya-cdi-se-0.3-incubating-SNAPSHOT.pom
[JENKINS] Archiving <https://builds.apache.org/job/Tamaya-Site-Master/ws/examples/2-simple-propertysource-example/pom.xml> to org.apache.tamaya.examples/tamaya-example-simple-propertysource/0.3-incubating-SNAPSHOT/tamaya-example-simple-propertysource-0.3-incubating-SNAPSHOT.pom
[JENKINS] Archiving <https://builds.apache.org/job/Tamaya-Site-Master/ws/modules/resources/pom.xml> to org.apache.tamaya.ext/tamaya-resources/0.3-incubating-SNAPSHOT/tamaya-resources-0.3-incubating-SNAPSHOT.pom
[JENKINS] Archiving <https://builds.apache.org/job/Tamaya-Site-Master/ws/modules/model/pom.xml> to org.apache.tamaya.ext/tamaya-model/0.3-incubating-SNAPSHOT/tamaya-model-0.3-incubating-SNAPSHOT.pom
[JENKINS] Archiving <https://builds.apache.org/job/Tamaya-Site-Master/ws/modules/management/pom.xml> to org.apache.tamaya.ext/tamaya-management/0.3-incubating-SNAPSHOT/tamaya-management-0.3-incubating-SNAPSHOT.pom
[JENKINS] Archiving <https://builds.apache.org/job/Tamaya-Site-Master/ws/modules/integration/etcd/pom.xml> to org.apache.tamaya.ext/tamaya-etcd/0.3-incubating-SNAPSHOT/tamaya-etcd-0.3-incubating-SNAPSHOT.pom
[JENKINS] Archiving <https://builds.apache.org/job/Tamaya-Site-Master/ws/modules/yaml/pom.xml> to org.apache.tamaya.ext/tamaya-yaml/0.3-incubating-SNAPSHOT/tamaya-yaml-0.3-incubating-SNAPSHOT.pom
[JENKINS] Archiving <https://builds.apache.org/job/Tamaya-Site-Master/ws/distribution/pom.xml> to org.apache.tamaya/tamaya-distribution/0.3-incubating-SNAPSHOT/tamaya-distribution-0.3-incubating-SNAPSHOT.pom
[JENKINS] Archiving <https://builds.apache.org/job/Tamaya-Site-Master/ws/modules/integration/spring/pom.xml> to org.apache.tamaya.ext/tamaya-spring/0.3-incubating-SNAPSHOT/tamaya-spring-0.3-incubating-SNAPSHOT.pom
[JENKINS] Archiving <https://builds.apache.org/job/Tamaya-Site-Master/ws/examples/4-resolver-example/pom.xml> to org.apache.tamaya.examples/tamaya-example-resolver/0.3-incubating-SNAPSHOT/tamaya-example-resolver-0.3-incubating-SNAPSHOT.pom
[JENKINS] Archiving <https://builds.apache.org/job/Tamaya-Site-Master/ws/modules/events/pom.xml> to org.apache.tamaya.ext/tamaya-events/0.3-incubating-SNAPSHOT/tamaya-events-0.3-incubating-SNAPSHOT.pom
[JENKINS] Archiving <https://builds.apache.org/job/Tamaya-Site-Master/ws/modules/formats/pom.xml> to org.apache.tamaya.ext/tamaya-formats/0.3-incubating-SNAPSHOT/tamaya-formats-0.3-incubating-SNAPSHOT.pom
[JENKINS] Archiving <https://builds.apache.org/job/Tamaya-Site-Master/ws/examples/5-injection-example/pom.xml> to org.apache.tamaya.examples/tamaya-example-injection/0.3-incubating-SNAPSHOT/tamaya-example-injection-0.3-incubating-SNAPSHOT.pom
[JENKINS] Archiving <https://builds.apache.org/job/Tamaya-Site-Master/ws/modules/ui/pom.xml> to org.apache.tamaya.ext/tamaya-ui/0.3-incubating-SNAPSHOT/tamaya-ui-0.3-incubating-SNAPSHOT.pom
[JENKINS] Archiving <https://builds.apache.org/job/Tamaya-Site-Master/ws/modules/pom.xml> to org.apache.tamaya.ext/tamaya-extensions/0.3-incubating-SNAPSHOT/tamaya-extensions-0.3-incubating-SNAPSHOT.pom
[JENKINS] Archiving <https://builds.apache.org/job/Tamaya-Site-Master/ws/code/api/pom.xml> to org.apache.tamaya/tamaya-api/0.3-incubating-SNAPSHOT/tamaya-api-0.3-incubating-SNAPSHOT.pom
[JENKINS] Archiving <https://builds.apache.org/job/Tamaya-Site-Master/ws/modules/server/pom.xml> to org.apache.tamaya.ext/tamaya-server/0.3-incubating-SNAPSHOT/tamaya-server-0.3-incubating-SNAPSHOT.pom
[JENKINS] Archiving <https://builds.apache.org/job/Tamaya-Site-Master/ws/modules/classloader-support/pom.xml> to org.apache.tamaya.ext/tamaya-classloader-support/0.3-incubating-SNAPSHOT/tamaya-classloader-support-0.3-incubating-SNAPSHOT.pom
[JENKINS] Archiving <https://builds.apache.org/job/Tamaya-Site-Master/ws/modules/functions/pom.xml> to org.apache.tamaya.ext/tamaya-functions/0.3-incubating-SNAPSHOT/tamaya-functions-0.3-incubating-SNAPSHOT.pom
[JENKINS] Archiving <https://builds.apache.org/job/Tamaya-Site-Master/ws/modules/integration/consul/pom.xml> to org.apache.tamaya.ext/tamaya-consul/0.3-incubating-SNAPSHOT/tamaya-consul-0.3-incubating-SNAPSHOT.pom
[JENKINS] Archiving <https://builds.apache.org/job/Tamaya-Site-Master/ws/modules/resolver/pom.xml> to org.apache.tamaya.ext/tamaya-resolver/0.3-incubating-SNAPSHOT/tamaya-resolver-0.3-incubating-SNAPSHOT.pom
[JENKINS] Archiving <https://builds.apache.org/job/Tamaya-Site-Master/ws/modules/integration/pom.xml> to org.apache.tamaya.ext/tamaya-integration/0.3-incubating-SNAPSHOT/tamaya-integration-0.3-incubating-SNAPSHOT.pom
[JENKINS] Archiving <https://builds.apache.org/job/Tamaya-Site-Master/ws/code/core/pom.xml> to org.apache.tamaya/tamaya-core/0.3-incubating-SNAPSHOT/tamaya-core-0.3-incubating-SNAPSHOT.pom
[JENKINS] Archiving <https://builds.apache.org/job/Tamaya-Site-Master/ws/pom.xml> to org.apache.tamaya/tamaya-all/0.3-incubating-SNAPSHOT/tamaya-all-0.3-incubating-SNAPSHOT.pom
Compressed 37.35 KB of artifacts by 85.7% relative to #4
[JENKINS] Archiving <https://builds.apache.org/job/Tamaya-Site-Master/ws/modules/builder/pom.xml> to org.apache.tamaya.ext/tamaya-builder/0.3-incubating-SNAPSHOT/tamaya-builder-0.3-incubating-SNAPSHOT.pom
[JENKINS] Archiving <https://builds.apache.org/job/Tamaya-Site-Master/ws/modules/integration/cdi/pom.xml> to org.apache.tamaya.ext/tamaya-cdi/0.3-incubating-SNAPSHOT/tamaya-cdi-0.3-incubating-SNAPSHOT.pom
[JENKINS] Archiving <https://builds.apache.org/job/Tamaya-Site-Master/ws/docs/pom.xml> to org.apache.tamaya/tamaya-docs/0.3-incubating-SNAPSHOT/tamaya-docs-0.3-incubating-SNAPSHOT.pom
channel stopped
Re: Build failed in Jenkins: Tamaya-Site-Master #5
Posted by "P. Ottlinger" <po...@apache.org>.
Am 24.05.2016 um 23:19 schrieb Oliver B. Fischer:
> Thx. Could it be related to settings.xml? I created an effective POM for
> Tamaya, but not the effective setting. The effective POM does not
> mention nexus.codehaus.org.
The infra ticket just got a comment that it's related to the node
ubuntu4 .... let's just keep an eye on it :-)
Phil
Re: Build failed in Jenkins: Tamaya-Site-Master #5
Posted by "Oliver B. Fischer" <o....@swe-blog.net>.
Thx. Could it be related to settings.xml? I created an effective POM for
Tamaya, but not the effective setting. The effective POM does not
mention nexus.codehaus.org.
Oliver
Am 24.05.16 um 23:13 schrieb P. Ottlinger:
> Hi,
>
> I've created
> https://issues.apache.org/jira/browse/INFRA-11968
> since it seems to be an issue with the Jenkins node setup.
>
> just fyi
>
> Phil
>
> Am 24.05.2016 um 16:26 schrieb Apache Jenkins Server:
>> [INFO] <<< maven-javadoc-plugin:2.9.1:javadoc < generate-sources @ tamaya-code <<<
>> [INFO] configuring report plugin org.apache.rat:apache-rat-plugin:0.11
>> [INFO] configuring report plugin org.codehaus.mojo:findbugs-maven-plugin:3.0.1
>> [INFO] Downloading: http://nexus.codehaus.org/snapshots/org/apache/tamaya/buildconfigurations/0.3-incubating-SNAPSHOT/maven-metadata.xml
>> [WARNING] Could not transfer metadata org.apache.tamaya:buildconfigurations:0.3-incubating-SNAPSHOT/maven-metadata.xml from/to codehaus-snapshots (http://nexus.codehaus.org/snapshots/): nexus.codehaus.org: Name or service not known
>> [WARNING] Failure to transfer org.apache.tamaya:buildconfigurations:0.3-incubating-SNAPSHOT/maven-metadata.xml from http://nexus.codehaus.org/snapshots/ was cached in the local repository, resolution will not be reattempted until the update interval of codehaus-snapshots has elapsed or updates are forced. Original error: Could not transfer metadata org.apache.tamaya:buildconfigurations:0.3-incubating-SNAPSHOT/maven-metadata.xml from/to codehaus-snapshots (http://nexus.codehaus.org/snapshots/): nexus.codehaus.org: Name or service not known
>> [INFO] Downloading: http://nexus.codehaus.org/snapshots/org/apache/tamaya/buildconfigurations/0.3-incubating-SNAPSHOT/buildconfigurations-0.3-incubating-SNAPSHOT.jar
>> [FINDBUGS] No report found for mojo site
--
N Oliver B. Fischer
A Sch�nhauser Allee 64, 10437 Berlin, Deutschland/Germany
P +49 30 44793251
M +49 178 7903538
E o.b.fischer@swe-blog.net
S oliver.b.fischer
J oliver.b.fischer@jabber.org
X http://xing.to/obf
Re: Build failed in Jenkins: Tamaya-Site-Master #5
Posted by "P. Ottlinger" <po...@apache.org>.
Hi,
I've created
https://issues.apache.org/jira/browse/INFRA-11968
since it seems to be an issue with the Jenkins node setup.
just fyi
Phil
Am 24.05.2016 um 16:26 schrieb Apache Jenkins Server:
> [INFO] <<< maven-javadoc-plugin:2.9.1:javadoc < generate-sources @ tamaya-code <<<
> [INFO] configuring report plugin org.apache.rat:apache-rat-plugin:0.11
> [INFO] configuring report plugin org.codehaus.mojo:findbugs-maven-plugin:3.0.1
> [INFO] Downloading: http://nexus.codehaus.org/snapshots/org/apache/tamaya/buildconfigurations/0.3-incubating-SNAPSHOT/maven-metadata.xml
> [WARNING] Could not transfer metadata org.apache.tamaya:buildconfigurations:0.3-incubating-SNAPSHOT/maven-metadata.xml from/to codehaus-snapshots (http://nexus.codehaus.org/snapshots/): nexus.codehaus.org: Name or service not known
> [WARNING] Failure to transfer org.apache.tamaya:buildconfigurations:0.3-incubating-SNAPSHOT/maven-metadata.xml from http://nexus.codehaus.org/snapshots/ was cached in the local repository, resolution will not be reattempted until the update interval of codehaus-snapshots has elapsed or updates are forced. Original error: Could not transfer metadata org.apache.tamaya:buildconfigurations:0.3-incubating-SNAPSHOT/maven-metadata.xml from/to codehaus-snapshots (http://nexus.codehaus.org/snapshots/): nexus.codehaus.org: Name or service not known
> [INFO] Downloading: http://nexus.codehaus.org/snapshots/org/apache/tamaya/buildconfigurations/0.3-incubating-SNAPSHOT/buildconfigurations-0.3-incubating-SNAPSHOT.jar
> [FINDBUGS] No report found for mojo site