You are viewing a plain text version of this content. The canonical link for it is here.
Posted to builds@solr.apache.org by Apache Jenkins Server <je...@builds.apache.org> on 2026/10/05 16:20:52 UTC

[JENKINS] Solr » Solr-BadApples-Tests-main - Build # 2165 - Unstable!

Build: https://ci-builds.apache.org/job/Solr/job/Solr-BadApples-Tests-main/2165/

1 tests failed.
FAILED:  org.apache.solr.search.TestIntervalsQParserPlugin.testIntervalsFuzzyRule

Error Message:
java.lang.RuntimeException: mismatch: '80'!='81' @ response/docs/[0]/id

Stack Trace:
java.lang.RuntimeException: mismatch: '80'!='81' @ response/docs/[0]/id
	at __randomizedtesting.SeedInfo.seed([1B1BDF63AE8F4446:3AC440CE13E84894]:0)
	at org.apache.solr.SolrTestCaseJ4.assertJQ(SolrTestCaseJ4.java:960)
	at org.apache.solr.SolrTestCaseJ4.assertJJQ(SolrTestCaseJ4.java:895)
	at org.apache.solr.search.TestIntervalsQParserPlugin.testIntervalsFuzzyRule(TestIntervalsQParserPlugin.java:219)
	at java.base/jdk.internal.reflect.DirectMethodHandleAccessor.invoke(DirectMethodHandleAccessor.java:103)
	at java.base/java.lang.reflect.Method.invoke(Method.java:580)
	at com.carrotsearch.randomizedtesting.RandomizedRunner.invoke(RandomizedRunner.java:1780)
	at com.carrotsearch.randomizedtesting.RandomizedRunner$8.evaluate(RandomizedRunner.java:959)
	at com.carrotsearch.randomizedtesting.RandomizedRunner$9.evaluate(RandomizedRunner.java:995)
	at com.carrotsearch.randomizedtesting.RandomizedRunner$10.evaluate(RandomizedRunner.java:1009)
	at com.carrotsearch.randomizedtesting.rules.SystemPropertiesRestoreRule$1.evaluate(SystemPropertiesRestoreRule.java:80)
	at org.junit.rules.RunRules.evaluate(RunRules.java:20)
	at org.apache.lucene.tests.util.TestRuleSetupTeardownChained$1.evaluate(TestRuleSetupTeardownChained.java:48)
	at org.apache.lucene.tests.util.AbstractBeforeAfterRule$1.evaluate(AbstractBeforeAfterRule.java:43)
	at org.apache.lucene.tests.util.TestRuleThreadAndTestName$1.evaluate(TestRuleThreadAndTestName.java:45)
	at org.apache.lucene.tests.util.TestRuleIgnoreAfterMaxFailures$1.evaluate(TestRuleIgnoreAfterMaxFailures.java:60)
	at org.apache.lucene.tests.util.TestRuleMarkFailure$1.evaluate(TestRuleMarkFailure.java:44)
	at org.junit.rules.RunRules.evaluate(RunRules.java:20)
	at com.carrotsearch.randomizedtesting.rules.StatementAdapter.evaluate(StatementAdapter.java:36)
	at com.carrotsearch.randomizedtesting.ThreadLeakControl$StatementRunner.run(ThreadLeakControl.java:390)
	at com.carrotsearch.randomizedtesting.ThreadLeakControl.forkTimeoutingTask(ThreadLeakControl.java:843)
	at com.carrotsearch.randomizedtesting.ThreadLeakControl$3.evaluate(ThreadLeakControl.java:490)
	at com.carrotsearch.randomizedtesting.RandomizedRunner.runSingleTest(RandomizedRunner.java:968)
	at com.carrotsearch.randomizedtesting.RandomizedRunner$5.evaluate(RandomizedRunner.java:853)
	at com.carrotsearch.randomizedtesting.RandomizedRunner$6.evaluate(RandomizedRunner.java:904)
	at com.carrotsearch.randomizedtesting.RandomizedRunner$7.evaluate(RandomizedRunner.java:915)
	at com.carrotsearch.randomizedtesting.rules.StatementAdapter.evaluate(StatementAdapter.java:36)
	at com.carrotsearch.randomizedtesting.rules.StatementAdapter.evaluate(StatementAdapter.java:36)
	at org.apache.lucene.tests.util.AbstractBeforeAfterRule$1.evaluate(AbstractBeforeAfterRule.java:43)
	at com.carrotsearch.randomizedtesting.rules.SystemPropertiesRestoreRule$1.evaluate(SystemPropertiesRestoreRule.java:80)
	at org.junit.rules.RunRules.evaluate(RunRules.java:20)
	at org.apache.lucene.tests.util.AbstractBeforeAfterRule$1.evaluate(AbstractBeforeAfterRule.java:43)
	at com.carrotsearch.randomizedtesting.rules.StatementAdapter.evaluate(StatementAdapter.java:36)
	at org.apache.lucene.tests.util.TestRuleStoreClassName$1.evaluate(TestRuleStoreClassName.java:38)
	at com.carrotsearch.randomizedtesting.rules.NoShadowingOrOverridesOnMethodsRule$1.evaluate(NoShadowingOrOverridesOnMethodsRule.java:40)
	at com.carrotsearch.randomizedtesting.rules.NoShadowingOrOverridesOnMethodsRule$1.evaluate(NoShadowingOrOverridesOnMethodsRule.java:40)
	at com.carrotsearch.randomizedtesting.rules.StatementAdapter.evaluate(StatementAdapter.java:36)
	at com.carrotsearch.randomizedtesting.rules.StatementAdapter.evaluate(StatementAdapter.java:36)
	at org.apache.lucene.tests.util.TestRuleAssertionsRequired$1.evaluate(TestRuleAssertionsRequired.java:53)
	at org.apache.lucene.tests.util.AbstractBeforeAfterRule$1.evaluate(AbstractBeforeAfterRule.java:43)
	at org.apache.lucene.tests.util.TestRuleMarkFailure$1.evaluate(TestRuleMarkFailure.java:44)
	at org.apache.lucene.tests.util.TestRuleIgnoreAfterMaxFailures$1.evaluate(TestRuleIgnoreAfterMaxFailures.java:60)
	at org.apache.lucene.tests.util.TestRuleIgnoreTestSuites$1.evaluate(TestRuleIgnoreTestSuites.java:47)
	at org.junit.rules.RunRules.evaluate(RunRules.java:20)
	at com.carrotsearch.randomizedtesting.rules.StatementAdapter.evaluate(StatementAdapter.java:36)
	at com.carrotsearch.randomizedtesting.ThreadLeakControl$StatementRunner.run(ThreadLeakControl.java:390)
	at com.carrotsearch.randomizedtesting.ThreadLeakControl.lambda$forkTimeoutingTask$0(ThreadLeakControl.java:850)
	at java.base/java.lang.Thread.run(Thread.java:1583)




Build Log:
[...truncated 1883 lines...]
ERROR: The following test(s) have failed:
  - org.apache.solr.search.TestIntervalsQParserPlugin.testIntervalsFuzzyRule (:solr:core)
    Test history: https://develocity.apache.org/scans/tests?search.rootProjectNames=solr-root&tests.container=org.apache.solr.search.TestIntervalsQParserPlugin&tests.test=testIntervalsFuzzyRule http://fucit.org/solr-jenkins-reports/history-trend-of-recent-failures.html#series/org.apache.solr.search.TestIntervalsQParserPlugin.testIntervalsFuzzyRule
    Test output: /home/jenkins/jenkins-agent/workspace/Solr/Solr-BadApples-Tests-main/solr/core/build/test-results/test/outputs/OUTPUT-org.apache.solr.search.TestIntervalsQParserPlugin.txt
    Reproduce with: ./gradlew :solr:core:test --tests "org.apache.solr.search.TestIntervalsQParserPlugin.testIntervalsFuzzyRule" -Ptests.haltonfailure=false "-Ptests.jvmargs=-XX:TieredStopAtLevel=1 -XX:+UseParallelGC -XX:ActiveProcessorCount=1 -XX:ReservedCodeCacheSize=120m" -Ptests.seed=1B1BDF63AE8F4446 -Ptests.multiplier=2 -Ptests.useSecurityManager=true -Ptests.badapples=true -Ptests.file.encoding=ISO-8859-1


[Incubating] Problems report is available at: file:///home/jenkins/jenkins-agent/workspace/Solr/Solr-BadApples-Tests-main/build/reports/problems/problems-report.html

Deprecated Gradle features were used in this build, making it incompatible with Gradle 10.

You can use '--warning-mode all' to show the individual deprecation warnings and determine if they come from your own scripts or plugins.

For more on this, please refer to https://docs.gradle.org/9.7.0/userguide/command_line_interface.html#sec:command_line_warnings in the Gradle documentation.

BUILD SUCCESSFUL in 38m 18s
159 actionable tasks: 159 executed

Publishing Build Scan to Develocity...

The Develocity server (develocity.apache.org) rejected the credential with prefix '7x3jzizm4zpygv7psbkg6byvm4'.
Your credential has expired.

Build step 'Invoke Gradle script' changed build result to SUCCESS
Archiving artifacts
‘**/*.events’ doesn’t match anything: ‘**’ exists but not ‘**/*.events’
No artifacts found that match the file pattern "**/*.events,heapdumps/**,**/hs_err_pid*". Configuration error?
Recording test results
FATAL: Failed to save the JUnit test result
java.io.IOException: java.lang.RuntimeException: Failed to serialize hudson.tasks.junit.TestResult#suites for class hudson.tasks.junit.TestResult
	at hudson.XmlFile.write(XmlFile.java:223)
	at PluginClassLoader for junit//hudson.tasks.junit.TestResultAction.setResult(TestResultAction.java:135)
	at PluginClassLoader for junit//hudson.tasks.junit.TestResultAction.<init>(TestResultAction.java:96)
	at PluginClassLoader for junit//hudson.tasks.junit.JUnitResultArchiver.parseAndSummarize(JUnitResultArchiver.java:301)
	at PluginClassLoader for junit//hudson.tasks.junit.JUnitResultArchiver.perform(JUnitResultArchiver.java:194)
	at jenkins.tasks.SimpleBuildStep.perform(SimpleBuildStep.java:123)
	at hudson.tasks.BuildStepCompatibilityLayer.perform(BuildStepCompatibilityLayer.java:80)
	at hudson.tasks.BuildStepMonitor$1.perform(BuildStepMonitor.java:20)
	at hudson.model.AbstractBuild$AbstractBuildExecution.perform(AbstractBuild.java:818)
	at hudson.model.AbstractBuild$AbstractBuildExecution.performAllBuildSteps(AbstractBuild.java:767)
	at hudson.model.Build$BuildExecution.post2(Build.java:179)
	at hudson.model.AbstractBuild$AbstractBuildExecution.post(AbstractBuild.java:711)
	at hudson.model.Run.execute(Run.java:1856)
	at hudson.model.FreeStyleBuild.run(FreeStyleBuild.java:44)
	at hudson.model.ResourceController.execute(ResourceController.java:101)
	at hudson.model.Executor.run(Executor.java:446)
Caused by: java.lang.RuntimeException: Failed to serialize hudson.tasks.junit.TestResult#suites for class hudson.tasks.junit.TestResult
	at hudson.util.RobustReflectionConverter$2.writeField(RobustReflectionConverter.java:274)
	at hudson.util.RobustReflectionConverter$2.visit(RobustReflectionConverter.java:241)
	at com.thoughtworks.xstream.converters.reflection.PureJavaReflectionProvider.visitSerializableFields(PureJavaReflectionProvider.java:174)
	at hudson.util.RobustReflectionConverter.doMarshal(RobustReflectionConverter.java:226)
	at hudson.util.RobustReflectionConverter.marshal(RobustReflectionConverter.java:163)
	at com.thoughtworks.xstream.core.AbstractReferenceMarshaller.convert(AbstractReferenceMarshaller.java:68)
	at com.thoughtworks.xstream.core.TreeMarshaller.convertAnother(TreeMarshaller.java:59)
	at com.thoughtworks.xstream.core.TreeMarshaller.convertAnother(TreeMarshaller.java:44)
	at com.thoughtworks.xstream.core.TreeMarshaller.start(TreeMarshaller.java:83)
	at com.thoughtworks.xstream.core.AbstractTreeMarshallingStrategy.marshal(AbstractTreeMarshallingStrategy.java:37)
	at com.thoughtworks.xstream.XStream.marshal(XStream.java:1307)
	at com.thoughtworks.xstream.XStream.marshal(XStream.java:1296)
	at com.thoughtworks.xstream.XStream.toXML(XStream.java:1269)
	at hudson.XmlFile.write(XmlFile.java:216)
	... 15 more
Caused by: java.lang.RuntimeException: Failed to serialize hudson.tasks.junit.SuiteResult#stderr for class hudson.tasks.junit.SuiteResult
	at hudson.util.RobustReflectionConverter$2.writeField(RobustReflectionConverter.java:274)
	at hudson.util.RobustReflectionConverter$2.visit(RobustReflectionConverter.java:241)
	at com.thoughtworks.xstream.converters.reflection.PureJavaReflectionProvider.visitSerializableFields(PureJavaReflectionProvider.java:174)
	at hudson.util.RobustReflectionConverter.doMarshal(RobustReflectionConverter.java:226)
	at hudson.util.RobustReflectionConverter.marshal(RobustReflectionConverter.java:163)
	at com.thoughtworks.xstream.core.AbstractReferenceMarshaller.convert(AbstractReferenceMarshaller.java:68)
	at com.thoughtworks.xstream.core.TreeMarshaller.convertAnother(TreeMarshaller.java:59)
	at com.thoughtworks.xstream.core.TreeMarshaller.convertAnother(TreeMarshaller.java:44)
	at com.thoughtworks.xstream.core.AbstractReferenceMarshaller$1.convertAnother(AbstractReferenceMarshaller.java:87)
	at com.thoughtworks.xstream.converters.collections.AbstractCollectionConverter.writeBareItem(AbstractCollectionConverter.java:94)
	at com.thoughtworks.xstream.converters.collections.AbstractCollectionConverter.writeItem(AbstractCollectionConverter.java:66)
	at com.thoughtworks.xstream.converters.collections.AbstractCollectionConverter.writeCompleteItem(AbstractCollectionConverter.java:81)
	at com.thoughtworks.xstream.converters.collections.CollectionConverter.marshal(CollectionConverter.java:75)
	at com.thoughtworks.xstream.core.AbstractReferenceMarshaller.convert(AbstractReferenceMarshaller.java:68)
	at com.thoughtworks.xstream.core.TreeMarshaller.convertAnother(TreeMarshaller.java:59)
	at com.thoughtworks.xstream.core.AbstractReferenceMarshaller$1.convertAnother(AbstractReferenceMarshaller.java:83)
	at hudson.util.RobustReflectionConverter.marshallField(RobustReflectionConverter.java:283)
	at hudson.util.RobustReflectionConverter$2.writeField(RobustReflectionConverter.java:270)
	... 28 more
Caused by: com.thoughtworks.xstream.io.StreamException: Invalid character 0xdd33 in XML stream
	at hudson.util.PrettyPrintWriter.lambda$writeText$0(PrettyPrintWriter.java:253)
	at java.base/java.lang.StringUTF16$CodePointsSpliterator.advance(StringUTF16.java:1319)
	at java.base/java.lang.StringUTF16$CodePointsSpliterator.forEachRemaining(StringUTF16.java:1291)
	at java.base/java.util.stream.IntPipeline$Head.forEach(IntPipeline.java:617)
	at hudson.util.PrettyPrintWriter.writeText(PrettyPrintWriter.java:214)
	at hudson.util.PrettyPrintWriter.writeText(PrettyPrintWriter.java:210)
	at hudson.util.PrettyPrintWriter.setValue(PrettyPrintWriter.java:192)
	at com.thoughtworks.xstream.io.WriterWrapper.setValue(WriterWrapper.java:45)
	at com.thoughtworks.xstream.converters.SingleValueConverterWrapper.marshal(SingleValueConverterWrapper.java:45)
	at com.thoughtworks.xstream.core.AbstractReferenceMarshaller.convert(AbstractReferenceMarshaller.java:50)
	at com.thoughtworks.xstream.core.TreeMarshaller.convertAnother(TreeMarshaller.java:59)
	at com.thoughtworks.xstream.core.AbstractReferenceMarshaller$1.convertAnother(AbstractReferenceMarshaller.java:83)
	at hudson.util.RobustReflectionConverter.marshallField(RobustReflectionConverter.java:283)
	at hudson.util.RobustReflectionConverter$2.writeField(RobustReflectionConverter.java:270)
	... 45 more
[Checks API] No suitable checks publisher found.
Build step 'Publish JUnit test result report' changed build result to UNSTABLE
Email was triggered for: Unstable (Test Failures)
Sending email for trigger: Unstable (Test Failures)