You are viewing a plain text version of this content. The canonical link for it is here.
Posted to builds@beam.apache.org by Apache Jenkins Server <je...@builds.apache.org> on 2022/02/14 18:39:26 UTC
Build failed in Jenkins: beam_PostCommit_Py_VR_Dataflow #8994
See <https://ci-beam.apache.org/job/beam_PostCommit_Py_VR_Dataflow/8994/display/redirect?page=changes>
Changes:
[noreply] Update 2.36.0 blog post to mention ARM64 support
[noreply] Minor: Disable checker framework in nightly snapshot (#16829)
[noreply] [BEAM-13860] Make `DoFn.infer_output_type` return element type (#16788)
------------------------------------------
[...truncated 112.93 KB...]
scheduling tests via LoadScheduling
apache_beam/runners/portability/fn_api_runner/translations_test.py::TranslationsTest::test_run_packable_combine_globally
apache_beam/runners/portability/fn_api_runner/translations_test.py::TranslationsTest::test_run_packable_combine_per_key
apache_beam/pipeline_test.py::DoFnTest::test_element_param
apache_beam/pipeline_test.py::DoFnTest::test_key_param
apache_beam/metrics/metric_test.py::MetricsTest::test_user_counter_using_pardo
apache_beam/runners/portability/fn_api_runner/translations_test.py::TranslationsTest::test_run_packable_combine_limit
apache_beam/transforms/combinefn_lifecycle_test.py::CombineFnLifecycleTest::test_combine
apache_beam/runners/portability/fn_api_runner/fn_runner_test.py::FnApiBasedStateBackedCoderTest::test_gbk_many_values
[gw7] [33mSKIPPED[0m apache_beam/transforms/combinefn_lifecycle_test.py::CombineFnLifecycleTest::test_combine
apache_beam/transforms/ptransform_test.py::PTransformTest::test_flatten_one_single_pcollection
[gw2] [32mPASSED[0m apache_beam/runners/portability/fn_api_runner/fn_runner_test.py::FnApiBasedStateBackedCoderTest::test_gbk_many_values
apache_beam/transforms/combiners_test.py::TimestampCombinerTest::test_combiner_latest
[gw2] [32mPASSED[0m apache_beam/transforms/combiners_test.py::TimestampCombinerTest::test_combiner_latest
apache_beam/transforms/ptransform_test.py::PTransformTest::test_impulse
> Task :sdks:python:test-suites:dataflow:py38:validatesRunnerBatchTests
[gw6] [32mPASSED[0m apache_beam/transforms/combiners_test.py::TimestampCombinerTest::test_combiner_latest
apache_beam/transforms/ptransform_test.py::PTransformTest::test_flatten_same_pcollections
[gw6] [32mPASSED[0m apache_beam/transforms/ptransform_test.py::PTransformTest::test_flatten_same_pcollections
apache_beam/transforms/ptransform_test.py::PTransformTest::test_impulse
> Task :sdks:python:test-suites:dataflow:py37:validatesRunnerBatchTests
[gw0] [32mPASSED[0m apache_beam/metrics/metric_test.py::MetricsTest::test_user_counter_using_pardo
apache_beam/transforms/combiners_test.py::TimestampCombinerTest::test_combiner_earliest
[gw0] [32mPASSED[0m apache_beam/transforms/combiners_test.py::TimestampCombinerTest::test_combiner_earliest
apache_beam/transforms/ptransform_test.py::PTransformTest::test_multiple_empty_outputs
[gw1] [32mPASSED[0m apache_beam/pipeline_test.py::DoFnTest::test_element_param
apache_beam/transforms/combinefn_lifecycle_test.py::CombineFnLifecycleTest::test_combining_value_state
[gw1] [33mSKIPPED[0m apache_beam/transforms/combinefn_lifecycle_test.py::CombineFnLifecycleTest::test_combining_value_state
apache_beam/transforms/ptransform_test.py::PTransformTest::test_par_do_with_multiple_outputs_and_using_yield
[gw5] [32mPASSED[0m apache_beam/runners/portability/fn_api_runner/translations_test.py::TranslationsTest::test_run_packable_combine_globally
apache_beam/transforms/dofn_lifecycle_test.py::DoFnLifecycleTest::test_dofn_lifecycle
> Task :sdks:python:test-suites:dataflow:py38:validatesRunnerBatchTests
[gw3] [32mPASSED[0m apache_beam/metrics/metric_test.py::MetricsTest::test_user_counter_using_pardo
apache_beam/transforms/combiners_test.py::TimestampCombinerTest::test_combiner_earliest
[gw3] [32mPASSED[0m apache_beam/transforms/combiners_test.py::TimestampCombinerTest::test_combiner_earliest
apache_beam/transforms/ptransform_test.py::PTransformTest::test_par_do_with_multiple_outputs_and_using_return
> Task :sdks:python:test-suites:dataflow:py37:validatesRunnerBatchTests
[gw6] [32mPASSED[0m apache_beam/transforms/ptransform_test.py::PTransformTest::test_flatten_one_single_pcollection
apache_beam/transforms/ptransform_test.py::PTransformTest::test_flatten_pcollections
[gw3] [32mPASSED[0m apache_beam/transforms/ptransform_test.py::PTransformTest::test_flatten_same_pcollections
apache_beam/transforms/ptransform_test.py::PTransformTest::test_impulse
[gw2] [32mPASSED[0m apache_beam/pipeline_test.py::DoFnTest::test_key_param
apache_beam/transforms/combinefn_lifecycle_test.py::CombineFnLifecycleTest::test_non_liftable_combine
[gw2] [33mSKIPPED[0m apache_beam/transforms/combinefn_lifecycle_test.py::CombineFnLifecycleTest::test_non_liftable_combine
apache_beam/transforms/sideinputs_test.py::SideInputsTest::test_as_list_twice
> Task :sdks:python:test-suites:dataflow:py38:validatesRunnerBatchTests
[gw7] [32mPASSED[0m apache_beam/transforms/ptransform_test.py::PTransformTest::test_flatten_one_single_pcollection
apache_beam/transforms/ptransform_test.py::PTransformTest::test_flatten_pcollections
[gw5] [32mPASSED[0m apache_beam/runners/portability/fn_api_runner/translations_test.py::TranslationsTest::test_run_packable_combine_limit
apache_beam/transforms/ptransform_test.py::PTransformTest::test_flatten_a_flattened_pcollection
[gw1] [32mPASSED[0m apache_beam/pipeline_test.py::DoFnTest::test_key_param
apache_beam/transforms/combinefn_lifecycle_test.py::CombineFnLifecycleTest::test_non_liftable_combine
[gw1] [33mSKIPPED[0m apache_beam/transforms/combinefn_lifecycle_test.py::CombineFnLifecycleTest::test_non_liftable_combine
apache_beam/transforms/sideinputs_test.py::SideInputsTest::test_as_dict_twice
[gw0] [32mPASSED[0m apache_beam/pipeline_test.py::DoFnTest::test_element_param
apache_beam/transforms/combinefn_lifecycle_test.py::CombineFnLifecycleTest::test_combining_value_state
[gw0] [33mSKIPPED[0m apache_beam/transforms/combinefn_lifecycle_test.py::CombineFnLifecycleTest::test_combining_value_state
apache_beam/transforms/sideinputs_test.py::SideInputsTest::test_as_list_twice
> Task :sdks:python:test-suites:dataflow:py37:validatesRunnerBatchTests
[gw4] [32mPASSED[0m apache_beam/runners/portability/fn_api_runner/translations_test.py::TranslationsTest::test_run_packable_combine_per_key
apache_beam/transforms/ptransform_test.py::PTransformTest::test_flatten_multiple_pcollections_having_multiple_consumers
[gw7] [32mPASSED[0m apache_beam/runners/portability/fn_api_runner/translations_test.py::TranslationsTest::test_run_packable_combine_limit
apache_beam/transforms/ptransform_test.py::PTransformTest::test_flatten_a_flattened_pcollection
> Task :sdks:python:test-suites:dataflow:py38:validatesRunnerBatchTests
[gw4] [32mPASSED[0m apache_beam/runners/portability/fn_api_runner/translations_test.py::TranslationsTest::test_run_packable_combine_per_key
apache_beam/transforms/ptransform_test.py::PTransformTest::test_flatten_multiple_pcollections_having_multiple_consumers
[gw2] [32mPASSED[0m apache_beam/runners/portability/fn_api_runner/translations_test.py::TranslationsTest::test_run_packable_combine_globally
apache_beam/transforms/dofn_lifecycle_test.py::DoFnLifecycleTest::test_dofn_lifecycle
> Task :sdks:python:test-suites:dataflow:py39:validatesRunnerStreamingTests
[gw0] [32mPASSED[0m apache_beam/pipeline_test.py::DoFnTest::test_key_param
apache_beam/transforms/combinefn_lifecycle_test.py::CombineFnLifecycleTest::test_non_liftable_combine
[gw0] [33mSKIPPED[0m apache_beam/transforms/combinefn_lifecycle_test.py::CombineFnLifecycleTest::test_non_liftable_combine
apache_beam/transforms/ptransform_test.py::PTransformTest::test_par_do_with_multiple_outputs_and_using_return
[gw4] [32mPASSED[0m apache_beam/runners/portability/fn_api_runner/translations_test.py::TranslationsTest::test_run_packable_combine_limit
apache_beam/transforms/ptransform_test.py::PTransformTest::test_flatten_a_flattened_pcollection
> Task :sdks:python:test-suites:dataflow:py38:validatesRunnerBatchTests
[gw6] [32mPASSED[0m apache_beam/transforms/ptransform_test.py::PTransformTest::test_impulse
apache_beam/transforms/ptransform_test.py::PTransformTest::test_multiple_empty_outputs
> Task :sdks:python:test-suites:dataflow:py39:validatesRunnerStreamingTests
[gw2] [32mPASSED[0m apache_beam/transforms/ptransform_test.py::PTransformTest::test_impulse
apache_beam/transforms/ptransform_test.py::PTransformTest::test_multiple_empty_outputs
> Task :sdks:python:test-suites:dataflow:py37:validatesRunnerBatchTests
[gw2] [32mPASSED[0m apache_beam/transforms/sideinputs_test.py::SideInputsTest::test_as_list_twice
apache_beam/transforms/sideinputs_test.py::SideInputsTest::test_as_singleton_with_different_defaults
[gw3] [32mPASSED[0m apache_beam/transforms/ptransform_test.py::PTransformTest::test_impulse
apache_beam/transforms/sideinputs_test.py::SideInputsTest::test_as_list_and_as_dict_side_inputs
> Task :sdks:python:test-suites:dataflow:py38:validatesRunnerBatchTests
[gw0] [32mPASSED[0m apache_beam/transforms/sideinputs_test.py::SideInputsTest::test_as_list_twice
apache_beam/transforms/sideinputs_test.py::SideInputsTest::test_as_singleton_with_different_defaults
> Task :sdks:python:test-suites:dataflow:py39:validatesRunnerStreamingTests
[gw3] [32mPASSED[0m apache_beam/metrics/metric_test.py::MetricsTest::test_user_counter_using_pardo
apache_beam/transforms/combiners_test.py::TimestampCombinerTest::test_combiner_earliest
[gw3] [32mPASSED[0m apache_beam/transforms/combiners_test.py::TimestampCombinerTest::test_combiner_earliest
apache_beam/transforms/sideinputs_test.py::SideInputsTest::test_as_list_and_as_dict_side_inputs
[gw7] [32mPASSED[0m apache_beam/transforms/ptransform_test.py::PTransformTest::test_flatten_one_single_pcollection
apache_beam/transforms/ptransform_test.py::PTransformTest::test_flatten_pcollections
[gw6] [32mPASSED[0m apache_beam/runners/portability/fn_api_runner/translations_test.py::TranslationsTest::test_run_packable_combine_per_key
apache_beam/transforms/ptransform_test.py::PTransformTest::test_flatten_multiple_pcollections_having_multiple_consumers
[gw5] [32mPASSED[0m apache_beam/runners/portability/fn_api_runner/translations_test.py::TranslationsTest::test_run_packable_combine_globally
[gw1] [32mPASSED[0m apache_beam/pipeline_test.py::DoFnTest::test_element_param
apache_beam/transforms/combinefn_lifecycle_test.py::CombineFnLifecycleTest::test_combining_value_state
apache_beam/transforms/dofn_lifecycle_test.py::DoFnLifecycleTest::test_dofn_lifecycle
[gw1] [33mSKIPPED[0m apache_beam/transforms/combinefn_lifecycle_test.py::CombineFnLifecycleTest::test_combining_value_state
apache_beam/transforms/sideinputs_test.py::SideInputsTest::test_default_value_singleton_side_input
> Task :sdks:python:test-suites:dataflow:py37:validatesRunnerBatchTests
[gw0] [32mPASSED[0m apache_beam/transforms/ptransform_test.py::PTransformTest::test_multiple_empty_outputs
apache_beam/transforms/ptransform_test.py::PTransformTest::test_par_do_with_multiple_outputs_and_using_return
[gw1] [32mPASSED[0m apache_beam/transforms/ptransform_test.py::PTransformTest::test_par_do_with_multiple_outputs_and_using_yield
apache_beam/transforms/ptransform_test.py::PTransformTest::test_read_metrics
[gw5] [32mPASSED[0m apache_beam/transforms/dofn_lifecycle_test.py::DoFnLifecycleTest::test_dofn_lifecycle
apache_beam/transforms/ptransform_test.py::PTransformTest::test_undeclared_outputs
> Task :sdks:python:test-suites:dataflow:py38:validatesRunnerBatchTests
[gw2] [32mPASSED[0m apache_beam/transforms/dofn_lifecycle_test.py::DoFnLifecycleTest::test_dofn_lifecycle
apache_beam/transforms/sideinputs_test.py::SideInputsTest::test_default_value_singleton_side_input
[gw7] [32mPASSED[0m apache_beam/transforms/ptransform_test.py::PTransformTest::test_flatten_pcollections
apache_beam/transforms/ptransform_test.py::PTransformTest::test_read_metrics
[gw3] [32mPASSED[0m apache_beam/transforms/ptransform_test.py::PTransformTest::test_par_do_with_multiple_outputs_and_using_return
apache_beam/transforms/ptransform_test.py::PTransformTest::test_par_do_with_multiple_outputs_and_using_yield
[gw1] [32mPASSED[0m apache_beam/transforms/sideinputs_test.py::SideInputsTest::test_as_dict_twice
apache_beam/transforms/sideinputs_test.py::SideInputsTest::test_as_list_and_as_dict_side_inputs
[gw5] [32mPASSED[0m apache_beam/transforms/ptransform_test.py::PTransformTest::test_flatten_a_flattened_pcollection
apache_beam/transforms/ptransform_test.py::PTransformTest::test_undeclared_outputs
> Task :sdks:python:test-suites:dataflow:py37:validatesRunnerBatchTests
[gw6] [32mPASSED[0m apache_beam/transforms/ptransform_test.py::PTransformTest::test_flatten_pcollections
apache_beam/transforms/sideinputs_test.py::SideInputsTest::test_as_dict_twice
> Task :sdks:python:test-suites:dataflow:py38:validatesRunnerBatchTests
[gw4] [32mPASSED[0m apache_beam/transforms/ptransform_test.py::PTransformTest::test_flatten_multiple_pcollections_having_multiple_consumers
apache_beam/transforms/sideinputs_test.py::SideInputsTest::test_as_singleton_without_unique_labels
> Task :sdks:python:test-suites:dataflow:py37:validatesRunnerBatchTests
[gw7] [32mPASSED[0m apache_beam/transforms/ptransform_test.py::PTransformTest::test_flatten_a_flattened_pcollection
apache_beam/transforms/sideinputs_test.py::SideInputsTest::test_default_value_singleton_side_input
[gw4] [32mPASSED[0m apache_beam/transforms/ptransform_test.py::PTransformTest::test_flatten_multiple_pcollections_having_multiple_consumers
apache_beam/transforms/sideinputs_test.py::SideInputsTest::test_as_singleton_without_unique_labels
> Task :sdks:python:test-suites:dataflow:py38:validatesRunnerBatchTests
[gw6] [32mPASSED[0m apache_beam/transforms/ptransform_test.py::PTransformTest::test_multiple_empty_outputs
apache_beam/transforms/sideinputs_test.py::SideInputsTest::test_empty_singleton_side_input
> Task :sdks:python:test-suites:dataflow:py39:validatesRunnerStreamingTests
[gw0] [32mPASSED[0m apache_beam/transforms/ptransform_test.py::PTransformTest::test_par_do_with_multiple_outputs_and_using_return
apache_beam/transforms/ptransform_test.py::PTransformTest::test_par_do_with_multiple_outputs_and_using_yield
[gw4] [32mPASSED[0m apache_beam/transforms/ptransform_test.py::PTransformTest::test_flatten_a_flattened_pcollection
apache_beam/transforms/ptransform_test.py::PTransformTest::test_undeclared_outputs
> Task :sdks:python:test-suites:dataflow:py37:validatesRunnerBatchTests
[gw1] [32mPASSED[0m apache_beam/transforms/ptransform_test.py::PTransformTest::test_read_metrics
apache_beam/transforms/sideinputs_test.py::SideInputsTest::test_multi_valued_singleton_side_input
[gw3] [32mPASSED[0m apache_beam/transforms/sideinputs_test.py::SideInputsTest::test_as_list_and_as_dict_side_inputs
apache_beam/transforms/sideinputs_test.py::SideInputsTest::test_flattened_side_input
[gw0] [32mPASSED[0m apache_beam/transforms/ptransform_test.py::PTransformTest::test_par_do_with_multiple_outputs_and_using_return
apache_beam/transforms/sideinputs_test.py::SideInputsTest::test_iterable_side_input
> Task :sdks:python:test-suites:dataflow:py38:validatesRunnerBatchTests
[gw7] [32mPASSED[0m apache_beam/transforms/ptransform_test.py::PTransformTest::test_read_metrics
apache_beam/transforms/sideinputs_test.py::SideInputsTest::test_multi_valued_singleton_side_input
> Task :sdks:python:test-suites:dataflow:py37:validatesRunnerBatchTests
[gw2] [32mPASSED[0m apache_beam/transforms/sideinputs_test.py::SideInputsTest::test_as_singleton_with_different_defaults
apache_beam/transforms/sideinputs_test.py::SideInputsTest::test_empty_singleton_side_input
[gw6] [32mPASSED[0m apache_beam/transforms/sideinputs_test.py::SideInputsTest::test_as_dict_twice
apache_beam/transforms/util_test.py::ReshuffleTest::test_reshuffle_preserves_timestamps
> Task :sdks:python:test-suites:dataflow:py38:validatesRunnerBatchTests
[gw0] [32mPASSED[0m apache_beam/transforms/sideinputs_test.py::SideInputsTest::test_as_singleton_with_different_defaults
apache_beam/transforms/sideinputs_test.py::SideInputsTest::test_flattened_side_input
[gw2] [32mPASSED[0m apache_beam/transforms/sideinputs_test.py::SideInputsTest::test_default_value_singleton_side_input
apache_beam/transforms/sideinputs_test.py::SideInputsTest::test_iterable_side_input
[gw3] [32mPASSED[0m apache_beam/transforms/ptransform_test.py::PTransformTest::test_par_do_with_multiple_outputs_and_using_yield
apache_beam/transforms/sideinputs_test.py::SideInputsTest::test_reiterable_side_input
> Task :sdks:python:test-suites:dataflow:py37:validatesRunnerBatchTests
[gw5] [32mPASSED[0m apache_beam/transforms/ptransform_test.py::PTransformTest::test_undeclared_outputs
apache_beam/transforms/sideinputs_test.py::SideInputsTest::test_reiterable_side_input
> Task :sdks:python:test-suites:dataflow:py38:validatesRunnerBatchTests
[gw4] [32mPASSED[0m apache_beam/transforms/sideinputs_test.py::SideInputsTest::test_as_singleton_without_unique_labels
[gw5] [32mPASSED[0m apache_beam/transforms/ptransform_test.py::PTransformTest::test_undeclared_outputs
[gw1] [32mPASSED[0m apache_beam/transforms/sideinputs_test.py::SideInputsTest::test_as_list_and_as_dict_side_inputs
apache_beam/transforms/util_test.py::ReshuffleTest::test_reshuffle_preserves_timestamps
> Task :sdks:python:test-suites:dataflow:py37:validatesRunnerBatchTests
[gw4] [32mPASSED[0m apache_beam/transforms/sideinputs_test.py::SideInputsTest::test_as_singleton_without_unique_labels
[gw7] [32mPASSED[0m apache_beam/transforms/sideinputs_test.py::SideInputsTest::test_default_value_singleton_side_input
> Task :sdks:python:test-suites:dataflow:py39:validatesRunnerStreamingTests
[gw2] [32mPASSED[0m apache_beam/transforms/ptransform_test.py::PTransformTest::test_multiple_empty_outputs
apache_beam/transforms/sideinputs_test.py::SideInputsTest::test_as_dict_twice
[gw7] [32mPASSED[0m apache_beam/transforms/ptransform_test.py::PTransformTest::test_flatten_pcollections
apache_beam/transforms/sideinputs_test.py::SideInputsTest::test_as_singleton_with_different_defaults
[gw3] [32mPASSED[0m apache_beam/transforms/sideinputs_test.py::SideInputsTest::test_as_list_and_as_dict_side_inputs
apache_beam/transforms/sideinputs_test.py::SideInputsTest::test_as_list_twice
[gw5] [32mPASSED[0m apache_beam/transforms/dofn_lifecycle_test.py::DoFnLifecycleTest::test_dofn_lifecycle
apache_beam/transforms/sideinputs_test.py::SideInputsTest::test_empty_singleton_side_input
[gw6] [32mPASSED[0m apache_beam/transforms/ptransform_test.py::PTransformTest::test_flatten_multiple_pcollections_having_multiple_consumers
apache_beam/transforms/sideinputs_test.py::SideInputsTest::test_as_singleton_without_unique_labels
[gw1] [32mPASSED[0m apache_beam/transforms/sideinputs_test.py::SideInputsTest::test_default_value_singleton_side_input
apache_beam/transforms/sideinputs_test.py::SideInputsTest::test_flattened_side_input FATAL: command execution failed
java.io.IOException: Backing channel 'apache-beam-jenkins-1' is disconnected.
at hudson.remoting.RemoteInvocationHandler.channelOrFail(RemoteInvocationHandler.java:216)
at hudson.remoting.RemoteInvocationHandler.invoke(RemoteInvocationHandler.java:286)
at com.sun.proxy.$Proxy133.isAlive(Unknown Source)
at hudson.Launcher$RemoteLauncher$ProcImpl.isAlive(Launcher.java:1211)
at hudson.Launcher$RemoteLauncher$ProcImpl.join(Launcher.java:1203)
at hudson.Launcher$ProcStarter.join(Launcher.java:523)
at hudson.plugins.gradle.Gradle.perform(Gradle.java:317)
at hudson.tasks.BuildStepMonitor$1.perform(BuildStepMonitor.java:20)
at hudson.model.AbstractBuild$AbstractBuildExecution.perform(AbstractBuild.java:803)
at hudson.model.Build$BuildExecution.build(Build.java:197)
at hudson.model.Build$BuildExecution.doRun(Build.java:163)
at hudson.model.AbstractBuild$AbstractBuildExecution.run(AbstractBuild.java:513)
at hudson.model.Run.execute(Run.java:1906)
at hudson.model.FreeStyleBuild.run(FreeStyleBuild.java:43)
at hudson.model.ResourceController.execute(ResourceController.java:97)
at hudson.model.Executor.run(Executor.java:429)
Caused by: java.io.IOException: Unexpected termination of the channel
at hudson.remoting.SynchronousCommandTransport$ReaderThread.run(SynchronousCommandTransport.java:75)
Caused by: java.io.EOFException
at java.io.ObjectInputStream$PeekInputStream.readFully(ObjectInputStream.java:2799)
at java.io.ObjectInputStream$BlockDataInputStream.readShort(ObjectInputStream.java:3274)
at java.io.ObjectInputStream.readStreamHeader(ObjectInputStream.java:934)
at java.io.ObjectInputStream.<init>(ObjectInputStream.java:396)
at hudson.remoting.ObjectInputStreamEx.<init>(ObjectInputStreamEx.java:49)
at hudson.remoting.Command.readFrom(Command.java:142)
at hudson.remoting.Command.readFrom(Command.java:128)
at hudson.remoting.AbstractSynchronousByteArrayCommandTransport.read(AbstractSynchronousByteArrayCommandTransport.java:35)
at hudson.remoting.SynchronousCommandTransport$ReaderThread.run(SynchronousCommandTransport.java:61)
Build step 'Invoke Gradle script' changed build result to FAILURE
Build step 'Invoke Gradle script' marked build as failure
ERROR: apache-beam-jenkins-1 is offline; cannot locate jdk_1.8_latest
---------------------------------------------------------------------
To unsubscribe, e-mail: builds-unsubscribe@beam.apache.org
For additional commands, e-mail: builds-help@beam.apache.org