You are viewing a plain text version of this content. The canonical link for it is here.
Posted to dev@lucene.apache.org by Policeman Jenkins Server <je...@thetaphi.de> on 2017/09/23 17:40:05 UTC
[JENKINS] Lucene-Solr-master-MacOSX (64bit/jdk1.8.0) - Build # 4187
- Unstable!
Build: https://jenkins.thetaphi.de/job/Lucene-Solr-master-MacOSX/4187/
Java: 64bit/jdk1.8.0 -XX:-UseCompressedOops -XX:+UseConcMarkSweepGC
8 tests failed.
FAILED: org.apache.solr.handler.component.SpatialHeatmapFacetsTest.test
Error Message:
expected:<400> but was:<500>
Stack Trace:
java.lang.AssertionError: expected:<400> but was:<500>
at __randomizedtesting.SeedInfo.seed([C4C181504DBB8E2A:4C95BE8AE347E3D2]:0)
at org.junit.Assert.fail(Assert.java:93)
at org.junit.Assert.failNotEquals(Assert.java:647)
at org.junit.Assert.assertEquals(Assert.java:128)
at org.junit.Assert.assertEquals(Assert.java:472)
at org.junit.Assert.assertEquals(Assert.java:456)
at org.apache.solr.handler.component.SpatialHeatmapFacetsTest.test(SpatialHeatmapFacetsTest.java:62)
at sun.reflect.NativeMethodAccessorImpl.invoke0(Native Method)
at sun.reflect.NativeMethodAccessorImpl.invoke(NativeMethodAccessorImpl.java:62)
at sun.reflect.DelegatingMethodAccessorImpl.invoke(DelegatingMethodAccessorImpl.java:43)
at java.lang.reflect.Method.invoke(Method.java:498)
at com.carrotsearch.randomizedtesting.RandomizedRunner.invoke(RandomizedRunner.java:1737)
at com.carrotsearch.randomizedtesting.RandomizedRunner$8.evaluate(RandomizedRunner.java:934)
at com.carrotsearch.randomizedtesting.RandomizedRunner$9.evaluate(RandomizedRunner.java:970)
at com.carrotsearch.randomizedtesting.RandomizedRunner$10.evaluate(RandomizedRunner.java:984)
at org.apache.solr.BaseDistributedSearchTestCase$ShardsRepeatRule$ShardsRepeatStatement.callStatement(BaseDistributedSearchTestCase.java:1019)
at org.apache.solr.BaseDistributedSearchTestCase$ShardsRepeatRule$ShardsStatement.evaluate(BaseDistributedSearchTestCase.java:968)
at com.carrotsearch.randomizedtesting.rules.SystemPropertiesRestoreRule$1.evaluate(SystemPropertiesRestoreRule.java:57)
at org.apache.lucene.util.TestRuleSetupTeardownChained$1.evaluate(TestRuleSetupTeardownChained.java:49)
at org.apache.lucene.util.AbstractBeforeAfterRule$1.evaluate(AbstractBeforeAfterRule.java:45)
at org.apache.lucene.util.TestRuleThreadAndTestName$1.evaluate(TestRuleThreadAndTestName.java:48)
at org.apache.lucene.util.TestRuleIgnoreAfterMaxFailures$1.evaluate(TestRuleIgnoreAfterMaxFailures.java:64)
at org.apache.lucene.util.TestRuleMarkFailure$1.evaluate(TestRuleMarkFailure.java:47)
at com.carrotsearch.randomizedtesting.rules.StatementAdapter.evaluate(StatementAdapter.java:36)
at com.carrotsearch.randomizedtesting.ThreadLeakControl$StatementRunner.run(ThreadLeakControl.java:368)
at com.carrotsearch.randomizedtesting.ThreadLeakControl.forkTimeoutingTask(ThreadLeakControl.java:817)
at com.carrotsearch.randomizedtesting.ThreadLeakControl$3.evaluate(ThreadLeakControl.java:468)
at com.carrotsearch.randomizedtesting.RandomizedRunner.runSingleTest(RandomizedRunner.java:943)
at com.carrotsearch.randomizedtesting.RandomizedRunner$5.evaluate(RandomizedRunner.java:829)
at com.carrotsearch.randomizedtesting.RandomizedRunner$6.evaluate(RandomizedRunner.java:879)
at com.carrotsearch.randomizedtesting.RandomizedRunner$7.evaluate(RandomizedRunner.java:890)
at com.carrotsearch.randomizedtesting.rules.StatementAdapter.evaluate(StatementAdapter.java:36)
at com.carrotsearch.randomizedtesting.rules.SystemPropertiesRestoreRule$1.evaluate(SystemPropertiesRestoreRule.java:57)
at org.apache.lucene.util.AbstractBeforeAfterRule$1.evaluate(AbstractBeforeAfterRule.java:45)
at com.carrotsearch.randomizedtesting.rules.StatementAdapter.evaluate(StatementAdapter.java:36)
at org.apache.lucene.util.TestRuleStoreClassName$1.evaluate(TestRuleStoreClassName.java:41)
at com.carrotsearch.randomizedtesting.rules.NoShadowingOrOverridesOnMethodsRule$1.evaluate(NoShadowingOrOverridesOnMethodsRule.java:40)
at com.carrotsearch.randomizedtesting.rules.NoShadowingOrOverridesOnMethodsRule$1.evaluate(NoShadowingOrOverridesOnMethodsRule.java:40)
at com.carrotsearch.randomizedtesting.rules.StatementAdapter.evaluate(StatementAdapter.java:36)
at com.carrotsearch.randomizedtesting.rules.StatementAdapter.evaluate(StatementAdapter.java:36)
at com.carrotsearch.randomizedtesting.rules.StatementAdapter.evaluate(StatementAdapter.java:36)
at org.apache.lucene.util.TestRuleAssertionsRequired$1.evaluate(TestRuleAssertionsRequired.java:53)
at org.apache.lucene.util.TestRuleMarkFailure$1.evaluate(TestRuleMarkFailure.java:47)
at org.apache.lucene.util.TestRuleIgnoreAfterMaxFailures$1.evaluate(TestRuleIgnoreAfterMaxFailures.java:64)
at org.apache.lucene.util.TestRuleIgnoreTestSuites$1.evaluate(TestRuleIgnoreTestSuites.java:54)
at com.carrotsearch.randomizedtesting.rules.StatementAdapter.evaluate(StatementAdapter.java:36)
at com.carrotsearch.randomizedtesting.ThreadLeakControl$StatementRunner.run(ThreadLeakControl.java:368)
at java.lang.Thread.run(Thread.java:748)
FAILED: junit.framework.TestSuite.org.apache.solr.response.TestGeoJSONResponseWriter
Error Message:
Could not initialize class org.apache.lucene.spatial.spatial4j.Geo3dSpatialContextFactory
Stack Trace:
java.lang.NoClassDefFoundError: Could not initialize class org.apache.lucene.spatial.spatial4j.Geo3dSpatialContextFactory
at __randomizedtesting.SeedInfo.seed([C4C181504DBB8E2A]:0)
at sun.reflect.GeneratedConstructorAccessor353.newInstance(Unknown Source)
at sun.reflect.DelegatingConstructorAccessorImpl.newInstance(DelegatingConstructorAccessorImpl.java:45)
at java.lang.reflect.Constructor.newInstance(Constructor.java:423)
at java.lang.Class.newInstance(Class.java:442)
at org.locationtech.spatial4j.context.SpatialContextFactory.makeSpatialContext(SpatialContextFactory.java:103)
at org.apache.solr.schema.AbstractSpatialFieldType.init(AbstractSpatialFieldType.java:148)
at org.apache.solr.schema.RptWithGeometrySpatialField.init(RptWithGeometrySpatialField.java:53)
at org.apache.solr.schema.FieldType.setArgs(FieldType.java:183)
at org.apache.solr.schema.FieldTypePluginLoader.init(FieldTypePluginLoader.java:165)
at org.apache.solr.schema.FieldTypePluginLoader.init(FieldTypePluginLoader.java:53)
at org.apache.solr.util.plugin.AbstractPluginLoader.load(AbstractPluginLoader.java:191)
at org.apache.solr.schema.IndexSchema.readSchema(IndexSchema.java:468)
at org.apache.solr.schema.IndexSchema.<init>(IndexSchema.java:174)
at org.apache.solr.schema.IndexSchemaFactory.create(IndexSchemaFactory.java:56)
at org.apache.solr.schema.IndexSchemaFactory.buildIndexSchema(IndexSchemaFactory.java:70)
at org.apache.solr.util.TestHarness.<init>(TestHarness.java:110)
at org.apache.solr.SolrTestCaseJ4.createCore(SolrTestCaseJ4.java:687)
at org.apache.solr.SolrTestCaseJ4.initCore(SolrTestCaseJ4.java:677)
at org.apache.solr.SolrTestCaseJ4.initCore(SolrTestCaseJ4.java:551)
at org.apache.solr.SolrTestCaseJ4.initCore(SolrTestCaseJ4.java:540)
at org.apache.solr.response.TestGeoJSONResponseWriter.beforeClass(TestGeoJSONResponseWriter.java:42)
at sun.reflect.NativeMethodAccessorImpl.invoke0(Native Method)
at sun.reflect.NativeMethodAccessorImpl.invoke(NativeMethodAccessorImpl.java:62)
at sun.reflect.DelegatingMethodAccessorImpl.invoke(DelegatingMethodAccessorImpl.java:43)
at java.lang.reflect.Method.invoke(Method.java:498)
at com.carrotsearch.randomizedtesting.RandomizedRunner.invoke(RandomizedRunner.java:1737)
at com.carrotsearch.randomizedtesting.RandomizedRunner$6.evaluate(RandomizedRunner.java:874)
at com.carrotsearch.randomizedtesting.RandomizedRunner$7.evaluate(RandomizedRunner.java:890)
at com.carrotsearch.randomizedtesting.rules.StatementAdapter.evaluate(StatementAdapter.java:36)
at com.carrotsearch.randomizedtesting.rules.SystemPropertiesRestoreRule$1.evaluate(SystemPropertiesRestoreRule.java:57)
at org.apache.lucene.util.AbstractBeforeAfterRule$1.evaluate(AbstractBeforeAfterRule.java:45)
at com.carrotsearch.randomizedtesting.rules.StatementAdapter.evaluate(StatementAdapter.java:36)
at org.apache.lucene.util.TestRuleStoreClassName$1.evaluate(TestRuleStoreClassName.java:41)
at com.carrotsearch.randomizedtesting.rules.NoShadowingOrOverridesOnMethodsRule$1.evaluate(NoShadowingOrOverridesOnMethodsRule.java:40)
at com.carrotsearch.randomizedtesting.rules.NoShadowingOrOverridesOnMethodsRule$1.evaluate(NoShadowingOrOverridesOnMethodsRule.java:40)
at com.carrotsearch.randomizedtesting.rules.StatementAdapter.evaluate(StatementAdapter.java:36)
at com.carrotsearch.randomizedtesting.rules.StatementAdapter.evaluate(StatementAdapter.java:36)
at com.carrotsearch.randomizedtesting.rules.StatementAdapter.evaluate(StatementAdapter.java:36)
at org.apache.lucene.util.TestRuleAssertionsRequired$1.evaluate(TestRuleAssertionsRequired.java:53)
at org.apache.lucene.util.TestRuleMarkFailure$1.evaluate(TestRuleMarkFailure.java:47)
at org.apache.lucene.util.TestRuleIgnoreAfterMaxFailures$1.evaluate(TestRuleIgnoreAfterMaxFailures.java:64)
at org.apache.lucene.util.TestRuleIgnoreTestSuites$1.evaluate(TestRuleIgnoreTestSuites.java:54)
at com.carrotsearch.randomizedtesting.rules.StatementAdapter.evaluate(StatementAdapter.java:36)
at com.carrotsearch.randomizedtesting.ThreadLeakControl$StatementRunner.run(ThreadLeakControl.java:368)
at java.lang.Thread.run(Thread.java:748)
FAILED: org.apache.solr.schema.SpatialRPTFieldTypeTest.testGeoDistanceFunctionWithKilometers
Error Message:
Could not initialize class org.apache.lucene.spatial.spatial4j.Geo3dSpatialContextFactory
Stack Trace:
java.lang.NoClassDefFoundError: Could not initialize class org.apache.lucene.spatial.spatial4j.Geo3dSpatialContextFactory
at __randomizedtesting.SeedInfo.seed([C4C181504DBB8E2A:49AF3CB4F91AD445]:0)
at sun.reflect.GeneratedConstructorAccessor353.newInstance(Unknown Source)
at sun.reflect.DelegatingConstructorAccessorImpl.newInstance(DelegatingConstructorAccessorImpl.java:45)
at java.lang.reflect.Constructor.newInstance(Constructor.java:423)
at java.lang.Class.newInstance(Class.java:442)
at org.locationtech.spatial4j.context.SpatialContextFactory.makeSpatialContext(SpatialContextFactory.java:103)
at org.apache.solr.schema.AbstractSpatialFieldType.init(AbstractSpatialFieldType.java:148)
at org.apache.solr.schema.AbstractSpatialPrefixTreeFieldType.init(AbstractSpatialPrefixTreeFieldType.java:55)
at org.apache.solr.schema.SpatialRecursivePrefixTreeFieldType.init(SpatialRecursivePrefixTreeFieldType.java:37)
at org.apache.solr.schema.SpatialRPTFieldTypeTest.setupRPTField(SpatialRPTFieldTypeTest.java:271)
at org.apache.solr.schema.SpatialRPTFieldTypeTest.setupRPTField(SpatialRPTFieldTypeTest.java:282)
at org.apache.solr.schema.SpatialRPTFieldTypeTest.testGeoDistanceFunctionWithKilometers(SpatialRPTFieldTypeTest.java:177)
at sun.reflect.NativeMethodAccessorImpl.invoke0(Native Method)
at sun.reflect.NativeMethodAccessorImpl.invoke(NativeMethodAccessorImpl.java:62)
at sun.reflect.DelegatingMethodAccessorImpl.invoke(DelegatingMethodAccessorImpl.java:43)
at java.lang.reflect.Method.invoke(Method.java:498)
at com.carrotsearch.randomizedtesting.RandomizedRunner.invoke(RandomizedRunner.java:1737)
at com.carrotsearch.randomizedtesting.RandomizedRunner$8.evaluate(RandomizedRunner.java:934)
at com.carrotsearch.randomizedtesting.RandomizedRunner$9.evaluate(RandomizedRunner.java:970)
at com.carrotsearch.randomizedtesting.RandomizedRunner$10.evaluate(RandomizedRunner.java:984)
at com.carrotsearch.randomizedtesting.rules.SystemPropertiesRestoreRule$1.evaluate(SystemPropertiesRestoreRule.java:57)
at org.apache.lucene.util.TestRuleSetupTeardownChained$1.evaluate(TestRuleSetupTeardownChained.java:49)
at org.apache.lucene.util.AbstractBeforeAfterRule$1.evaluate(AbstractBeforeAfterRule.java:45)
at org.apache.lucene.util.TestRuleThreadAndTestName$1.evaluate(TestRuleThreadAndTestName.java:48)
at org.apache.lucene.util.TestRuleIgnoreAfterMaxFailures$1.evaluate(TestRuleIgnoreAfterMaxFailures.java:64)
at org.apache.lucene.util.TestRuleMarkFailure$1.evaluate(TestRuleMarkFailure.java:47)
at com.carrotsearch.randomizedtesting.rules.StatementAdapter.evaluate(StatementAdapter.java:36)
at com.carrotsearch.randomizedtesting.ThreadLeakControl$StatementRunner.run(ThreadLeakControl.java:368)
at com.carrotsearch.randomizedtesting.ThreadLeakControl.forkTimeoutingTask(ThreadLeakControl.java:817)
at com.carrotsearch.randomizedtesting.ThreadLeakControl$3.evaluate(ThreadLeakControl.java:468)
at com.carrotsearch.randomizedtesting.RandomizedRunner.runSingleTest(RandomizedRunner.java:943)
at com.carrotsearch.randomizedtesting.RandomizedRunner$5.evaluate(RandomizedRunner.java:829)
at com.carrotsearch.randomizedtesting.RandomizedRunner$6.evaluate(RandomizedRunner.java:879)
at com.carrotsearch.randomizedtesting.RandomizedRunner$7.evaluate(RandomizedRunner.java:890)
at com.carrotsearch.randomizedtesting.rules.StatementAdapter.evaluate(StatementAdapter.java:36)
at com.carrotsearch.randomizedtesting.rules.SystemPropertiesRestoreRule$1.evaluate(SystemPropertiesRestoreRule.java:57)
at org.apache.lucene.util.AbstractBeforeAfterRule$1.evaluate(AbstractBeforeAfterRule.java:45)
at com.carrotsearch.randomizedtesting.rules.StatementAdapter.evaluate(StatementAdapter.java:36)
at org.apache.lucene.util.TestRuleStoreClassName$1.evaluate(TestRuleStoreClassName.java:41)
at com.carrotsearch.randomizedtesting.rules.NoShadowingOrOverridesOnMethodsRule$1.evaluate(NoShadowingOrOverridesOnMethodsRule.java:40)
at com.carrotsearch.randomizedtesting.rules.NoShadowingOrOverridesOnMethodsRule$1.evaluate(NoShadowingOrOverridesOnMethodsRule.java:40)
at com.carrotsearch.randomizedtesting.rules.StatementAdapter.evaluate(StatementAdapter.java:36)
at com.carrotsearch.randomizedtesting.rules.StatementAdapter.evaluate(StatementAdapter.java:36)
at com.carrotsearch.randomizedtesting.rules.StatementAdapter.evaluate(StatementAdapter.java:36)
at org.apache.lucene.util.TestRuleAssertionsRequired$1.evaluate(TestRuleAssertionsRequired.java:53)
at org.apache.lucene.util.TestRuleMarkFailure$1.evaluate(TestRuleMarkFailure.java:47)
at org.apache.lucene.util.TestRuleIgnoreAfterMaxFailures$1.evaluate(TestRuleIgnoreAfterMaxFailures.java:64)
at org.apache.lucene.util.TestRuleIgnoreTestSuites$1.evaluate(TestRuleIgnoreTestSuites.java:54)
at com.carrotsearch.randomizedtesting.rules.StatementAdapter.evaluate(StatementAdapter.java:36)
at com.carrotsearch.randomizedtesting.ThreadLeakControl$StatementRunner.run(ThreadLeakControl.java:368)
at java.lang.Thread.run(Thread.java:748)
FAILED: org.apache.solr.schema.SpatialRPTFieldTypeTest.testJunkValuesForDistanceUnits
Error Message:
Could not initialize class org.apache.lucene.spatial.spatial4j.Geo3dSpatialContextFactory
Stack Trace:
java.lang.NoClassDefFoundError: Could not initialize class org.apache.lucene.spatial.spatial4j.Geo3dSpatialContextFactory
at __randomizedtesting.SeedInfo.seed([C4C181504DBB8E2A:FD6CDBF852BB89FD]:0)
at sun.reflect.GeneratedConstructorAccessor353.newInstance(Unknown Source)
at sun.reflect.DelegatingConstructorAccessorImpl.newInstance(DelegatingConstructorAccessorImpl.java:45)
at java.lang.reflect.Constructor.newInstance(Constructor.java:423)
at java.lang.Class.newInstance(Class.java:442)
at org.locationtech.spatial4j.context.SpatialContextFactory.makeSpatialContext(SpatialContextFactory.java:103)
at org.apache.solr.schema.AbstractSpatialFieldType.init(AbstractSpatialFieldType.java:148)
at org.apache.solr.schema.AbstractSpatialPrefixTreeFieldType.init(AbstractSpatialPrefixTreeFieldType.java:55)
at org.apache.solr.schema.SpatialRecursivePrefixTreeFieldType.init(SpatialRecursivePrefixTreeFieldType.java:37)
at org.apache.solr.schema.SpatialRPTFieldTypeTest.setupRPTField(SpatialRPTFieldTypeTest.java:271)
at org.apache.solr.schema.SpatialRPTFieldTypeTest.setupRPTField(SpatialRPTFieldTypeTest.java:282)
at org.apache.solr.schema.SpatialRPTFieldTypeTest.testJunkValuesForDistanceUnits(SpatialRPTFieldTypeTest.java:114)
at sun.reflect.NativeMethodAccessorImpl.invoke0(Native Method)
at sun.reflect.NativeMethodAccessorImpl.invoke(NativeMethodAccessorImpl.java:62)
at sun.reflect.DelegatingMethodAccessorImpl.invoke(DelegatingMethodAccessorImpl.java:43)
at java.lang.reflect.Method.invoke(Method.java:498)
at com.carrotsearch.randomizedtesting.RandomizedRunner.invoke(RandomizedRunner.java:1737)
at com.carrotsearch.randomizedtesting.RandomizedRunner$8.evaluate(RandomizedRunner.java:934)
at com.carrotsearch.randomizedtesting.RandomizedRunner$9.evaluate(RandomizedRunner.java:970)
at com.carrotsearch.randomizedtesting.RandomizedRunner$10.evaluate(RandomizedRunner.java:984)
at com.carrotsearch.randomizedtesting.rules.SystemPropertiesRestoreRule$1.evaluate(SystemPropertiesRestoreRule.java:57)
at org.apache.lucene.util.TestRuleSetupTeardownChained$1.evaluate(TestRuleSetupTeardownChained.java:49)
at org.apache.lucene.util.AbstractBeforeAfterRule$1.evaluate(AbstractBeforeAfterRule.java:45)
at org.apache.lucene.util.TestRuleThreadAndTestName$1.evaluate(TestRuleThreadAndTestName.java:48)
at org.apache.lucene.util.TestRuleIgnoreAfterMaxFailures$1.evaluate(TestRuleIgnoreAfterMaxFailures.java:64)
at org.apache.lucene.util.TestRuleMarkFailure$1.evaluate(TestRuleMarkFailure.java:47)
at com.carrotsearch.randomizedtesting.rules.StatementAdapter.evaluate(StatementAdapter.java:36)
at com.carrotsearch.randomizedtesting.ThreadLeakControl$StatementRunner.run(ThreadLeakControl.java:368)
at com.carrotsearch.randomizedtesting.ThreadLeakControl.forkTimeoutingTask(ThreadLeakControl.java:817)
at com.carrotsearch.randomizedtesting.ThreadLeakControl$3.evaluate(ThreadLeakControl.java:468)
at com.carrotsearch.randomizedtesting.RandomizedRunner.runSingleTest(RandomizedRunner.java:943)
at com.carrotsearch.randomizedtesting.RandomizedRunner$5.evaluate(RandomizedRunner.java:829)
at com.carrotsearch.randomizedtesting.RandomizedRunner$6.evaluate(RandomizedRunner.java:879)
at com.carrotsearch.randomizedtesting.RandomizedRunner$7.evaluate(RandomizedRunner.java:890)
at com.carrotsearch.randomizedtesting.rules.StatementAdapter.evaluate(StatementAdapter.java:36)
at com.carrotsearch.randomizedtesting.rules.SystemPropertiesRestoreRule$1.evaluate(SystemPropertiesRestoreRule.java:57)
at org.apache.lucene.util.AbstractBeforeAfterRule$1.evaluate(AbstractBeforeAfterRule.java:45)
at com.carrotsearch.randomizedtesting.rules.StatementAdapter.evaluate(StatementAdapter.java:36)
at org.apache.lucene.util.TestRuleStoreClassName$1.evaluate(TestRuleStoreClassName.java:41)
at com.carrotsearch.randomizedtesting.rules.NoShadowingOrOverridesOnMethodsRule$1.evaluate(NoShadowingOrOverridesOnMethodsRule.java:40)
at com.carrotsearch.randomizedtesting.rules.NoShadowingOrOverridesOnMethodsRule$1.evaluate(NoShadowingOrOverridesOnMethodsRule.java:40)
at com.carrotsearch.randomizedtesting.rules.StatementAdapter.evaluate(StatementAdapter.java:36)
at com.carrotsearch.randomizedtesting.rules.StatementAdapter.evaluate(StatementAdapter.java:36)
at com.carrotsearch.randomizedtesting.rules.StatementAdapter.evaluate(StatementAdapter.java:36)
at org.apache.lucene.util.TestRuleAssertionsRequired$1.evaluate(TestRuleAssertionsRequired.java:53)
at org.apache.lucene.util.TestRuleMarkFailure$1.evaluate(TestRuleMarkFailure.java:47)
at org.apache.lucene.util.TestRuleIgnoreAfterMaxFailures$1.evaluate(TestRuleIgnoreAfterMaxFailures.java:64)
at org.apache.lucene.util.TestRuleIgnoreTestSuites$1.evaluate(TestRuleIgnoreTestSuites.java:54)
at com.carrotsearch.randomizedtesting.rules.StatementAdapter.evaluate(StatementAdapter.java:36)
at com.carrotsearch.randomizedtesting.ThreadLeakControl$StatementRunner.run(ThreadLeakControl.java:368)
at java.lang.Thread.run(Thread.java:748)
FAILED: org.apache.solr.schema.SpatialRPTFieldTypeTest.testShapeToFromStringGeoJSON
Error Message:
Could not initialize class org.apache.lucene.spatial.spatial4j.Geo3dSpatialContextFactory
Stack Trace:
java.lang.NoClassDefFoundError: Could not initialize class org.apache.lucene.spatial.spatial4j.Geo3dSpatialContextFactory
at __randomizedtesting.SeedInfo.seed([C4C181504DBB8E2A:E20E5DEC04A52BB2]:0)
at sun.reflect.GeneratedConstructorAccessor353.newInstance(Unknown Source)
at sun.reflect.DelegatingConstructorAccessorImpl.newInstance(DelegatingConstructorAccessorImpl.java:45)
at java.lang.reflect.Constructor.newInstance(Constructor.java:423)
at java.lang.Class.newInstance(Class.java:442)
at org.locationtech.spatial4j.context.SpatialContextFactory.makeSpatialContext(SpatialContextFactory.java:103)
at org.apache.solr.schema.AbstractSpatialFieldType.init(AbstractSpatialFieldType.java:148)
at org.apache.solr.schema.RptWithGeometrySpatialField.init(RptWithGeometrySpatialField.java:53)
at org.apache.solr.schema.SpatialRPTFieldTypeTest.setupRPTField(SpatialRPTFieldTypeTest.java:271)
at org.apache.solr.schema.SpatialRPTFieldTypeTest.testShapeToFromStringGeoJSON(SpatialRPTFieldTypeTest.java:230)
at sun.reflect.NativeMethodAccessorImpl.invoke0(Native Method)
at sun.reflect.NativeMethodAccessorImpl.invoke(NativeMethodAccessorImpl.java:62)
at sun.reflect.DelegatingMethodAccessorImpl.invoke(DelegatingMethodAccessorImpl.java:43)
at java.lang.reflect.Method.invoke(Method.java:498)
at com.carrotsearch.randomizedtesting.RandomizedRunner.invoke(RandomizedRunner.java:1737)
at com.carrotsearch.randomizedtesting.RandomizedRunner$8.evaluate(RandomizedRunner.java:934)
at com.carrotsearch.randomizedtesting.RandomizedRunner$9.evaluate(RandomizedRunner.java:970)
at com.carrotsearch.randomizedtesting.RandomizedRunner$10.evaluate(RandomizedRunner.java:984)
at com.carrotsearch.randomizedtesting.rules.SystemPropertiesRestoreRule$1.evaluate(SystemPropertiesRestoreRule.java:57)
at org.apache.lucene.util.TestRuleSetupTeardownChained$1.evaluate(TestRuleSetupTeardownChained.java:49)
at org.apache.lucene.util.AbstractBeforeAfterRule$1.evaluate(AbstractBeforeAfterRule.java:45)
at org.apache.lucene.util.TestRuleThreadAndTestName$1.evaluate(TestRuleThreadAndTestName.java:48)
at org.apache.lucene.util.TestRuleIgnoreAfterMaxFailures$1.evaluate(TestRuleIgnoreAfterMaxFailures.java:64)
at org.apache.lucene.util.TestRuleMarkFailure$1.evaluate(TestRuleMarkFailure.java:47)
at com.carrotsearch.randomizedtesting.rules.StatementAdapter.evaluate(StatementAdapter.java:36)
at com.carrotsearch.randomizedtesting.ThreadLeakControl$StatementRunner.run(ThreadLeakControl.java:368)
at com.carrotsearch.randomizedtesting.ThreadLeakControl.forkTimeoutingTask(ThreadLeakControl.java:817)
at com.carrotsearch.randomizedtesting.ThreadLeakControl$3.evaluate(ThreadLeakControl.java:468)
at com.carrotsearch.randomizedtesting.RandomizedRunner.runSingleTest(RandomizedRunner.java:943)
at com.carrotsearch.randomizedtesting.RandomizedRunner$5.evaluate(RandomizedRunner.java:829)
at com.carrotsearch.randomizedtesting.RandomizedRunner$6.evaluate(RandomizedRunner.java:879)
at com.carrotsearch.randomizedtesting.RandomizedRunner$7.evaluate(RandomizedRunner.java:890)
at com.carrotsearch.randomizedtesting.rules.StatementAdapter.evaluate(StatementAdapter.java:36)
at com.carrotsearch.randomizedtesting.rules.SystemPropertiesRestoreRule$1.evaluate(SystemPropertiesRestoreRule.java:57)
at org.apache.lucene.util.AbstractBeforeAfterRule$1.evaluate(AbstractBeforeAfterRule.java:45)
at com.carrotsearch.randomizedtesting.rules.StatementAdapter.evaluate(StatementAdapter.java:36)
at org.apache.lucene.util.TestRuleStoreClassName$1.evaluate(TestRuleStoreClassName.java:41)
at com.carrotsearch.randomizedtesting.rules.NoShadowingOrOverridesOnMethodsRule$1.evaluate(NoShadowingOrOverridesOnMethodsRule.java:40)
at com.carrotsearch.randomizedtesting.rules.NoShadowingOrOverridesOnMethodsRule$1.evaluate(NoShadowingOrOverridesOnMethodsRule.java:40)
at com.carrotsearch.randomizedtesting.rules.StatementAdapter.evaluate(StatementAdapter.java:36)
at com.carrotsearch.randomizedtesting.rules.StatementAdapter.evaluate(StatementAdapter.java:36)
at com.carrotsearch.randomizedtesting.rules.StatementAdapter.evaluate(StatementAdapter.java:36)
at org.apache.lucene.util.TestRuleAssertionsRequired$1.evaluate(TestRuleAssertionsRequired.java:53)
at org.apache.lucene.util.TestRuleMarkFailure$1.evaluate(TestRuleMarkFailure.java:47)
at org.apache.lucene.util.TestRuleIgnoreAfterMaxFailures$1.evaluate(TestRuleIgnoreAfterMaxFailures.java:64)
at org.apache.lucene.util.TestRuleIgnoreTestSuites$1.evaluate(TestRuleIgnoreTestSuites.java:54)
at com.carrotsearch.randomizedtesting.rules.StatementAdapter.evaluate(StatementAdapter.java:36)
at com.carrotsearch.randomizedtesting.ThreadLeakControl$StatementRunner.run(ThreadLeakControl.java:368)
at java.lang.Thread.run(Thread.java:748)
FAILED: org.apache.solr.schema.SpatialRPTFieldTypeTest.testDistanceUnitsDegrees
Error Message:
Could not initialize class org.apache.lucene.spatial.spatial4j.Geo3dSpatialContextFactory
Stack Trace:
java.lang.NoClassDefFoundError: Could not initialize class org.apache.lucene.spatial.spatial4j.Geo3dSpatialContextFactory
at __randomizedtesting.SeedInfo.seed([C4C181504DBB8E2A:2A8BA3FEB9B78770]:0)
at sun.reflect.GeneratedConstructorAccessor353.newInstance(Unknown Source)
at sun.reflect.DelegatingConstructorAccessorImpl.newInstance(DelegatingConstructorAccessorImpl.java:45)
at java.lang.reflect.Constructor.newInstance(Constructor.java:423)
at java.lang.Class.newInstance(Class.java:442)
at org.locationtech.spatial4j.context.SpatialContextFactory.makeSpatialContext(SpatialContextFactory.java:103)
at org.apache.solr.schema.AbstractSpatialFieldType.init(AbstractSpatialFieldType.java:148)
at org.apache.solr.schema.AbstractSpatialPrefixTreeFieldType.init(AbstractSpatialPrefixTreeFieldType.java:55)
at org.apache.solr.schema.SpatialRecursivePrefixTreeFieldType.init(SpatialRecursivePrefixTreeFieldType.java:37)
at org.apache.solr.schema.SpatialRPTFieldTypeTest.setupRPTField(SpatialRPTFieldTypeTest.java:271)
at org.apache.solr.schema.SpatialRPTFieldTypeTest.setupRPTField(SpatialRPTFieldTypeTest.java:282)
at org.apache.solr.schema.SpatialRPTFieldTypeTest.testDistanceUnitsDegrees(SpatialRPTFieldTypeTest.java:73)
at sun.reflect.NativeMethodAccessorImpl.invoke0(Native Method)
at sun.reflect.NativeMethodAccessorImpl.invoke(NativeMethodAccessorImpl.java:62)
at sun.reflect.DelegatingMethodAccessorImpl.invoke(DelegatingMethodAccessorImpl.java:43)
at java.lang.reflect.Method.invoke(Method.java:498)
at com.carrotsearch.randomizedtesting.RandomizedRunner.invoke(RandomizedRunner.java:1737)
at com.carrotsearch.randomizedtesting.RandomizedRunner$8.evaluate(RandomizedRunner.java:934)
at com.carrotsearch.randomizedtesting.RandomizedRunner$9.evaluate(RandomizedRunner.java:970)
at com.carrotsearch.randomizedtesting.RandomizedRunner$10.evaluate(RandomizedRunner.java:984)
at com.carrotsearch.randomizedtesting.rules.SystemPropertiesRestoreRule$1.evaluate(SystemPropertiesRestoreRule.java:57)
at org.apache.lucene.util.TestRuleSetupTeardownChained$1.evaluate(TestRuleSetupTeardownChained.java:49)
at org.apache.lucene.util.AbstractBeforeAfterRule$1.evaluate(AbstractBeforeAfterRule.java:45)
at org.apache.lucene.util.TestRuleThreadAndTestName$1.evaluate(TestRuleThreadAndTestName.java:48)
at org.apache.lucene.util.TestRuleIgnoreAfterMaxFailures$1.evaluate(TestRuleIgnoreAfterMaxFailures.java:64)
at org.apache.lucene.util.TestRuleMarkFailure$1.evaluate(TestRuleMarkFailure.java:47)
at com.carrotsearch.randomizedtesting.rules.StatementAdapter.evaluate(StatementAdapter.java:36)
at com.carrotsearch.randomizedtesting.ThreadLeakControl$StatementRunner.run(ThreadLeakControl.java:368)
at com.carrotsearch.randomizedtesting.ThreadLeakControl.forkTimeoutingTask(ThreadLeakControl.java:817)
at com.carrotsearch.randomizedtesting.ThreadLeakControl$3.evaluate(ThreadLeakControl.java:468)
at com.carrotsearch.randomizedtesting.RandomizedRunner.runSingleTest(RandomizedRunner.java:943)
at com.carrotsearch.randomizedtesting.RandomizedRunner$5.evaluate(RandomizedRunner.java:829)
at com.carrotsearch.randomizedtesting.RandomizedRunner$6.evaluate(RandomizedRunner.java:879)
at com.carrotsearch.randomizedtesting.RandomizedRunner$7.evaluate(RandomizedRunner.java:890)
at com.carrotsearch.randomizedtesting.rules.StatementAdapter.evaluate(StatementAdapter.java:36)
at com.carrotsearch.randomizedtesting.rules.SystemPropertiesRestoreRule$1.evaluate(SystemPropertiesRestoreRule.java:57)
at org.apache.lucene.util.AbstractBeforeAfterRule$1.evaluate(AbstractBeforeAfterRule.java:45)
at com.carrotsearch.randomizedtesting.rules.StatementAdapter.evaluate(StatementAdapter.java:36)
at org.apache.lucene.util.TestRuleStoreClassName$1.evaluate(TestRuleStoreClassName.java:41)
at com.carrotsearch.randomizedtesting.rules.NoShadowingOrOverridesOnMethodsRule$1.evaluate(NoShadowingOrOverridesOnMethodsRule.java:40)
at com.carrotsearch.randomizedtesting.rules.NoShadowingOrOverridesOnMethodsRule$1.evaluate(NoShadowingOrOverridesOnMethodsRule.java:40)
at com.carrotsearch.randomizedtesting.rules.StatementAdapter.evaluate(StatementAdapter.java:36)
at com.carrotsearch.randomizedtesting.rules.StatementAdapter.evaluate(StatementAdapter.java:36)
at com.carrotsearch.randomizedtesting.rules.StatementAdapter.evaluate(StatementAdapter.java:36)
at org.apache.lucene.util.TestRuleAssertionsRequired$1.evaluate(TestRuleAssertionsRequired.java:53)
at org.apache.lucene.util.TestRuleMarkFailure$1.evaluate(TestRuleMarkFailure.java:47)
at org.apache.lucene.util.TestRuleIgnoreAfterMaxFailures$1.evaluate(TestRuleIgnoreAfterMaxFailures.java:64)
at org.apache.lucene.util.TestRuleIgnoreTestSuites$1.evaluate(TestRuleIgnoreTestSuites.java:54)
at com.carrotsearch.randomizedtesting.rules.StatementAdapter.evaluate(StatementAdapter.java:36)
at com.carrotsearch.randomizedtesting.ThreadLeakControl$StatementRunner.run(ThreadLeakControl.java:368)
at java.lang.Thread.run(Thread.java:748)
FAILED: junit.framework.TestSuite.org.apache.solr.search.TestSolr4Spatial
Error Message:
Could not initialize class org.apache.lucene.spatial.spatial4j.Geo3dSpatialContextFactory
Stack Trace:
java.lang.NoClassDefFoundError: Could not initialize class org.apache.lucene.spatial.spatial4j.Geo3dSpatialContextFactory
at __randomizedtesting.SeedInfo.seed([C4C181504DBB8E2A]:0)
at sun.reflect.GeneratedConstructorAccessor353.newInstance(Unknown Source)
at sun.reflect.DelegatingConstructorAccessorImpl.newInstance(DelegatingConstructorAccessorImpl.java:45)
at java.lang.reflect.Constructor.newInstance(Constructor.java:423)
at java.lang.Class.newInstance(Class.java:442)
at org.locationtech.spatial4j.context.SpatialContextFactory.makeSpatialContext(SpatialContextFactory.java:103)
at org.apache.solr.schema.AbstractSpatialFieldType.init(AbstractSpatialFieldType.java:148)
at org.apache.solr.schema.RptWithGeometrySpatialField.init(RptWithGeometrySpatialField.java:53)
at org.apache.solr.schema.FieldType.setArgs(FieldType.java:183)
at org.apache.solr.schema.FieldTypePluginLoader.init(FieldTypePluginLoader.java:165)
at org.apache.solr.schema.FieldTypePluginLoader.init(FieldTypePluginLoader.java:53)
at org.apache.solr.util.plugin.AbstractPluginLoader.load(AbstractPluginLoader.java:191)
at org.apache.solr.schema.IndexSchema.readSchema(IndexSchema.java:468)
at org.apache.solr.schema.IndexSchema.<init>(IndexSchema.java:174)
at org.apache.solr.schema.IndexSchemaFactory.create(IndexSchemaFactory.java:56)
at org.apache.solr.schema.IndexSchemaFactory.buildIndexSchema(IndexSchemaFactory.java:70)
at org.apache.solr.util.TestHarness.<init>(TestHarness.java:110)
at org.apache.solr.SolrTestCaseJ4.createCore(SolrTestCaseJ4.java:687)
at org.apache.solr.SolrTestCaseJ4.initCore(SolrTestCaseJ4.java:677)
at org.apache.solr.SolrTestCaseJ4.initCore(SolrTestCaseJ4.java:551)
at org.apache.solr.SolrTestCaseJ4.initCore(SolrTestCaseJ4.java:540)
at org.apache.solr.search.TestSolr4Spatial.beforeClass(TestSolr4Spatial.java:62)
at sun.reflect.NativeMethodAccessorImpl.invoke0(Native Method)
at sun.reflect.NativeMethodAccessorImpl.invoke(NativeMethodAccessorImpl.java:62)
at sun.reflect.DelegatingMethodAccessorImpl.invoke(DelegatingMethodAccessorImpl.java:43)
at java.lang.reflect.Method.invoke(Method.java:498)
at com.carrotsearch.randomizedtesting.RandomizedRunner.invoke(RandomizedRunner.java:1737)
at com.carrotsearch.randomizedtesting.RandomizedRunner$6.evaluate(RandomizedRunner.java:874)
at com.carrotsearch.randomizedtesting.RandomizedRunner$7.evaluate(RandomizedRunner.java:890)
at com.carrotsearch.randomizedtesting.rules.StatementAdapter.evaluate(StatementAdapter.java:36)
at com.carrotsearch.randomizedtesting.rules.SystemPropertiesRestoreRule$1.evaluate(SystemPropertiesRestoreRule.java:57)
at org.apache.lucene.util.AbstractBeforeAfterRule$1.evaluate(AbstractBeforeAfterRule.java:45)
at com.carrotsearch.randomizedtesting.rules.StatementAdapter.evaluate(StatementAdapter.java:36)
at org.apache.lucene.util.TestRuleStoreClassName$1.evaluate(TestRuleStoreClassName.java:41)
at com.carrotsearch.randomizedtesting.rules.NoShadowingOrOverridesOnMethodsRule$1.evaluate(NoShadowingOrOverridesOnMethodsRule.java:40)
at com.carrotsearch.randomizedtesting.rules.NoShadowingOrOverridesOnMethodsRule$1.evaluate(NoShadowingOrOverridesOnMethodsRule.java:40)
at com.carrotsearch.randomizedtesting.rules.StatementAdapter.evaluate(StatementAdapter.java:36)
at com.carrotsearch.randomizedtesting.rules.StatementAdapter.evaluate(StatementAdapter.java:36)
at com.carrotsearch.randomizedtesting.rules.StatementAdapter.evaluate(StatementAdapter.java:36)
at org.apache.lucene.util.TestRuleAssertionsRequired$1.evaluate(TestRuleAssertionsRequired.java:53)
at org.apache.lucene.util.TestRuleMarkFailure$1.evaluate(TestRuleMarkFailure.java:47)
at org.apache.lucene.util.TestRuleIgnoreAfterMaxFailures$1.evaluate(TestRuleIgnoreAfterMaxFailures.java:64)
at org.apache.lucene.util.TestRuleIgnoreTestSuites$1.evaluate(TestRuleIgnoreTestSuites.java:54)
at com.carrotsearch.randomizedtesting.rules.StatementAdapter.evaluate(StatementAdapter.java:36)
at com.carrotsearch.randomizedtesting.ThreadLeakControl$StatementRunner.run(ThreadLeakControl.java:368)
at java.lang.Thread.run(Thread.java:748)
FAILED: junit.framework.TestSuite.org.apache.solr.search.TestSolr4Spatial2
Error Message:
org/apache/lucene/spatial3d/geom/PlanetModel
Stack Trace:
java.lang.NoClassDefFoundError: org/apache/lucene/spatial3d/geom/PlanetModel
at __randomizedtesting.SeedInfo.seed([C4C181504DBB8E2A]:0)
at org.apache.lucene.spatial.spatial4j.Geo3dSpatialContextFactory.<clinit>(Geo3dSpatialContextFactory.java:36)
at sun.reflect.NativeConstructorAccessorImpl.newInstance0(Native Method)
at sun.reflect.NativeConstructorAccessorImpl.newInstance(NativeConstructorAccessorImpl.java:62)
at sun.reflect.DelegatingConstructorAccessorImpl.newInstance(DelegatingConstructorAccessorImpl.java:45)
at java.lang.reflect.Constructor.newInstance(Constructor.java:423)
at java.lang.Class.newInstance(Class.java:442)
at org.locationtech.spatial4j.context.SpatialContextFactory.makeSpatialContext(SpatialContextFactory.java:103)
at org.apache.solr.schema.AbstractSpatialFieldType.init(AbstractSpatialFieldType.java:148)
at org.apache.solr.schema.RptWithGeometrySpatialField.init(RptWithGeometrySpatialField.java:53)
at org.apache.solr.schema.FieldType.setArgs(FieldType.java:183)
at org.apache.solr.schema.FieldTypePluginLoader.init(FieldTypePluginLoader.java:165)
at org.apache.solr.schema.FieldTypePluginLoader.init(FieldTypePluginLoader.java:53)
at org.apache.solr.util.plugin.AbstractPluginLoader.load(AbstractPluginLoader.java:191)
at org.apache.solr.schema.IndexSchema.readSchema(IndexSchema.java:468)
at org.apache.solr.schema.IndexSchema.<init>(IndexSchema.java:174)
at org.apache.solr.schema.IndexSchemaFactory.create(IndexSchemaFactory.java:56)
at org.apache.solr.schema.IndexSchemaFactory.buildIndexSchema(IndexSchemaFactory.java:70)
at org.apache.solr.util.TestHarness.<init>(TestHarness.java:110)
at org.apache.solr.SolrTestCaseJ4.createCore(SolrTestCaseJ4.java:687)
at org.apache.solr.SolrTestCaseJ4.initCore(SolrTestCaseJ4.java:677)
at org.apache.solr.SolrTestCaseJ4.initCore(SolrTestCaseJ4.java:551)
at org.apache.solr.SolrTestCaseJ4.initCore(SolrTestCaseJ4.java:540)
at org.apache.solr.search.TestSolr4Spatial2.beforeClass(TestSolr4Spatial2.java:34)
at sun.reflect.NativeMethodAccessorImpl.invoke0(Native Method)
at sun.reflect.NativeMethodAccessorImpl.invoke(NativeMethodAccessorImpl.java:62)
at sun.reflect.DelegatingMethodAccessorImpl.invoke(DelegatingMethodAccessorImpl.java:43)
at java.lang.reflect.Method.invoke(Method.java:498)
at com.carrotsearch.randomizedtesting.RandomizedRunner.invoke(RandomizedRunner.java:1737)
at com.carrotsearch.randomizedtesting.RandomizedRunner$6.evaluate(RandomizedRunner.java:874)
at com.carrotsearch.randomizedtesting.RandomizedRunner$7.evaluate(RandomizedRunner.java:890)
at com.carrotsearch.randomizedtesting.rules.StatementAdapter.evaluate(StatementAdapter.java:36)
at com.carrotsearch.randomizedtesting.rules.SystemPropertiesRestoreRule$1.evaluate(SystemPropertiesRestoreRule.java:57)
at org.apache.lucene.util.AbstractBeforeAfterRule$1.evaluate(AbstractBeforeAfterRule.java:45)
at com.carrotsearch.randomizedtesting.rules.StatementAdapter.evaluate(StatementAdapter.java:36)
at org.apache.lucene.util.TestRuleStoreClassName$1.evaluate(TestRuleStoreClassName.java:41)
at com.carrotsearch.randomizedtesting.rules.NoShadowingOrOverridesOnMethodsRule$1.evaluate(NoShadowingOrOverridesOnMethodsRule.java:40)
at com.carrotsearch.randomizedtesting.rules.NoShadowingOrOverridesOnMethodsRule$1.evaluate(NoShadowingOrOverridesOnMethodsRule.java:40)
at com.carrotsearch.randomizedtesting.rules.StatementAdapter.evaluate(StatementAdapter.java:36)
at com.carrotsearch.randomizedtesting.rules.StatementAdapter.evaluate(StatementAdapter.java:36)
at com.carrotsearch.randomizedtesting.rules.StatementAdapter.evaluate(StatementAdapter.java:36)
at org.apache.lucene.util.TestRuleAssertionsRequired$1.evaluate(TestRuleAssertionsRequired.java:53)
at org.apache.lucene.util.TestRuleMarkFailure$1.evaluate(TestRuleMarkFailure.java:47)
at org.apache.lucene.util.TestRuleIgnoreAfterMaxFailures$1.evaluate(TestRuleIgnoreAfterMaxFailures.java:64)
at org.apache.lucene.util.TestRuleIgnoreTestSuites$1.evaluate(TestRuleIgnoreTestSuites.java:54)
at com.carrotsearch.randomizedtesting.rules.StatementAdapter.evaluate(StatementAdapter.java:36)
at com.carrotsearch.randomizedtesting.ThreadLeakControl$StatementRunner.run(ThreadLeakControl.java:368)
at java.lang.Thread.run(Thread.java:748)
Caused by: java.lang.ClassNotFoundException: org.apache.lucene.spatial3d.geom.PlanetModel
at java.net.URLClassLoader.findClass(URLClassLoader.java:381)
at java.lang.ClassLoader.loadClass(ClassLoader.java:424)
at sun.misc.Launcher$AppClassLoader.loadClass(Launcher.java:335)
at java.lang.ClassLoader.loadClass(ClassLoader.java:357)
... 47 more
Build Log:
[...truncated 11538 lines...]
[junit4] Suite: org.apache.solr.search.TestSolr4Spatial2
[junit4] 2> Creating dataDir: /Users/jenkins/workspace/Lucene-Solr-master-MacOSX/solr/build/solr-core/test/J1/temp/solr.search.TestSolr4Spatial2_C4C181504DBB8E2A-001/init-core-data-001
[junit4] 2> 467404 WARN (SUITE-TestSolr4Spatial2-seed#[C4C181504DBB8E2A]-worker) [ ] o.a.s.SolrTestCaseJ4 startTrackingSearchers: numOpens=1 numCloses=1
[junit4] 2> 467405 INFO (SUITE-TestSolr4Spatial2-seed#[C4C181504DBB8E2A]-worker) [ ] o.a.s.SolrTestCaseJ4 Using PointFields (NUMERIC_POINTS_SYSPROP=true) w/NUMERIC_DOCVALUES_SYSPROP=true
[junit4] 2> 467409 INFO (SUITE-TestSolr4Spatial2-seed#[C4C181504DBB8E2A]-worker) [ ] o.a.s.SolrTestCaseJ4 Randomized ssl (true) and clientAuth (false) via: @org.apache.solr.util.RandomizeSSL(reason=, value=NaN, ssl=NaN, clientAuth=NaN) w/ MAC_OS_X supressed clientAuth
[junit4] 2> 467412 INFO (SUITE-TestSolr4Spatial2-seed#[C4C181504DBB8E2A]-worker) [ ] o.a.s.SolrTestCaseJ4 SecureRandom sanity checks: test.solr.allowed.securerandom=null & java.security.egd=file:/dev/./urandom
[junit4] 2> 467412 INFO (SUITE-TestSolr4Spatial2-seed#[C4C181504DBB8E2A]-worker) [ ] o.a.s.SolrTestCaseJ4 ####initCore
[junit4] 2> 467413 INFO (SUITE-TestSolr4Spatial2-seed#[C4C181504DBB8E2A]-worker) [ ] o.a.s.c.SolrResourceLoader [null] Added 2 libs to classloader, from paths: [/Users/jenkins/workspace/Lucene-Solr-master-MacOSX/solr/core/src/test-files/solr/collection1/lib, /Users/jenkins/workspace/Lucene-Solr-master-MacOSX/solr/core/src/test-files/solr/collection1/lib/classes]
[junit4] 2> 467491 INFO (SUITE-TestSolr4Spatial2-seed#[C4C181504DBB8E2A]-worker) [ ] o.a.s.c.SolrConfig Using Lucene MatchVersion: 8.0.0
[junit4] 2> 467505 INFO (SUITE-TestSolr4Spatial2-seed#[C4C181504DBB8E2A]-worker) [ ] o.a.s.s.IndexSchema [null] Schema name=test
[junit4] 2> 467538 WARN (SUITE-TestSolr4Spatial2-seed#[C4C181504DBB8E2A]-worker) [ ] o.a.s.c.SolrResourceLoader Solr loaded a deprecated plugin/analysis class [solr.SpatialTermQueryPrefixTreeFieldType]. Please consult documentation how to replace it accordingly.
[junit4] 2> 467591 WARN (SUITE-TestSolr4Spatial2-seed#[C4C181504DBB8E2A]-worker) [ ] o.a.s.c.SolrResourceLoader Solr loaded a deprecated plugin/analysis class [solr.SpatialPointVectorFieldType]. Please consult documentation how to replace it accordingly.
[junit4] 2> 467715 INFO (SUITE-TestSolr4Spatial2-seed#[C4C181504DBB8E2A]-worker) [ ] o.a.s.SolrTestCaseJ4 ------------------------------------------------------- Done waiting for tracked resources to be released
[junit4] 2> NOTE: test params are: codec=Asserting(Lucene70): {}, docValues:{}, maxPointsInLeafNode=696, maxMBSortInHeap=5.020973806187672, sim=RandomSimilarity(queryNorm=false): {}, locale=tr-TR, timezone=Africa/Lusaka
[junit4] 2> NOTE: Mac OS X 10.11.6 x86_64/Oracle Corporation 1.8.0_144 (64-bit)/cpus=3,threads=1,free=144197944,total=373542912
[junit4] 2> NOTE: All tests run in this JVM: [TestCloudPseudoReturnFields, FacetPivotSmallTest, TestReload, TestCollapseQParserPlugin, TestRandomCollapseQParserPlugin, DocValuesMultiTest, TestFieldCacheWithThreads, HealthCheckHandlerTest, SpellCheckCollatorTest, BasicAuthStandaloneTest, FileUtilsTest, SolrRequestParserTest, LeaderElectionContextKeyTest, V2ApiIntegrationTest, TestMaxScoreQueryParser, HLLUtilTest, MergeStrategyTest, ConnectionReuseTest, TestCloudSearcherWarming, TestDocSet, DistributedFacetPivotLargeTest, HdfsBasicDistributedZk2Test, TestNumericTokenStream, TestHighFrequencyDictionaryFactory, DateRangeFieldTest, TestSolrCloudWithHadoopAuthPlugin, OverseerTaskQueueTest, TestDefaultStatsCache, LukeRequestHandlerTest, ShardSplitTest, BasicFunctionalityTest, TestSolrIndexConfig, TestCoreAdminApis, TestComponentsName, TestXmlQParser, TestStressCloudBlindAtomicUpdates, TestInitParams, TestSolrCloudWithKerberosAlt, TestJoin, TestLeaderElectionZkExpiry, TestImplicitCoreProperties, SSLMigrationTest, TestFieldTypeResource, TestSolr4Spatial2]
[junit4] 2> NOTE: reproduce with: ant test -Dtestcase=TestSolr4Spatial2 -Dtests.seed=C4C181504DBB8E2A -Dtests.slow=true -Dtests.locale=tr-TR -Dtests.timezone=Africa/Lusaka -Dtests.asserts=true -Dtests.file.encoding=ISO-8859-1
[junit4] ERROR 0.00s J1 | TestSolr4Spatial2 (suite) <<<
[junit4] > Throwable #1: java.lang.NoClassDefFoundError: org/apache/lucene/spatial3d/geom/PlanetModel
[junit4] > at __randomizedtesting.SeedInfo.seed([C4C181504DBB8E2A]:0)
[junit4] > at org.apache.lucene.spatial.spatial4j.Geo3dSpatialContextFactory.<clinit>(Geo3dSpatialContextFactory.java:36)
[junit4] > at java.lang.reflect.Constructor.newInstance(Constructor.java:423)
[junit4] > at java.lang.Class.newInstance(Class.java:442)
[junit4] > at org.locationtech.spatial4j.context.SpatialContextFactory.makeSpatialContext(SpatialContextFactory.java:103)
[junit4] > at org.apache.solr.schema.AbstractSpatialFieldType.init(AbstractSpatialFieldType.java:148)
[junit4] > at org.apache.solr.schema.RptWithGeometrySpatialField.init(RptWithGeometrySpatialField.java:53)
[junit4] > at org.apache.solr.schema.FieldType.setArgs(FieldType.java:183)
[junit4] > at org.apache.solr.schema.FieldTypePluginLoader.init(FieldTypePluginLoader.java:165)
[junit4] > at org.apache.solr.schema.FieldTypePluginLoader.init(FieldTypePluginLoader.java:53)
[junit4] > at org.apache.solr.util.plugin.AbstractPluginLoader.load(AbstractPluginLoader.java:191)
[junit4] > at org.apache.solr.schema.IndexSchema.readSchema(IndexSchema.java:468)
[junit4] > at org.apache.solr.schema.IndexSchema.<init>(IndexSchema.java:174)
[junit4] > at org.apache.solr.schema.IndexSchemaFactory.create(IndexSchemaFactory.java:56)
[junit4] > at org.apache.solr.schema.IndexSchemaFactory.buildIndexSchema(IndexSchemaFactory.java:70)
[junit4] > at org.apache.solr.util.TestHarness.<init>(TestHarness.java:110)
[junit4] > at org.apache.solr.SolrTestCaseJ4.createCore(SolrTestCaseJ4.java:687)
[junit4] > at org.apache.solr.SolrTestCaseJ4.initCore(SolrTestCaseJ4.java:677)
[junit4] > at org.apache.solr.SolrTestCaseJ4.initCore(SolrTestCaseJ4.java:551)
[junit4] > at org.apache.solr.SolrTestCaseJ4.initCore(SolrTestCaseJ4.java:540)
[junit4] > at org.apache.solr.search.TestSolr4Spatial2.beforeClass(TestSolr4Spatial2.java:34)
[junit4] > at java.lang.Thread.run(Thread.java:748)
[junit4] > Caused by: java.lang.ClassNotFoundException: org.apache.lucene.spatial3d.geom.PlanetModel
[junit4] > at java.net.URLClassLoader.findClass(URLClassLoader.java:381)
[junit4] > at java.lang.ClassLoader.loadClass(ClassLoader.java:424)
[junit4] > at sun.misc.Launcher$AppClassLoader.loadClass(Launcher.java:335)
[junit4] > at java.lang.ClassLoader.loadClass(ClassLoader.java:357)
[junit4] > ... 47 more
[junit4] Completed [81/733 (1!)] on J1 in 0.33s, 0 tests, 1 error <<< FAILURES!
[...truncated 384 lines...]
[junit4] Suite: org.apache.solr.handler.component.SpatialHeatmapFacetsTest
[junit4] 2> 873567 INFO (SUITE-SpatialHeatmapFacetsTest-seed#[C4C181504DBB8E2A]-worker) [ ] o.a.s.SolrTestCaseJ4 SecureRandom sanity checks: test.solr.allowed.securerandom=null & java.security.egd=file:/dev/./urandom
[junit4] 2> Creating dataDir: /Users/jenkins/workspace/Lucene-Solr-master-MacOSX/solr/build/solr-core/test/J1/temp/solr.handler.component.SpatialHeatmapFacetsTest_C4C181504DBB8E2A-001/init-core-data-001
[junit4] 2> 873568 WARN (SUITE-SpatialHeatmapFacetsTest-seed#[C4C181504DBB8E2A]-worker) [ ] o.a.s.SolrTestCaseJ4 startTrackingSearchers: numOpens=27 numCloses=27
[junit4] 2> 873568 INFO (SUITE-SpatialHeatmapFacetsTest-seed#[C4C181504DBB8E2A]-worker) [ ] o.a.s.SolrTestCaseJ4 Using PointFields (NUMERIC_POINTS_SYSPROP=true) w/NUMERIC_DOCVALUES_SYSPROP=true
[junit4] 2> 873571 INFO (SUITE-SpatialHeatmapFacetsTest-seed#[C4C181504DBB8E2A]-worker) [ ] o.a.s.SolrTestCaseJ4 Randomized ssl (true) and clientAuth (false) via: @org.apache.solr.util.RandomizeSSL(reason=, value=NaN, ssl=NaN, clientAuth=NaN) w/ MAC_OS_X supressed clientAuth
[junit4] 2> 873572 INFO (SUITE-SpatialHeatmapFacetsTest-seed#[C4C181504DBB8E2A]-worker) [ ] o.a.s.BaseDistributedSearchTestCase Setting hostContext system property: /
[junit4] 2> 873982 INFO (TEST-SpatialHeatmapFacetsTest.test-seed#[C4C181504DBB8E2A]) [ ] o.a.s.SolrTestCaseJ4 Writing core.properties file to /Users/jenkins/workspace/Lucene-Solr-master-MacOSX/solr/build/solr-core/test/J1/temp/solr.handler.component.SpatialHeatmapFacetsTest_C4C181504DBB8E2A-001/tempDir-001/control/cores/collection1
[junit4] 2> 873987 INFO (TEST-SpatialHeatmapFacetsTest.test-seed#[C4C181504DBB8E2A]) [ ] o.e.j.s.Server jetty-9.3.20.v20170531
[junit4] 2> 873988 INFO (TEST-SpatialHeatmapFacetsTest.test-seed#[C4C181504DBB8E2A]) [ ] o.e.j.s.h.ContextHandler Started o.e.j.s.ServletContextHandler@3de56c6f{/,null,AVAILABLE}
[junit4] 2> 873991 INFO (TEST-SpatialHeatmapFacetsTest.test-seed#[C4C181504DBB8E2A]) [ ] o.e.j.s.AbstractConnector Started ServerConnector@456bc930{SSL,[ssl, http/1.1]}{127.0.0.1:56446}
[junit4] 2> 873991 INFO (TEST-SpatialHeatmapFacetsTest.test-seed#[C4C181504DBB8E2A]) [ ] o.e.j.s.Server Started @877575ms
[junit4] 2> 873991 INFO (TEST-SpatialHeatmapFacetsTest.test-seed#[C4C181504DBB8E2A]) [ ] o.a.s.c.s.e.JettySolrRunner Jetty properties: {schema=schema-spatial.xml, solrconfig=solrconfig-basic.xml, hostContext=/, hostPort=56446, coreRootDirectory=/Users/jenkins/workspace/Lucene-Solr-master-MacOSX/solr/build/solr-core/test/J1/temp/solr.handler.component.SpatialHeatmapFacetsTest_C4C181504DBB8E2A-001/tempDir-001/control/cores}
[junit4] 2> 873991 ERROR (TEST-SpatialHeatmapFacetsTest.test-seed#[C4C181504DBB8E2A]) [ ] o.a.s.u.StartupLoggingUtils Missing Java Option solr.log.dir. Logging may be missing or incomplete.
[junit4] 2> 873991 INFO (TEST-SpatialHeatmapFacetsTest.test-seed#[C4C181504DBB8E2A]) [ ] o.a.s.s.SolrDispatchFilter ___ _ Welcome to Apache Solr? version 8.0.0
[junit4] 2> 873991 INFO (TEST-SpatialHeatmapFacetsTest.test-seed#[C4C181504DBB8E2A]) [ ] o.a.s.s.SolrDispatchFilter / __| ___| |_ _ Starting in standalone mode on port null
[junit4] 2> 873991 INFO (TEST-SpatialHeatmapFacetsTest.test-seed#[C4C181504DBB8E2A]) [ ] o.a.s.s.SolrDispatchFilter \__ \/ _ \ | '_| Install dir: null, Default config dir: null
[junit4] 2> 873991 INFO (TEST-SpatialHeatmapFacetsTest.test-seed#[C4C181504DBB8E2A]) [ ] o.a.s.s.SolrDispatchFilter |___/\___/_|_| Start time: 2017-09-23T16:41:29.944Z
[junit4] 2> 873992 INFO (TEST-SpatialHeatmapFacetsTest.test-seed#[C4C181504DBB8E2A]) [ ] o.a.s.c.SolrXmlConfig Loading container configuration from /Users/jenkins/workspace/Lucene-Solr-master-MacOSX/solr/build/solr-core/test/J1/temp/solr.handler.component.SpatialHeatmapFacetsTest_C4C181504DBB8E2A-001/tempDir-001/control/solr.xml
[junit4] 2> 873998 INFO (TEST-SpatialHeatmapFacetsTest.test-seed#[C4C181504DBB8E2A]) [ ] o.a.s.c.SolrXmlConfig MBean server found: com.sun.jmx.mbeanserver.JmxMBeanServer@1e3bfcf7, but no JMX reporters were configured - adding default JMX reporter.
[junit4] 2> 874050 INFO (TEST-SpatialHeatmapFacetsTest.test-seed#[C4C181504DBB8E2A]) [ ] o.a.s.m.r.SolrJmxReporter JMX monitoring for 'solr.node' (registry 'solr.node') enabled at server: com.sun.jmx.mbeanserver.JmxMBeanServer@1e3bfcf7
[junit4] 2> 874057 INFO (TEST-SpatialHeatmapFacetsTest.test-seed#[C4C181504DBB8E2A]) [ ] o.a.s.m.r.SolrJmxReporter JMX monitoring for 'solr.jvm' (registry 'solr.jvm') enabled at server: com.sun.jmx.mbeanserver.JmxMBeanServer@1e3bfcf7
[junit4] 2> 874057 INFO (TEST-SpatialHeatmapFacetsTest.test-seed#[C4C181504DBB8E2A]) [ ] o.a.s.m.r.SolrJmxReporter JMX monitoring for 'solr.jetty' (registry 'solr.jetty') enabled at server: com.sun.jmx.mbeanserver.JmxMBeanServer@1e3bfcf7
[junit4] 2> 874059 INFO (TEST-SpatialHeatmapFacetsTest.test-seed#[C4C181504DBB8E2A]) [ ] o.a.s.c.CorePropertiesLocator Found 1 core definitions underneath /Users/jenkins/workspace/Lucene-Solr-master-MacOSX/solr/build/solr-core/test/J1/temp/solr.handler.component.SpatialHeatmapFacetsTest_C4C181504DBB8E2A-001/tempDir-001/control/cores
[junit4] 2> 874059 INFO (TEST-SpatialHeatmapFacetsTest.test-seed#[C4C181504DBB8E2A]) [ ] o.a.s.c.CorePropertiesLocator Cores are: [collection1]
[junit4] 2> 874059 INFO (coreLoadExecutor-3575-thread-1) [ x:collection1] o.a.s.c.SolrResourceLoader [null] Added 2 libs to classloader, from paths: [/Users/jenkins/workspace/Lucene-Solr-master-MacOSX/solr/core/src/test-files/solr/collection1/lib, /Users/jenkins/workspace/Lucene-Solr-master-MacOSX/solr/core/src/test-files/solr/collection1/lib/classes]
[junit4] 2> 874100 INFO (coreLoadExecutor-3575-thread-1) [ x:collection1] o.a.s.c.SolrConfig Using Lucene MatchVersion: 8.0.0
[junit4] 2> 874104 INFO (coreLoadExecutor-3575-thread-1) [ x:collection1] o.a.s.s.IndexSchema [collection1] Schema name=test
[junit4] 2> 874111 ERROR (coreContainerWorkExecutor-3571-thread-1) [ ] o.a.s.c.CoreContainer Error waiting for SolrCore to be created
[junit4] 2> java.util.concurrent.ExecutionException: java.lang.NoClassDefFoundError: Could not initialize class org.apache.lucene.spatial.spatial4j.Geo3dSpatialContextFactory
[junit4] 2> at java.util.concurrent.FutureTask.report(FutureTask.java:122)
[junit4] 2> at java.util.concurrent.FutureTask.get(FutureTask.java:192)
[junit4] 2> at org.apache.solr.core.CoreContainer.lambda$load$14(CoreContainer.java:669)
[junit4] 2> at com.codahale.metrics.InstrumentedExecutorService$InstrumentedRunnable.run(InstrumentedExecutorService.java:176)
[junit4] 2> at java.util.concurrent.Executors$RunnableAdapter.call(Executors.java:511)
[junit4] 2> at java.util.concurrent.FutureTask.run(FutureTask.java:266)
[junit4] 2> at org.apache.solr.common.util.ExecutorUtil$MDCAwareThreadPoolExecutor.lambda$execute$0(ExecutorUtil.java:188)
[junit4] 2> at java.util.concurrent.ThreadPoolExecutor.runWorker(ThreadPoolExecutor.java:1149)
[junit4] 2> at java.util.concurrent.ThreadPoolExecutor$Worker.run(ThreadPoolExecutor.java:624)
[junit4] 2> at java.lang.Thread.run(Thread.java:748)
[junit4] 2> Caused by: java.lang.NoClassDefFoundError: Could not initialize class org.apache.lucene.spatial.spatial4j.Geo3dSpatialContextFactory
[junit4] 2> at sun.reflect.NativeConstructorAccessorImpl.newInstance0(Native Method)
[junit4] 2> at sun.reflect.NativeConstructorAccessorImpl.newInstance(NativeConstructorAccessorImpl.java:62)
[junit4] 2> at sun.reflect.DelegatingConstructorAccessorImpl.newInstance(DelegatingConstructorAccessorImpl.java:45)
[junit4] 2> at java.lang.reflect.Constructor.newInstance(Constructor.java:423)
[junit4] 2> at java.lang.Class.newInstance(Class.java:442)
[junit4] 2> at org.locationtech.spatial4j.context.SpatialContextFactory.makeSpatialContext(SpatialContextFactory.java:103)
[junit4] 2> at org.apache.solr.schema.AbstractSpatialFieldType.init(AbstractSpatialFieldType.java:148)
[junit4] 2> at org.apache.solr.schema.RptWithGeometrySpatialField.init(RptWithGeometrySpatialField.java:53)
[junit4] 2> at org.apache.solr.schema.FieldType.setArgs(FieldType.java:183)
[junit4] 2> at org.apache.solr.schema.FieldTypePluginLoader.init(FieldTypePluginLoader.java:165)
[junit4] 2> at org.apache.solr.schema.FieldTypePluginLoader.init(FieldTypePluginLoader.java:53)
[junit4] 2> at org.apache.solr.util.plugin.AbstractPluginLoader.load(AbstractPluginLoader.java:191)
[junit4] 2> at org.apache.solr.schema.IndexSchema.readSchema(IndexSchema.java:468)
[junit4] 2> at org.apache.solr.schema.IndexSchema.<init>(IndexSchema.java:174)
[junit4] 2> at org.apache.solr.schema.IndexSchemaFactory.create(IndexSchemaFactory.java:56)
[junit4] 2> at org.apache.solr.schema.IndexSchemaFactory.buildIndexSchema(IndexSchemaFactory.java:70)
[junit4] 2> at org.apache.solr.core.ConfigSetService.createIndexSchema(ConfigSetService.java:119)
[junit4] 2> at org.apache.solr.core.ConfigSetService.getConfig(ConfigSetService.java:92)
[junit4] 2> at org.apache.solr.core.CoreContainer.createFromDescriptor(CoreContainer.java:998)
[junit4] 2> at org.apache.solr.core.CoreContainer.lambda$load$13(CoreContainer.java:641)
[junit4] 2> at com.codahale.metrics.InstrumentedExecutorService$InstrumentedCallable.call(InstrumentedExecutorService.java:197)
[junit4] 2> ... 5 more
[junit4] 2> 874844 INFO (TEST-SpatialHeatmapFacetsTest.test-seed#[C4C181504DBB8E2A]) [ ] o.a.s.SolrTestCaseJ4 Writing core.properties file to /Users/jenkins/workspace/Lucene-Solr-master-MacOSX/solr/build/solr-core/test/J1/temp/solr.handler.component.SpatialHeatmapFacetsTest_C4C181504DBB8E2A-001/tempDir-001/shard0/cores/collection1
[junit4] 2> 874846 INFO (TEST-SpatialHeatmapFacetsTest.test-seed#[C4C181504DBB8E2A]) [ ] o.e.j.s.Server jetty-9.3.20.v20170531
[junit4] 2> 874847 INFO (TEST-SpatialHeatmapFacetsTest.test-seed#[C4C181504DBB8E2A]) [ ] o.e.j.s.h.ContextHandler Started o.e.j.s.ServletContextHandler@10bed20b{/,null,AVAILABLE}
[junit4] 2> 874847 INFO (TEST-SpatialHeatmapFacetsTest.test-seed#[C4C181504DBB8E2A]) [ ] o.e.j.s.AbstractConnector Started ServerConnector@49a5b35a{SSL,[ssl, http/1.1]}{127.0.0.1:56447}
[junit4] 2> 874847 INFO (TEST-SpatialHeatmapFacetsTest.test-seed#[C4C181504DBB8E2A]) [ ] o.e.j.s.Server Started @878431ms
[junit4] 2> 874847 INFO (TEST-SpatialHeatmapFacetsTest.test-seed#[C4C181504DBB8E2A]) [ ] o.a.s.c.s.e.JettySolrRunner Jetty properties: {schema=schema-spatial.xml, solrconfig=solrconfig-basic.xml, hostContext=/, hostPort=56447, coreRootDirectory=/Users/jenkins/workspace/Lucene-Solr-master-MacOSX/solr/build/solr-core/test/J1/temp/solr.handler.component.SpatialHeatmapFacetsTest_C4C181504DBB8E2A-001/tempDir-001/shard0/cores}
[junit4] 2> 874848 ERROR (TEST-SpatialHeatmapFacetsTest.test-seed#[C4C181504DBB8E2A]) [ ] o.a.s.u.StartupLoggingUtils Missing Java Option solr.log.dir. Logging may be missing or incomplete.
[junit4] 2> 874848 INFO (TEST-SpatialHeatmapFacetsTest.test-seed#[C4C181504DBB8E2A]) [ ] o.a.s.s.SolrDispatchFilter ___ _ Welcome to Apache Solr? version 8.0.0
[junit4] 2> 874848 INFO (TEST-SpatialHeatmapFacetsTest.test-seed#[C4C181504DBB8E2A]) [ ] o.a.s.s.SolrDispatchFilter / __| ___| |_ _ Starting in standalone mode on port null
[junit4] 2> 874848 INFO (TEST-SpatialHeatmapFacetsTest.test-seed#[C4C181504DBB8E2A]) [ ] o.a.s.s.SolrDispatchFilter \__ \/ _ \ | '_| Install dir: null, Default config dir: null
[junit4] 2> 874848 INFO (TEST-SpatialHeatmapFacetsTest.test-seed#[C4C181504DBB8E2A]) [ ] o.a.s.s.SolrDispatchFilter |___/\___/_|_| Start time: 2017-09-23T16:41:30.801Z
[junit4] 2> 874848 INFO (TEST-SpatialHeatmapFacetsTest.test-seed#[C4C181504DBB8E2A]) [ ] o.a.s.c.SolrXmlConfig Loading container configuration from /Users/jenkins/workspace/Lucene-Solr-master-MacOSX/solr/build/solr-core/test/J1/temp/solr.handler.component.SpatialHeatmapFacetsTest_C4C181504DBB8E2A-001/tempDir-001/shard0/solr.xml
[junit4] 2> 874855 INFO (TEST-SpatialHeatmapFacetsTest.test-seed#[C4C181504DBB8E2A]) [ ] o.a.s.c.SolrXmlConfig MBean server found: com.sun.jmx.mbeanserver.JmxMBeanServer@1e3bfcf7, but no JMX reporters were configured - adding default JMX reporter.
[junit4] 2> 874904 INFO (TEST-SpatialHeatmapFacetsTest.test-seed#[C4C181504DBB8E2A]) [ ] o.a.s.m.r.SolrJmxReporter JMX monitoring for 'solr.node' (registry 'solr.node') enabled at server: com.sun.jmx.mbeanserver.JmxMBeanServer@1e3bfcf7
[junit4] 2> 874911 INFO (TEST-SpatialHeatmapFacetsTest.test-seed#[C4C181504DBB8E2A]) [ ] o.a.s.m.r.SolrJmxReporter JMX monitoring for 'solr.jvm' (registry 'solr.jvm') enabled at server: com.sun.jmx.mbeanserver.JmxMBeanServer@1e3bfcf7
[junit4] 2> 874912 INFO (TEST-SpatialHeatmapFacetsTest.test-seed#[C4C181504DBB8E2A]) [ ] o.a.s.m.r.SolrJmxReporter JMX monitoring for 'solr.jetty' (registry 'solr.jetty') enabled at server: com.sun.jmx.mbeanserver.JmxMBeanServer@1e3bfcf7
[junit4] 2> 874913 INFO (TEST-SpatialHeatmapFacetsTest.test-seed#[C4C181504DBB8E2A]) [ ] o.a.s.c.CorePropertiesLocator Found 1 core definitions underneath /Users/jenkins/workspace/Lucene-Solr-master-MacOSX/solr/build/solr-core/test/J1/temp/solr.handler.component.SpatialHeatmapFacetsTest_C4C181504DBB8E2A-001/tempDir-001/shard0/cores
[junit4] 2> 874913 INFO (TEST-SpatialHeatmapFacetsTest.test-seed#[C4C181504DBB8E2A]) [ ] o.a.s.c.CorePropertiesLocator Cores are: [collection1]
[junit4] 2> 874915 INFO (coreLoadExecutor-3581-thread-1) [ x:collection1] o.a.s.c.SolrResourceLoader [null] Added 2 libs to classloader, from paths: [/Users/jenkins/workspace/Lucene-Solr-master-MacOSX/solr/core/src/test-files/solr/collection1/lib, /Users/jenkins/workspace/Lucene-Solr-master-MacOSX/solr/core/src/test-files/solr/collection1/lib/classes]
[junit4] 2> 874953 INFO (coreLoadExecutor-3581-thread-1) [ x:collection1] o.a.s.c.SolrConfig Using Lucene MatchVersion: 8.0.0
[junit4] 2> 874958 INFO (coreLoadExecutor-3581-thread-1) [ x:collection1] o.a.s.s.IndexSchema [collection1] Schema name=test
[junit4] 2> 874965 ERROR (coreContainerWorkExecutor-3577-thread-1) [ ] o.a.s.c.CoreContainer Error waiting for SolrCore to be created
[junit4] 2> java.util.concurrent.ExecutionException: java.lang.NoClassDefFoundError: Could not initialize class org.apache.lucene.spatial.spatial4j.Geo3dSpatialContextFactory
[junit4] 2> at java.util.concurrent.FutureTask.report(FutureTask.java:122)
[junit4] 2> at java.util.concurrent.FutureTask.get(FutureTask.java:192)
[junit4] 2> at org.apache.solr.core.CoreContainer.lambda$load$14(CoreContainer.java:669)
[junit4] 2> at com.codahale.metrics.InstrumentedExecutorService$InstrumentedRunnable.run(InstrumentedExecutorService.java:176)
[junit4] 2> at java.util.concurrent.Executors$RunnableAdapter.call(Executors.java:511)
[junit4] 2> at java.util.concurrent.FutureTask.run(FutureTask.java:266)
[junit4] 2> at org.apache.solr.common.util.ExecutorUtil$MDCAwareThreadPoolExecutor.lambda$execute$0(ExecutorUtil.java:188)
[junit4] 2> at java.util.concurrent.ThreadPoolExecutor.runWorker(ThreadPoolExecutor.java:1149)
[junit4] 2> at java.util.concurrent.ThreadPoolExecutor$Worker.run(ThreadPoolExecutor.java:624)
[junit4] 2> at java.lang.Thread.run(Thread.java:748)
[junit4] 2> Caused by: java.lang.NoClassDefFoundError: Could not initialize class org.apache.lucene.spatial.spatial4j.Geo3dSpatialContextFactory
[junit4] 2> at sun.reflect.NativeConstructorAccessorImpl.newInstance0(Native Method)
[junit4] 2> at sun.reflect.NativeConstructorAccessorImpl.newInstance(NativeConstructorAccessorImpl.java:62)
[junit4] 2> at sun.reflect.DelegatingConstructorAccessorImpl.newInstance(DelegatingConstructorAccessorImpl.java:45)
[junit4] 2> at java.lang.reflect.Constructor.newInstance(Constructor.java:423)
[junit4] 2> at java.lang.Class.newInstance(Class.java:442)
[junit4] 2> at org.locationtech.spatial4j.context.SpatialContextFactory.makeSpatialContext(SpatialContextFactory.java:103)
[junit4] 2> at org.apache.solr.schema.AbstractSpatialFieldType.init(AbstractSpatialFieldType.java:148)
[junit4] 2> at org.apache.solr.schema.RptWithGeometrySpatialField.init(RptWithGeometrySpatialField.java:53)
[junit4] 2> at org.apache.solr.schema.FieldType.setArgs(FieldType.java:183)
[junit4] 2> at org.apache.solr.schema.FieldTypePluginLoader.init(FieldTypePluginLoader.java:165)
[junit4] 2> at org.apache.solr.schema.FieldTypePluginLoader.init(FieldTypePluginLoader.java:53)
[junit4] 2> at org.apache.solr.util.plugin.AbstractPluginLoader.load(AbstractPluginLoader.java:191)
[junit4] 2> at org.apache.solr.schema.IndexSchema.readSchema(IndexSchema.java:468)
[junit4] 2> at org.apache.solr.schema.IndexSchema.<init>(IndexSchema.java:174)
[junit4] 2> at org.apache.solr.schema.IndexSchemaFactory.create(IndexSchemaFactory.java:56)
[junit4] 2> at org.apache.solr.schema.IndexSchemaFactory.buildIndexSchema(IndexSchemaFactory.java:70)
[junit4] 2> at org.apache.solr.core.ConfigSetService.createIndexSchema(ConfigSetService.java:119)
[junit4] 2> at org.apache.solr.core.ConfigSetService.getConfig(ConfigSetService.java:92)
[junit4] 2> at org.apache.solr.core.CoreContainer.createFromDescriptor(CoreContainer.java:998)
[junit4] 2> at org.apache.solr.core.CoreContainer.lambda$load$13(CoreContainer.java:641)
[junit4] 2> at com.codahale.metrics.InstrumentedExecutorService$InstrumentedCallable.call(InstrumentedExecutorService.java:197)
[junit4] 2> ... 5 more
[junit4] 2> 875459 INFO (TEST-SpatialHeatmapFacetsTest.test-seed#[C4C181504DBB8E2A]) [ ] o.a.s.SolrTestCaseJ4 ###Starting test
[junit4] 2> 875476 INFO (qtp1007988744-10192) [ ] o.a.s.c.TransientSolrCoreCacheDefault Allocating transient cache for 4 transient cores
[junit4] 2> 875480 ERROR (qtp1007988744-10192) [ ] o.a.s.s.HttpSolrCall null:org.apache.solr.core.SolrCoreInitializationException: SolrCore 'collection1' is not available due to init failure: JVM Error creating core [collection1]: Could not initialize class org.apache.lucene.spatial.spatial4j.Geo3dSpatialContextFactory
[junit4] 2> at org.apache.solr.core.CoreContainer.getCore(CoreContainer.java:1425)
[junit4] 2> at org.apache.solr.servlet.HttpSolrCall.init(HttpSolrCall.java:267)
[junit4] 2> at org.apache.solr.servlet.HttpSolrCall.call(HttpSolrCall.java:480)
[junit4] 2> at org.apache.solr.servlet.SolrDispatchFilter.doFilter(SolrDispatchFilter.java:382)
[junit4] 2> at org.apache.solr.servlet.SolrDispatchFilter.doFilter(SolrDispatchFilter.java:326)
[junit4] 2> at org.eclipse.jetty.servlet.ServletHandler$CachedChain.doFilter(ServletHandler.java:1759)
[junit4] 2> at org.apache.solr.client.solrj.embedded.JettySolrRunner$DebugFilter.doFilter(JettySolrRunner.java:139)
[junit4] 2> at org.eclipse.jetty.servlet.ServletHandler$CachedChain.doFilter(ServletHandler.java:1759)
[junit4] 2> at org.eclipse.jetty.servlet.ServletHandler.doHandle(ServletHandler.java:582)
[junit4] 2> at org.eclipse.jetty.server.session.SessionHandler.doHandle(SessionHandler.java:224)
[junit4] 2> at org.eclipse.jetty.server.handler.ContextHandler.doHandle(ContextHandler.java:1180)
[junit4] 2> at org.eclipse.jetty.servlet.ServletHandler.doScope(ServletHandler.java:512)
[junit4] 2> at org.eclipse.jetty.server.session.SessionHandler.doScope(SessionHandler.java:185)
[junit4] 2> at org.eclipse.jetty.server.handler.ContextHandler.doScope(ContextHandler.java:1112)
[junit4] 2> at org.eclipse.jetty.server.handler.ScopedHandler.handle(ScopedHandler.java:141)
[junit4] 2> at org.eclipse.jetty.server.handler.gzip.GzipHandler.handle(GzipHandler.java:493)
[junit4] 2> at org.eclipse.jetty.server.handler.HandlerWrapper.handle(HandlerWrapper.java:134)
[junit4] 2> at org.eclipse.jetty.server.Server.handle(Server.java:534)
[junit4] 2> at org.eclipse.jetty.server.HttpChannel.handle(HttpChannel.java:320)
[junit4] 2> at org.eclipse.jetty.server.HttpConnection.onFillable(HttpConnection.java:251)
[junit4] 2> at org.eclipse.jetty.io.AbstractConnection$ReadCallback.succeeded(AbstractConnection.java:283)
[junit4] 2> at org.eclipse.jetty.io.FillInterest.fillable(FillInterest.java:108)
[junit4] 2> at org.eclipse.jetty.io.ssl.SslConnection.onFillable(SslConnection.java:251)
[junit4] 2> at org.eclipse.jetty.io.AbstractConnection$ReadCallback.succeeded(AbstractConnection.java:283)
[junit4] 2> at org.eclipse.jetty.io.FillInterest.fillable(FillInterest.java:108)
[junit4] 2> at org.eclipse.jetty.io.SelectChannelEndPoint$2.run(SelectChannelEndPoint.java:93)
[junit4] 2> at org.eclipse.jetty.util.thread.strategy.ExecuteProduceConsume.executeProduceConsume(ExecuteProduceConsume.java:303)
[junit4] 2> at org.eclipse.jetty.util.thread.strategy.ExecuteProduceConsume.produceConsume(ExecuteProduceConsume.java:148)
[junit4] 2> at org.eclipse.jetty.util.thread.strategy.ExecuteProduceConsume.run(ExecuteProduceConsume.java:136)
[junit4] 2> at org.eclipse.jetty.util.thread.QueuedThreadPool.runJob(QueuedThreadPool.java:671)
[junit4] 2> at org.eclipse.jetty.util.thread.QueuedThreadPool$2.run(QueuedThreadPool.java:589)
[junit4] 2> at java.lang.Thread.run(Thread.java:748)
[junit4] 2> Caused by: org.apache.solr.common.SolrException: JVM Error creating core [collection1]: Could not initialize class org.apache.lucene.spatial.spatial4j.Geo3dSpatialContextFactory
[junit4] 2> at org.apache.solr.core.CoreContainer.createFromDescriptor(CoreContainer.java:1023)
[junit4] 2> at org.apache.solr.core.CoreContainer.lambda$load$13(CoreContainer.java:641)
[junit4] 2> at com.codahale.metrics.InstrumentedExecutorService$InstrumentedCallable.call(InstrumentedExecutorService.java:197)
[junit4] 2> at java.util.concurrent.FutureTask.run(FutureTask.java:266)
[junit4] 2> at org.apache.solr.common.util.ExecutorUtil$MDCAwareThreadPoolExecutor.lambda$execute$0(ExecutorUtil.java:188)
[junit4] 2> at java.util.concurrent.ThreadPoolExecutor.runWorker(ThreadPoolExecutor.java:1149)
[junit4] 2> at java.util.concurrent.ThreadPoolExecutor$Worker.run(ThreadPoolExecutor.java:624)
[junit4] 2> ... 1 more
[junit4] 2> Caused by: java.lang.NoClassDefFoundError: Could not initialize class org.apache.lucene.spatial.spatial4j.Geo3dSpatialContextFactory
[junit4] 2> at sun.reflect.NativeConstructorAccessorImpl.newInstance0(Native Method)
[junit4] 2> at sun.reflect.NativeConstructorAccessorImpl.newInstance(NativeConstructorAccessorImpl.java:62)
[junit4] 2> at sun.reflect.DelegatingConstructorAccessorImpl.newInstance(DelegatingConstructorAccessorImpl.java:45)
[junit4] 2> at java.lang.reflect.Constructor.newInstance(Constructor.java:423)
[junit4] 2> at java.lang.Class.newInstance(Class.java:442)
[junit4] 2> at org.locationtech.spatial4j.context.SpatialContextFactory.makeSpatialContext(SpatialContextFactory.java:103)
[junit4] 2> at org.apache.solr.schema.AbstractSpatialFieldType.init(AbstractSpatialFieldType.java:148)
[junit4] 2> at org.apache.solr.schema.RptWithGeometrySpatialField.init(RptWithGeometrySpatialField.java:53)
[junit4] 2> at org.apache.solr.schema.FieldType.setArgs(FieldType.java:183)
[junit4] 2> at org.apache.solr.schema.FieldTypePluginLoader.init(FieldTypePluginLoader.java:165)
[junit4] 2> at org.apache.solr.schema.FieldTypePluginLoader.init(FieldTypePluginLoader.java:53)
[junit4] 2> at org.apache.solr.util.plugin.AbstractPluginLoader.load(AbstractPluginLoader.java:191)
[junit4] 2> at org.apache.solr.schema.IndexSchema.readSchema(IndexSchema.java:468)
[junit4] 2> at org.apache.solr.schema.IndexSchema.<init>(IndexSchema.java:174)
[junit4] 2> at org.apache.solr.schema.IndexSchemaFactory.create(IndexSchemaFactory.java:56)
[junit4] 2> at org.apache.solr.schema.IndexSchemaFactory.buildIndexSchema(IndexSchemaFactory.java:70)
[junit4] 2> at org.apache.solr.core.ConfigSetService.createIndexSchema(ConfigSetService.java:119)
[junit4] 2> at org.apache.solr.core.ConfigSetService.getConfig(ConfigSetService.java:92)
[junit4] 2> at org.apache.solr.core.CoreContainer.createFromDescriptor(CoreContainer.java:998)
[junit4] 2> ... 7 more
[junit4] 2>
[junit4] 2> 875481 ERROR (qtp1007988744-10192) [ ] o.a.s.s.HttpSolrCall An Error was wrapped in another exception - please report complete stacktrace on SOLR-6161
[junit4] 2> org.apache.solr.core.SolrCoreInitializationException: SolrCore 'collection1' is not available due to init failure: JVM Error creating core [collection1]: Could not initialize class org.apache.lucene.spatial.spatial4j.Geo3dSpatialContextFactory
[junit4] 2> at org.apache.solr.core.CoreContainer.getCore(CoreContainer.java:1425)
[junit4] 2> at org.apache.solr.servlet.HttpSolrCall.init(HttpSolrCall.java:267)
[junit4] 2> at org.apache.solr.servlet.HttpSolrCall.call(HttpSolrCall.java:480)
[junit4] 2> at org.apache.solr.servlet.SolrDispatchFilter.doFilter(SolrDispatchFilter.java:382)
[junit4] 2> at org.apache.solr.servlet.SolrDispatchFilter.doFilter(SolrDispatchFilter.java:326)
[junit4] 2> at org.eclipse.jetty.servlet.ServletHandler$CachedChain.doFilter(ServletHandler.java:1759)
[junit4] 2> at org.apache.solr.client.solrj.embedded.JettySolrRunner$DebugFilter.doFilter(JettySolrRunner.java:139)
[junit4] 2> at org.eclipse.jetty.servlet.ServletHandler$CachedChain.doFilter(ServletHandler.java:1759)
[junit4] 2> at org.eclipse.jetty.servlet.ServletHandler.doHandle(ServletHandler.java:582)
[junit4] 2> at org.eclipse.jetty.server.session.SessionHandler.doHandle(SessionHandler.java:224)
[junit4] 2> at org.eclipse.jetty.server.handler.ContextHandler.doHandle(ContextHandler.java:1180)
[junit4] 2> at org.eclipse.jetty.servlet.ServletHandler.doScope(ServletHandler.java:512)
[junit4] 2> at org.eclipse.jetty.server.session.SessionHandler.doScope(SessionHandler.java:185)
[junit4] 2> at org.eclipse.jetty.server.handler.ContextHandler.doScope(ContextHandler.java:1112)
[junit4] 2> at org.eclipse.jetty.server.handler.ScopedHandler.handle(ScopedHandler.java:141)
[junit4] 2> at org.eclipse.jetty.server.handler.gzip.GzipHandler.handle(GzipHandler.java:493)
[junit4] 2> at org.eclipse.jetty.server.handler.HandlerWrapper.handle(HandlerWrapper.java:134)
[junit4] 2> at org.eclipse.jetty.server.Server.handle(Server.java:534)
[junit4] 2> at org.eclipse.jetty.server.HttpChannel.handle(HttpChannel.java:320)
[junit4] 2> at org.eclipse.jetty.server.HttpConnection.onFillable(HttpConnection.java:251)
[junit4] 2> at org.eclipse.jetty.io.AbstractConnection$ReadCallback.succeeded(AbstractConnection.java:283)
[junit4] 2> at org.eclipse.jetty.io.FillInterest.fillable(FillInterest.java:108)
[junit4] 2> at org.eclipse.jetty.io.ssl.SslConnection.onFillable(SslConnection.java:251)
[junit4] 2> at org.eclipse.jetty.io.AbstractConnection$ReadCallback.succeeded(AbstractConnection.java:283)
[junit4] 2> at org.eclipse.jetty.io.FillInterest.fillable(FillInterest.java:108)
[junit4] 2> at org.eclipse.jetty.io.SelectChannelEndPoint$2.run(SelectChannelEndPoint.java:93)
[junit4] 2> at org.eclipse.jetty.util.thread.strategy.ExecuteProduceConsume.executeProduceConsume(ExecuteProduceConsume.java:303)
[junit4] 2> at org.eclipse.jetty.util.thread.strategy.ExecuteProduceConsume.produceConsume(ExecuteProduceConsume.java:148)
[junit4] 2> at org.eclipse.jetty.util.thread.strategy.ExecuteProduceConsume.run(ExecuteProduceConsume.java:136)
[junit4] 2> at org.eclipse.jetty.util.thread.QueuedThreadPool.runJob(QueuedThreadPool.java:671)
[junit4] 2> at org.eclipse.jetty.util.thread.QueuedThreadPool$2.run(QueuedThreadPool.java:589)
[junit4] 2> at java.lang.Thread.run(Thread.java:748)
[junit4] 2> Caused by: org.apache.solr.common.SolrException: JVM Error creating core [collection1]: Could not initialize class org.apache.lucene.spatial.spatial4j.Geo3dSpatialContextFactory
[junit4] 2> at org.apache.solr.core.CoreContainer.createFromDescriptor(CoreContainer.java:1023)
[junit4] 2> at org.apache.solr.core.CoreContainer.lambda$load$13(CoreContainer.java:641)
[junit4] 2> at com.codahale.metrics.InstrumentedExecutorService$InstrumentedCallable.call(InstrumentedExecutorService.java:197)
[junit4] 2> at java.util.concurrent.FutureTask.run(FutureTask.java:266)
[junit4] 2> at org.apache.solr.common.util.ExecutorUtil$MDCAwareThreadPoolExecutor.lambda$execute$0(ExecutorUtil.java:188)
[junit4] 2> at java.util.concurrent.ThreadPoolExecutor.runWorker(ThreadPoolExecutor.java:1149)
[junit4] 2> at java.util.concurrent.ThreadPoolExecutor$Worker.run(ThreadPoolExecutor.java:624)
[junit4] 2> ... 1 more
[junit4] 2> Caused by: java.lang.NoClassDefFoundError: Could not initialize class org.apache.lucene.spatial.spatial4j.Geo3dSpatialContextFactory
[junit4] 2> at sun.reflect.NativeConstructorAccessorImpl.newInstance0(Native Method)
[junit4] 2> at sun.reflect.NativeConstructorAccessorImpl.newInstance(NativeConstructorAccessorImpl.java:62)
[junit4] 2> at sun.reflect.DelegatingConstructorAccessorImpl.newInstance(DelegatingConstructorAccessorImpl.java:45)
[junit4] 2> at java.lang.reflect.Constructor.newInstance(Constructor.java:423)
[junit4] 2> at java.lang.Class.newInstance(Class.java:442)
[junit4] 2> at org.locationtech.spatial4j.context.SpatialContextFactory.makeSpatialContext(SpatialContextFactory.java:103)
[junit4] 2> at org.apache.solr.schema.AbstractSpatialFieldType.init(AbstractSpatialFieldType.java:148)
[junit4] 2> at org.apache.solr.schema.RptWithGeometrySpatialField.init(RptWithGeometrySpatialField.java:53)
[junit4] 2> at org.apache.solr.schema.FieldType.setArgs(FieldType.java:183)
[junit4] 2> at org.apache.solr.schema.FieldTypePluginLoader.init(FieldTypePluginLoader.java:165)
[junit4] 2> at org.apache.solr.schema.FieldTypePluginLoader.init(FieldTypePluginLoader.java:53)
[junit4] 2> at org.apache.solr.util.plugin.AbstractPluginLoader.load(AbstractPluginLoader.java:191)
[junit4] 2> at org.apache.solr.schema.IndexSchema.readSchema(IndexSchema.java:468)
[junit4] 2> at org.apache.solr.schema.IndexSchema.<init>(IndexSchema.java:174)
[junit4] 2> at org.apache.solr.schema.IndexSchemaFactory.create(IndexSchemaFactory.java:56)
[junit4] 2> at org.apache.solr.schema.IndexSchemaFactory.buildIndexSchema(IndexSchemaFactory.java:70)
[junit4] 2> at org.apache.solr.core.ConfigSetService.createIndexSchema(ConfigSetService.java:119)
[junit4] 2> at org.apache.solr.core.ConfigSetService.getConfig(ConfigSetService.java:92)
[junit4] 2> at org.apache.solr.core.CoreContainer.createFromDescriptor(CoreContainer.java:998)
[junit4] 2> ... 7 more
[junit4] 2> 875482 WARN (qtp1007988744-10192) [ ] o.e.j.s.ServletHandler Error for /collection1/select
[junit4] 2> java.lang.NoClassDefFoundError: Could not initialize class org.apache.lucene.spatial.spatial4j.Geo3dSpatialContextFactory
[junit4] 2> at sun.reflect.NativeConstructorAccessorImpl.newInstance0(Native Method)
[junit4] 2> at sun.reflect.NativeConstructorAccessorImpl.newInstance(NativeConstructorAccessorImpl.java:62)
[junit4] 2> at sun.reflect.DelegatingConstructorAccessorImpl.newInstance(DelegatingConstructorAccessorImpl.java:45)
[junit4] 2> at java.lang.reflect.Constructor.newInstance(Constructor.java:423)
[junit4] 2> at java.lang.Class.newInstance(Class.java:442)
[junit4] 2> at org.locationtech.spatial4j.context.SpatialContextFactory.makeSpatialContext(SpatialContextFactory.java:103)
[junit4] 2> at org.apache.solr.schema.AbstractSpatialFieldType.init(AbstractSpatialFieldType.java:148)
[junit4] 2> at org.apache.solr.schema.RptWithGeometrySpatialField.init(RptWithGeometrySpatialField.java:53)
[junit4] 2> at org.apache.solr.schema.FieldType.setArgs(FieldType.java:183)
[junit4] 2> at org.apache.solr.schema.FieldTypePluginLoader.init(FieldTypePluginLoader.java:165)
[junit4] 2> at org.apache.solr.schema.FieldTypePluginLoader.init(FieldTypePluginLoader.java:53)
[junit4] 2> at org.apache.solr.util.plugin.AbstractPluginLoader.load(AbstractPluginLoader.java:191)
[junit4] 2> at org.apache.solr.schema.IndexSchema.readSchema(IndexSchema.java:468)
[junit4] 2> at org.apache.solr.schema.IndexSchema.<init>(IndexSchema.java:174)
[junit4] 2> at org.apache.solr.schema.IndexSchemaFactory.create(IndexSchemaFactory.java:56)
[junit4] 2> at org.apache.solr.schema.IndexSchemaFactory.buildIndexSchema(IndexSchemaFactory.java:70)
[junit4] 2> at org.apache.solr.core.ConfigSetService.createIndexSchema(ConfigSetService.java:119)
[junit4] 2> at org.apache.solr.core.ConfigSetService.getConfig(ConfigSetService.java:92)
[junit4] 2> at org.apache.solr.core.CoreContainer.createFromDescriptor(CoreContainer.java:998)
[junit4] 2> at org.apache.solr.core.CoreContainer.lambda$load$13(CoreContainer.java:641)
[junit4] 2> at com.codahale.metrics.InstrumentedExecutorService$InstrumentedCallable.call(InstrumentedExecutorService.java:197)
[junit4] 2> at java.util.concurrent.FutureTask.run(FutureTask.java:266)
[junit4] 2> at org.apache.solr.common.util.ExecutorUtil$MDCAwareThreadPoolExecutor.lambda$execute$0(ExecutorUtil.java:188)
[junit4] 2> at java.util.concurrent.ThreadPoolExecutor.runWorker(ThreadPoolExecutor.java:1149)
[junit4] 2> at java.util.concurrent.ThreadPoolExecutor$Worker.run(ThreadPoolExecutor.java:624)
[junit4] 2> at java.lang.Thread.run(Thread.java:748)
[junit4] 2> 875484 INFO (TEST-SpatialHeatmapFacetsTest.test-seed#[C4C181504DBB8E2A]) [ ] o.a.s.SolrTestCaseJ4 ###Ending test
[junit4] 2> 875485 INFO (TEST-SpatialHeatmapFacetsTest.test-seed#[C4C181504DBB8E2A]) [ ] o.e.j.s.AbstractConnector Stopped ServerConnector@456bc930{SSL,[ssl, http/1.1]}{127.0.0.1:0}
[junit4] 2> 875485 INFO (TEST-SpatialHeatmapFacetsTest.test-seed#[C4C181504DBB8E2A]) [ ] o.a.s.c.CoreContainer Shutting down CoreContainer instance=342393911
[junit4] 2> 875485 INFO (TEST-SpatialHeatmapFacetsTest.test-seed#[C4C181504DBB8E2A]) [ ] o.a.s.m.SolrMetricManager Closing metric reporters for registry=solr.node, tag=null
[junit4] 2> 875485 INFO (TEST-SpatialHeatmapFacetsTest.test-seed#[C4C181504DBB8E2A]) [ ] o.a.s.m.r.SolrJmxReporter Closing reporter [org.apache.solr.metrics.reporters.SolrJmxReporter@41afe538: rootName = null, domain = solr.node, service url = null, agent id = null] for registry solr.node / com.codahale.metrics.MetricRegistry@6b281d28
[junit4] 2> 875489 INFO (TEST-SpatialHeatmapFacetsTest.test-seed#[C4C181504DBB8E2A]) [ ] o.a.s.m.SolrMetricManager Closing metric reporters for registry=solr.jvm, tag=null
[junit4] 2> 875489 INFO (TEST-SpatialHeatmapFacetsTest.test-seed#[C4C181504DBB8E2A]) [ ] o.a.s.m.r.SolrJmxReporter Closing reporter [org.apache.solr.metrics.reporters.SolrJmxReporter@4d4fd57a: rootName = null, domain = solr.jvm, service url = null, agent id = null] for registry solr.jvm / com.codahale.metrics.MetricRegistry@8022e0a
[junit4] 2> 875491 INFO (TEST-SpatialHeatmapFacetsTest.test-seed#[C4C181504DBB8E2A]) [ ] o.a.s.m.SolrMetricManager Closing metric reporters for registry=solr.jetty, tag=null
[junit4] 2> 875491 INFO (TEST-SpatialHeatmapFacetsTest.test-seed#[C4C181504DBB8E2A]) [ ] o.a.s.m.r.SolrJmxReporter Closing reporter [org.apache.solr.metrics.reporters.SolrJmxReporter@c811f7a: rootName = null, domain = solr.jetty, service url = null, agent id = null] for registry solr.jetty / com.codahale.metrics.MetricRegistry@6815e8bc
[junit4] 2> 875492 INFO (TEST-SpatialHeatmapFacetsTest.test-seed#[C4C181504DBB8E2A]) [ ] o.e.j.s.h.ContextHandler Stopped o.e.j.s.ServletContextHandler@3de56c6f{/,null,UNAVAILABLE}
[junit4] 2> 875493 INFO (TEST-SpatialHeatmapFacetsTest.test-seed#[C4C181504DBB8E2A]) [ ] o.e.j.s.AbstractConnector Stopped ServerConnector@49a5b35a{SSL,[ssl, http/1.1]}{127.0.0.1:0}
[junit4] 2> 875493 INFO (TEST-SpatialHeatmapFacetsTest.test-seed#[C4C181504DBB8E2A]) [ ] o.a.s.c.CoreContainer Shutting down CoreContainer instance=642099309
[junit4] 2> 875494 INFO (TEST-SpatialHeatmapFacetsTest.test-seed#[C4C181504DBB8E2A]) [ ] o.a.s.m.SolrMetricManager Closing metric reporters for registry=solr.node, tag=null
[junit4] 2> 875494 INFO (TEST-SpatialHeatmapFacetsTest.test-seed#[C4C181504DBB8E2A]) [ ] o.a.s.m.r.SolrJmxReporter Closing reporter [org.apache.solr.metrics.reporters.SolrJmxReporter@1dfc67b4: rootName = null, domain = solr.node, service url = null, agent id = null] for registry solr.node / com.codahale.metrics.MetricRegistry@314735e4
[junit4] 2> 875498 INFO (TEST-SpatialHeatmapFacetsTest.test-seed#[C4C181504DBB8E2A]) [ ] o.a.s.m.SolrMetricManager Closing metric reporters for registry=solr.jvm, tag=null
[junit4] 2> 875498 INFO (TEST-SpatialHeatmapFacetsTest.test-seed#[C4C181504DBB8E2A]) [ ] o.a.s.m.r.SolrJmxReporter Closing reporter [org.apache.solr.metrics.reporters.SolrJmxReporter@544517a5: rootName = null, domain = solr.jvm, service url = null, agent id = null] for registry solr.jvm / com.codahale.metrics.MetricRegistry@8022e0a
[junit4] 2> 875501 INFO (TEST-SpatialHeatmapFacetsTest.test-seed#[C4C181504DBB8E2A]) [ ] o.a.s.m.SolrMetricManager Closing metric reporters for registry=solr.jetty, tag=null
[junit4] 2> 875501 INFO (TEST-SpatialHeatmapFacetsTest.test-seed#[C4C181504DBB8E2A]) [ ] o.a.s.m.r.SolrJmxReporter Closing reporter [org.apache.solr.metrics.reporters.SolrJmxReporter@37d36bbc: rootName = null, domain = solr.jetty, service url = null, agent id = null] for registry solr.jetty / com.codahale.metrics.MetricRegistry@6815e8bc
[junit4] 2> 875501 INFO (TEST-SpatialHeatmapFacetsTest.test-seed#[C4C181504DBB8E2A]) [ ] o.a.s.c.TransientSolrCoreCacheDefault Allocating transient cache for 4 transient cores
[junit4] 2> 875502 INFO (TEST-SpatialHeatmapFacetsTest.test-seed#[C4C181504DBB8E2A]) [ ] o.e.j.s.h.ContextHandler Stopped o.e.j.s.ServletContextHandler@10bed20b{/,null,UNAVAILABLE}
[junit4] 2> NOTE: reproduce with: ant test -Dtestcase=SpatialHeatmapFacetsTest -Dtests.method=test -Dtests.seed=C4C181504DBB8E2A -Dtests.slow=true -Dtests.locale=ar-EG -Dtests.timezone=Asia/Baku -Dtests.asserts=true -Dtests.file.encoding=ISO-8859-1
[junit4] FAILURE 1.93s J1 | SpatialHeatmapFacetsTest.test <<<
[junit4] > Throwable #1: java.lang.AssertionError: expected:<400> but was:<500>
[junit4] > at __randomizedtesting.SeedInfo.seed([C4C181504DBB8E2A:4C95BE8AE347E3D2]:0)
[junit4] > at org.apache.solr.handler.component.SpatialHeatmapFacetsTest.test(SpatialHeatmapFacetsTest.java:62)
[junit4] > at org.apache.solr.BaseDistributedSearchTestCase$ShardsRepeatRule$ShardsRepeatStatement.callStatement(BaseDistributedSearchTestCase.java:1019)
[junit4] > at org.apache.solr.BaseDistributedSearchTestCase$ShardsRepeatRule$ShardsStatement.evaluate(BaseDistributedSearchTestCase.java:968)
[junit4] > at java.lang.Thread.run(Thread.java:748)
[junit4] 2> 875808 INFO (TEST-SpatialHeatmapFacetsTest.testPng-seed#[C4C181504DBB8E2A]) [ ] o.a.s.SolrTestCaseJ4 Writing core.properties file to /Users/jenkins/workspace/Lucene-Solr-master-MacOSX/solr/build/solr-core/test/J1/temp/solr.handler.component.SpatialHeatmapFacetsTest_C4C181504DBB8E2A-001/tempDir-002/control/cores/collection1
[junit4] 2> 875811 INFO (TEST-SpatialHeatmapFacetsTest.testPng-seed#[C4C181504DBB8E2A]) [ ] o.e.j.s.Server jetty-9.3.20.v20170531
[junit4] 2> 875812 INFO (TEST-SpatialHeatmapFacetsTest.testPng-seed#[C4C181504DBB8E2A]) [ ] o.e.j.s.h.ContextHandler Started o.e.j.s.ServletContextHandler@5c27091c{/,null,AVAILABLE}
[junit4] 2> 875813 INFO (TEST-SpatialHeatmapFacetsTest.testPng-seed#[C4C181504DBB8E2A]) [ ] o.e.j.s.AbstractConnector Started ServerConnector@deca2b8{SSL,[ssl, http/1.1]}{127.0.0.1:56452}
[junit4] 2> 875815 INFO (TEST-SpatialHeatmapFacetsTest.testPng-seed#[C4C181504DBB8E2A]) [ ] o.e.j.s.Server Started @879399ms
[junit4] 2> 875815 INFO (TEST-SpatialHeatmapFacetsTest.testPng-seed#[C4C181504DBB8E2A]) [ ] o.a.s.c.s.e.JettySolrRunner Jetty properties: {schema=schema-spatial.xml, solrconfig=solrconfig-basic.xml, hostContext=/, hostPort=56452, coreRootDirectory=/Users/jenkins/workspace/Lucene-Solr-master-MacOSX/solr/build/solr-core/test/J1/temp/solr.handler.component.SpatialHeatmapFacetsTest_C4C181504DBB8E2A-001/tempDir-002/control/cores}
[junit4] 2> 875815 ERROR (TEST-SpatialHeatmapFacetsTest.testPng-seed#[C4C181504DBB8E2A]) [ ] o.a.s.u.StartupLoggingUtils Missing Java Option solr.log.dir. Logging may be missing or incomplete.
[junit4] 2> 875816 INFO (TEST-SpatialHeatmapFacetsTest.testPng-seed#[C4C181504DBB8E2A]) [ ] o.a.s.s.SolrDispatchFilter ___ _ Welcome to Apache Solr? version 8.0.0
[junit4] 2> 875816 INFO (TEST-SpatialHeatmapFacetsTest.testPng-seed#[C4C181504DBB8E2A]) [ ] o.a.s.s.SolrDispatchFilter / __| ___| |_ _ Starting in standalone mode on port null
[junit4] 2> 875816 INFO (TEST-SpatialHeatmapFacetsTest.testPng-seed#[C4C181504DBB8E2A]) [ ] o.a.s.s.SolrDispatchFilter \__ \/ _ \ | '_| Install dir: null, Default config dir: null
[junit4] 2> 875816 INFO (TEST-SpatialHeatmapFacetsTest.testPng-seed#[C4C181504DBB8E2A]) [ ] o.a.s.s.SolrDispatchFilter |___/\___/_|_| Start time: 2017-09-23T16:41:31.769Z
[junit4] 2> 875816 INFO (TEST-SpatialHeatmapFacetsTest.testPng-seed#[C4C181504DBB8E2A]) [ ] o.a.s.c.SolrXmlConfig Loading container configuration from /Users/jenkins/workspace/Lucene-Solr-master-MacOSX/solr/build/solr-core/test/J1/temp/solr.handler.component.SpatialHeatmapFacetsTest_C4C181504DBB8E2A-001/tempDir-002/control/solr.xml
[junit4] 2> 875831 INFO (TEST-SpatialHeatmapFacetsTest.testPng-seed#[C4C181504DBB8E2A]) [ ] o.a.s.c.SolrXmlConfig MBean server found: com.sun.jmx.mbeanserver.JmxMBeanServer@1e3bfcf7, but no JMX reporters were configured - adding default JMX reporter.
[junit4] 2> 875939 INFO (TEST-SpatialHeatmapFacetsTest.testPng-seed#[C4C181504DBB8E2A]) [ ] o.a.s.m.r.SolrJmxReporter JMX monitoring for 'solr.node' (registry 'solr.node') enabled at server: com.sun.jmx.mbeanserver.JmxMBeanServer@1e3bfcf7
[junit4] 2> 875952 INFO (TEST-SpatialHeatmapFacetsTest.testPng-seed#[C4C181504DBB8E2A]) [ ] o.a.s.m.r.SolrJmxReporter JMX monitoring for 'solr.jvm' (registry 'solr.jvm') enabled at server: com.sun.jmx.mbeanserver.JmxMBeanServer@1e3bfcf7
[junit4] 2> 875953 INFO (TEST-SpatialHeatmapFacetsTest.testPng-seed#[C4C181504DBB8E2A]) [ ] o.a.s.m.r.SolrJmxReporter JMX monitoring for 'solr.jetty' (registry 'solr.jetty') enabled at server: com.sun.jmx.mbeanserver.JmxMBeanServer@1e3bfcf7
[junit4] 2> 875955 INFO (TEST-SpatialHeatmapFacetsTest.testPng-seed#[C4C181504DBB8E2A]) [ ]
[...truncated too long message...]
eporter@5f0b874a: rootName = null, domain = solr.core.collection1, service url = null, agent id = null] for registry solr.core.collection1 / com.codahale.metrics.MetricRegistry@5cf6dbe7
[junit4] 2> 3115325 INFO (TEST-SpatialRPTFieldTypeTest.testShapeToFromStringWKT-seed#[C4C181504DBB8E2A]) [ ] o.a.s.SolrTestCaseJ4 ###Ending testShapeToFromStringWKT
[junit4] 2> NOTE: leaving temporary files on disk at: /Users/jenkins/workspace/Lucene-Solr-master-MacOSX/solr/build/solr-core/test/J1/temp/solr.schema.SpatialRPTFieldTypeTest_C4C181504DBB8E2A-001
[junit4] 2> NOTE: test params are: codec=Asserting(Lucene70): {}, docValues:{}, maxPointsInLeafNode=622, maxMBSortInHeap=5.6506775196373304, sim=RandomSimilarity(queryNorm=true): {}, locale=mt, timezone=Europe/Tirane
[junit4] 2> NOTE: Mac OS X 10.11.6 x86_64/Oracle Corporation 1.8.0_144 (64-bit)/cpus=3,threads=1,free=207678816,total=518979584
[junit4] 2> NOTE: All tests run in this JVM: [TestCloudPseudoReturnFields, FacetPivotSmallTest, TestReload, TestCollapseQParserPlugin, TestRandomCollapseQParserPlugin, DocValuesMultiTest, TestFieldCacheWithThreads, HealthCheckHandlerTest, SpellCheckCollatorTest, BasicAuthStandaloneTest, FileUtilsTest, SolrRequestParserTest, LeaderElectionContextKeyTest, V2ApiIntegrationTest, TestMaxScoreQueryParser, HLLUtilTest, MergeStrategyTest, ConnectionReuseTest, TestCloudSearcherWarming, TestDocSet, DistributedFacetPivotLargeTest, HdfsBasicDistributedZk2Test, TestNumericTokenStream, TestHighFrequencyDictionaryFactory, DateRangeFieldTest, TestSolrCloudWithHadoopAuthPlugin, OverseerTaskQueueTest, TestDefaultStatsCache, LukeRequestHandlerTest, ShardSplitTest, BasicFunctionalityTest, TestSolrIndexConfig, TestCoreAdminApis, TestComponentsName, TestXmlQParser, TestStressCloudBlindAtomicUpdates, TestInitParams, TestSolrCloudWithKerberosAlt, TestJoin, TestLeaderElectionZkExpiry, TestImplicitCoreProperties, SSLMigrationTest, TestFieldTypeResource, TestSolr4Spatial2, TestCollationField, HdfsUnloadDistributedZkTest, ConvertedLegacyTest, DistributedIntervalFacetingTest, MetricUtilsTest, HdfsRecoverLeaseTest, TestConfigSetImmutable, JavabinLoaderTest, TestDownShardTolerantSearch, TestStressLucene, TestUseDocValuesAsStored, TestSchemaResource, TestDFISimilarityFactory, SecurityConfHandlerTest, MBeansHandlerTest, CollectionsAPIDistributedZkTest, HttpSolrCallGetCoreTest, TestManagedSchemaThreadSafety, UninvertDocValuesMergePolicyTest, LeaderInitiatedRecoveryOnShardRestartTest, ReplicaListTransformerTest, CloneFieldUpdateProcessorFactoryTest, SolrCmdDistributorTest, TestReloadAndDeleteDocs, OverseerRolesTest, MetricsHandlerTest, OverseerCollectionConfigSetProcessorTest, TestQueryUtils, TestTrie, TestMergePolicyConfig, CollectionsAPIAsyncDistributedZkTest, BlockDirectoryTest, TestCloudNestedDocsSort, TestUnifiedSolrHighlighter, TestFastWriter, DistributedMLTComponentTest, SimpleMLTQParserTest, SolrIndexConfigTest, SynonymTokenizerTest, TestHdfsCloudBackupRestore, TestMultiWordSynonyms, HdfsChaosMonkeyNothingIsSafeTest, DistributedQueryComponentOptimizationTest, TestSchemaManager, DistributedQueryElevationComponentTest, SolrJmxReporterCloudTest, TestIndexSearcher, TestConfigReload, TestStressLiveNodes, TestFieldCacheReopen, TestMacros, TestDeleteCollectionOnDownNodes, TestCharFilters, DirectoryFactoryTest, TestValueSourceCache, UtilsToolTest, TestReplicationHandlerBackup, ZkSolrClientTest, IndexSchemaRuntimeFieldTest, TestSimpleQParserPlugin, DocumentAnalysisRequestHandlerTest, TestReRankQParserPlugin, TestSolrCoreSnapshots, AutoScalingHandlerTest, SolrMetricReporterTest, DistributedFacetPivotWhiteBoxTest, ImplicitSnitchTest, CopyFieldTest, TestJsonRequest, TestNumericTerms32, SpellCheckComponentTest, SpatialHeatmapFacetsTest, TestManagedSchema, EnumFieldTest, TermVectorComponentTest, TestCustomDocTransformer, TestChildDocTransformer, TestSolrConfigHandlerConcurrent, TestDynamicFieldResource, TestReplicaProperties, CdcrRequestHandlerTest, ZkStateReaderTest, TestDelegationWithHadoopAuth, TestExceedMaxTermLength, PingRequestHandlerTest, TestSimpleTextCodec, TolerantUpdateProcessorTest, HdfsDirectoryTest, CustomCollectionTest, BadComponentTest, TestCopyFieldCollectionResource, TestJavabinTupleStreamParser, StatelessScriptUpdateProcessorFactoryTest, TestRangeQuery, TestRestoreCore, TestUninvertingReader, TestStreamBody, DOMUtilTest, TestScoreJoinQPNoScore, TestSortByMinMaxFunction, MoreLikeThisHandlerTest, TestGeoJSONResponseWriter, MoveReplicaHDFSUlogDirTest, BadIndexSchemaTest, HdfsRestartWhileUpdatingTest, TestMinMaxOnMultiValuedField, SampleTest, TestCrossCoreJoin, DistributedQueueTest, SolrShardReporterTest, TestDocTermOrds, AliasIntegrationTest, JvmMetricsTest, FullSolrCloudDistribCmdsTest, SolrCLIZkUtilsTest, TestStressUserVersions, TestPostingsSolrHighlighter, ReplaceNodeTest, TestFiltering, RestartWhileUpdatingTest, BadCopyFieldTest, TestManagedResource, TestObjectReleaseTracker, SchemaVersionSpecificBehaviorTest, HdfsDirectoryFactoryTest, TestSearchPerf, TestLRUCache, TestCollationFieldDocValues, TestConfigSetsAPIZkFailure, StressHdfsTest, TestCSVLoader, TestRemoteStreaming, TestRTGBase, TestInPlaceUpdatesDistrib, SearchHandlerTest, DebugComponentTest, CursorMarkTest, PreAnalyzedFieldManagedSchemaCloudTest, ChaosMonkeySafeLeaderTest, BasicDistributedZk2Test, UnloadDistributedZkTest, SyncSliceTest, OpenCloseCoreStressTest, LeaderElectionIntegrationTest, BasicZkTest, TestReplicationHandler, ClusterStateUpdateTest, TestRandomFaceting, TestZkChroot, ShardRoutingCustomTest, TestDistributedSearch, AutoCommitTest, TestDistributedGrouping, TestFaceting, TestRecovery, TestHashPartitioner, TermVectorComponentDistributedTest, TestRealTimeGet, TestStressVersions, DistributedTermsComponentTest, SimpleFacetsTest, TestSolr4Spatial, StatsComponentTest, TestGroupingSearch, PeerSyncTest, TestSort, TestBadConfig, SoftAutoCommitTest, ShowFileRequestHandlerTest, SimplePostToolTest, TestCoreDiscovery, AnalysisAfterCoreReloadTest, SignatureUpdateProcessorFactoryTest, SuggesterFSTTest, TestFoldingMultitermQuery, SuggesterTSTTest, SpatialFilterTest, SuggesterWFSTTest, PolyFieldTest, NoCacheHeaderTest, SolrCoreCheckLockOnStartupTest, TestPseudoReturnFields, TestUpdate, FieldMutatingUpdateProcessorTest, TestWordDelimiterFilterFactory, QueryEqualityTest, SortByFunctionTest, DistanceFunctionTest, TestSolrDeletionPolicy1, CacheHeaderTest, IndexBasedSpellCheckerTest, DisMaxRequestHandlerTest, TestWriterPerf, DirectSolrSpellCheckerTest, TestQueryTypes, FileBasedSpellCheckerTest, TermsComponentTest, XmlUpdateRequestHandlerTest, RequestHandlersTest, DocumentBuilderTest, FieldAnalysisRequestHandlerTest, TestSolrQueryParser, LoggingHandlerTest, RegexBoostProcessorTest, SolrPluginUtilsTest, IndexSchemaTest, TestJmxIntegration, UpdateRequestProcessorFactoryTest, TestCSVResponseWriter, TestAnalyzedSuggestions, JsonLoaderTest, TestPartialUpdateDeduplication, SearchHandlerTest, TestLFUCache, HighlighterConfigTest, SOLR749Test, UpdateParamsTest, AlternateDirectoryTest, ResponseLogComponentTest, TestSolrDeletionPolicy2, MinimalSchemaTest, TestElisionMultitermQuery, TestConfig, ExternalFileFieldSortTest, DirectSolrConnectionTest, TestLuceneMatchVersion, TestPhraseSuggestions, SpellPossibilityIteratorTest, TestCodecSupport, TestXIncludeConfig, EchoParamsTest, TestSweetSpotSimilarityFactory, TestPerFieldSimilarity, TestLMJelinekMercerSimilarityFactory, TestBM25SimilarityFactory, TimeZoneUtilsTest, ResourceLoaderTest, TestFastOutputStream, ScriptEngineTest, OpenExchangeRatesOrgProviderTest, URLClassifyProcessorTest, PluginInfoTest, TestFastLRUCache, DateMathParserTest, ChaosMonkeyNothingIsSafeTest, PreAnalyzedFieldTest, TestSystemIdResolver, PrimUtilsTest, TestSuggestSpellingConverter, DateFieldTest, SpellingQueryConverterTest, RAMDirectoryFactoryTest, ClusterStateTest, TestSolrJ, TestUtils, TestDocumentBuilder, ZkNodePropsTest, SliceStateTest, SystemInfoHandlerTest, CursorPagingTest, SolrTestCaseJ4Test, TestDistributedMissingSort, TestSimpleTrackingShardHandler, TestEmbeddedSolrServerAdminHandler, TestEmbeddedSolrServerConstructors, TestEmbeddedSolrServerSchemaAPI, AssignBackwardCompatibilityTest, AssignTest, ChaosMonkeyNothingIsSafeWithPullReplicasTest, ConcurrentDeleteAndCreateCollectionTest, ConfigSetsAPITest, ConnectionManagerTest, CreateCollectionCleanupTest, DeleteLastCustomShardedReplicaTest, DeleteNodeTest, DeleteReplicaTest, DeleteStatusTest, DistribDocExpirationUpdateProcessorTest, LeaderFailureAfterFreshStartTest, LeaderInitiatedRecoveryOnCommitTest, MissingSegmentRecoveryTest, MoveReplicaTest, MultiThreadedOCPTest, RecoveryAfterSoftCommitTest, TestClusterProperties, TestCollectionAPI, TestDistribDocBasedVersion, TestExclusionRuleCollectionAccess, TestLeaderElectionWithEmptyReplica, TestLocalFSCloudBackupRestore, TestMiniSolrCloudClusterSSL, TestPrepRecovery, TestRequestStatusCollectionAPI, TestShortCircuitedRequests, TestSolrCloudWithDelegationTokens, TestTlogReplica, TestNRTOpen, TestSolrXml, RequestLoggingTest, TestHdfsBackupRestoreCore, TestReqParamsAPI, TestSQLHandlerNonCloud, TestSystemCollAutoCreate, TestConfigsApi, DistributedFacetPivotLongTailTest, DistributedFacetPivotSmallTest, SuggestComponentContextFilterQueryTest, SuggestComponentTest, TestLegacyNumericUtils, TestNumericRangeQuery32, MetricsConfigTest, SolrCoreMetricManagerTest, SolrMetricManagerTest, SolrGraphiteReporterTest, SolrSlf4jReporterTest, SubstringBytesRefFilterTest, SmileWriterTest, TestBinaryResponseWriter, TestGraphMLResponseWriter, TestPushWriter, TestRawResponseWriter, TestRawTransformer, TestRetrieveFieldsOptimizer, TestSolrQueryResponse, TestSubQueryTransformerCrossCore, TestRestManager, TestBulkSchemaAPI, TestFieldCollectionResource, TestFieldResource, TestFieldTypeCollectionResource, TestSchemaVersionResource, TestManagedSynonymFilterFactory, SpatialRPTFieldTypeTest]
[junit4] Completed [655/733 (5!)] on J1 in 5.02s, 9 tests, 4 errors <<< FAILURES!
[...truncated 46551 lines...]