You are viewing a plain text version of this content. The canonical link for it is here.
Posted to dev@flume.apache.org by Apache Jenkins Server <je...@builds.apache.org> on 2013/10/31 22:26:00 UTC

Build failed in Jenkins: flume-trunk #520

See <https://builds.apache.org/job/flume-trunk/520/changes>

Changes:

[jarcec] FLUME-2229. Backoff period gets reset too often in OrderSelector

------------------------------------------
[...truncated 1706 lines...]
INFO: Skipping Flume Twitter Source
Oct 31, 2013 9:23:29 PM org.apache.maven.cli.event.ExecutionEventLogger projectSkipped
INFO: This project has been banned from the build due to previous failures.
Oct 31, 2013 9:23:29 PM org.apache.maven.cli.event.ExecutionEventLogger projectSkipped
INFO: ------------------------------------------------------------------------
Oct 31, 2013 9:23:37 PM org.apache.maven.cli.event.ExecutionEventLogger projectStarted
INFO:                                                                         
Oct 31, 2013 9:23:37 PM org.apache.maven.cli.event.ExecutionEventLogger projectStarted
INFO: ------------------------------------------------------------------------
Oct 31, 2013 9:23:37 PM org.apache.maven.cli.event.ExecutionEventLogger projectStarted
INFO: Building Flume legacy Sources 1.5.0-SNAPSHOT
Oct 31, 2013 9:23:37 PM org.apache.maven.cli.event.ExecutionEventLogger projectStarted
INFO: ------------------------------------------------------------------------
Oct 31, 2013 9:23:37 PM org.apache.maven.cli.event.ExecutionEventLogger mojoStarted
INFO: 
Oct 31, 2013 9:23:37 PM org.apache.maven.cli.event.ExecutionEventLogger mojoStarted
INFO: --- maven-clean-plugin:2.4.1:clean (default-clean) @ flume-ng-legacy-sources ---
[INFO] Deleting <https://builds.apache.org/job/flume-trunk/ws/flume-ng-legacy-sources/target>
Oct 31, 2013 9:23:37 PM org.apache.maven.cli.event.ExecutionEventLogger mojoStarted
INFO: 
Oct 31, 2013 9:23:37 PM org.apache.maven.cli.event.ExecutionEventLogger mojoStarted
INFO: --- maven-remote-resources-plugin:1.1:process (default) @ flume-ng-legacy-sources ---
Oct 31, 2013 9:23:37 PM org.apache.maven.cli.event.ExecutionEventLogger mojoStarted
INFO: 
Oct 31, 2013 9:23:37 PM org.apache.maven.cli.event.ExecutionEventLogger mojoStarted
INFO: --- apache-rat-plugin:0.7:check (verify.rat) @ flume-ng-legacy-sources ---
[INFO] Exclude: .idea/
[INFO] Exclude: **/*.iml
[INFO] Exclude: **/nb-configuration.xml
[INFO] Exclude: .git/
[INFO] Exclude: patchprocess/
[INFO] Exclude: .gitignore
[INFO] Exclude: .repository/
[INFO] Exclude: **/*.diff
[INFO] Exclude: **/*.patch
[INFO] Exclude: **/*.avsc
[INFO] Exclude: **/*.avro
[INFO] Exclude: **/docs/**
[INFO] Exclude: **/test/resources/**
[INFO] Exclude: **/.settings/*
[INFO] Exclude: **/.classpath
[INFO] Exclude: **/.project
[INFO] Exclude: **/target/**
Oct 31, 2013 9:23:38 PM org.apache.maven.cli.event.ExecutionEventLogger projectSkipped
INFO:                                                                         
Oct 31, 2013 9:23:38 PM org.apache.maven.cli.event.ExecutionEventLogger projectSkipped
INFO: ------------------------------------------------------------------------
Oct 31, 2013 9:23:38 PM org.apache.maven.cli.event.ExecutionEventLogger projectSkipped
INFO: Skipping Flume legacy Avro source
Oct 31, 2013 9:23:38 PM org.apache.maven.cli.event.ExecutionEventLogger projectSkipped
INFO: This project has been banned from the build due to previous failures.
Oct 31, 2013 9:23:38 PM org.apache.maven.cli.event.ExecutionEventLogger projectSkipped
INFO: ------------------------------------------------------------------------
Oct 31, 2013 9:23:38 PM org.apache.maven.cli.event.ExecutionEventLogger projectSkipped
INFO:                                                                         
Oct 31, 2013 9:23:38 PM org.apache.maven.cli.event.ExecutionEventLogger projectSkipped
INFO: ------------------------------------------------------------------------
Oct 31, 2013 9:23:38 PM org.apache.maven.cli.event.ExecutionEventLogger projectSkipped
INFO: Skipping Flume legacy Thrift Source
Oct 31, 2013 9:23:38 PM org.apache.maven.cli.event.ExecutionEventLogger projectSkipped
INFO: This project has been banned from the build due to previous failures.
Oct 31, 2013 9:23:38 PM org.apache.maven.cli.event.ExecutionEventLogger projectSkipped
INFO: ------------------------------------------------------------------------
Oct 31, 2013 9:23:43 PM org.apache.maven.cli.event.ExecutionEventLogger projectStarted
INFO:                                                                         
Oct 31, 2013 9:23:43 PM org.apache.maven.cli.event.ExecutionEventLogger projectStarted
INFO: ------------------------------------------------------------------------
Oct 31, 2013 9:23:43 PM org.apache.maven.cli.event.ExecutionEventLogger projectStarted
INFO: Building Flume NG Clients 1.5.0-SNAPSHOT
Oct 31, 2013 9:23:43 PM org.apache.maven.cli.event.ExecutionEventLogger projectStarted
INFO: ------------------------------------------------------------------------
Oct 31, 2013 9:23:43 PM org.apache.maven.cli.event.ExecutionEventLogger mojoStarted
INFO: 
Oct 31, 2013 9:23:43 PM org.apache.maven.cli.event.ExecutionEventLogger mojoStarted
INFO: --- maven-clean-plugin:2.4.1:clean (default-clean) @ flume-ng-clients ---
[INFO] Deleting <https://builds.apache.org/job/flume-trunk/ws/flume-ng-clients/target>
Oct 31, 2013 9:23:43 PM org.apache.maven.cli.event.ExecutionEventLogger mojoStarted
INFO: 
Oct 31, 2013 9:23:43 PM org.apache.maven.cli.event.ExecutionEventLogger mojoStarted
INFO: --- maven-remote-resources-plugin:1.1:process (default) @ flume-ng-clients ---
Oct 31, 2013 9:23:43 PM org.apache.maven.cli.event.ExecutionEventLogger mojoStarted
INFO: 
Oct 31, 2013 9:23:43 PM org.apache.maven.cli.event.ExecutionEventLogger mojoStarted
INFO: --- apache-rat-plugin:0.7:check (verify.rat) @ flume-ng-clients ---
[INFO] Exclude: .idea/
[INFO] Exclude: **/*.iml
[INFO] Exclude: **/nb-configuration.xml
[INFO] Exclude: .git/
[INFO] Exclude: patchprocess/
[INFO] Exclude: .gitignore
[INFO] Exclude: .repository/
[INFO] Exclude: **/*.diff
[INFO] Exclude: **/*.patch
[INFO] Exclude: **/*.avsc
[INFO] Exclude: **/*.avro
[INFO] Exclude: **/docs/**
[INFO] Exclude: **/test/resources/**
[INFO] Exclude: **/.settings/*
[INFO] Exclude: **/.classpath
[INFO] Exclude: **/.project
[INFO] Exclude: **/target/**
Oct 31, 2013 9:23:43 PM org.apache.maven.cli.event.ExecutionEventLogger projectSkipped
INFO:                                                                         
Oct 31, 2013 9:23:43 PM org.apache.maven.cli.event.ExecutionEventLogger projectSkipped
INFO: ------------------------------------------------------------------------
Oct 31, 2013 9:23:43 PM org.apache.maven.cli.event.ExecutionEventLogger projectSkipped
INFO: Skipping Flume NG Log4j Appender
Oct 31, 2013 9:23:43 PM org.apache.maven.cli.event.ExecutionEventLogger projectSkipped
INFO: This project has been banned from the build due to previous failures.
Oct 31, 2013 9:23:43 PM org.apache.maven.cli.event.ExecutionEventLogger projectSkipped
INFO: ------------------------------------------------------------------------
Oct 31, 2013 9:23:43 PM org.apache.maven.cli.event.ExecutionEventLogger projectSkipped
INFO:                                                                         
Oct 31, 2013 9:23:43 PM org.apache.maven.cli.event.ExecutionEventLogger projectSkipped
INFO: ------------------------------------------------------------------------
Oct 31, 2013 9:23:43 PM org.apache.maven.cli.event.ExecutionEventLogger projectSkipped
INFO: Skipping Flume NG Tools
Oct 31, 2013 9:23:43 PM org.apache.maven.cli.event.ExecutionEventLogger projectSkipped
INFO: This project has been banned from the build due to previous failures.
Oct 31, 2013 9:23:43 PM org.apache.maven.cli.event.ExecutionEventLogger projectSkipped
INFO: ------------------------------------------------------------------------
Oct 31, 2013 9:23:43 PM org.apache.maven.cli.event.ExecutionEventLogger projectSkipped
INFO:                                                                         
Oct 31, 2013 9:23:43 PM org.apache.maven.cli.event.ExecutionEventLogger projectSkipped
INFO: ------------------------------------------------------------------------
Oct 31, 2013 9:23:43 PM org.apache.maven.cli.event.ExecutionEventLogger projectSkipped
INFO: Skipping Flume NG distribution
Oct 31, 2013 9:23:43 PM org.apache.maven.cli.event.ExecutionEventLogger projectSkipped
INFO: This project has been banned from the build due to previous failures.
Oct 31, 2013 9:23:43 PM org.apache.maven.cli.event.ExecutionEventLogger projectSkipped
INFO: ------------------------------------------------------------------------
Oct 31, 2013 9:23:43 PM org.apache.maven.cli.event.ExecutionEventLogger projectSkipped
INFO:                                                                         
Oct 31, 2013 9:23:43 PM org.apache.maven.cli.event.ExecutionEventLogger projectSkipped
INFO: ------------------------------------------------------------------------
Oct 31, 2013 9:23:43 PM org.apache.maven.cli.event.ExecutionEventLogger projectSkipped
INFO: Skipping Flume NG Integration Tests
Oct 31, 2013 9:23:43 PM org.apache.maven.cli.event.ExecutionEventLogger projectSkipped
INFO: This project has been banned from the build due to previous failures.
Oct 31, 2013 9:23:43 PM org.apache.maven.cli.event.ExecutionEventLogger projectSkipped
INFO: ------------------------------------------------------------------------
Oct 31, 2013 9:23:43 PM org.apache.maven.cli.event.ExecutionEventLogger logReactorSummary
INFO: ------------------------------------------------------------------------
Oct 31, 2013 9:23:43 PM org.apache.maven.cli.event.ExecutionEventLogger logReactorSummary
INFO: Reactor Summary:
Oct 31, 2013 9:23:43 PM org.apache.maven.cli.event.ExecutionEventLogger logReactorSummary
INFO: 
Oct 31, 2013 9:23:43 PM org.apache.maven.cli.event.ExecutionEventLogger logReactorSummary
INFO: Apache Flume ...................................... SUCCESS [37.857s]
Oct 31, 2013 9:23:43 PM org.apache.maven.cli.event.ExecutionEventLogger logReactorSummary
INFO: Flume NG SDK ...................................... SUCCESS [1:33.960s]
Oct 31, 2013 9:23:43 PM org.apache.maven.cli.event.ExecutionEventLogger logReactorSummary
INFO: Flume NG Configuration ............................ SUCCESS [8.831s]
Oct 31, 2013 9:23:43 PM org.apache.maven.cli.event.ExecutionEventLogger logReactorSummary
INFO: Flume NG Core ..................................... FAILURE [5:02.272s]
Oct 31, 2013 9:23:43 PM org.apache.maven.cli.event.ExecutionEventLogger logReactorSummary
INFO: Flume NG Sinks .................................... SUCCESS [5.658s]
Oct 31, 2013 9:23:43 PM org.apache.maven.cli.event.ExecutionEventLogger logReactorSummary
INFO: Flume NG HDFS Sink ................................ SKIPPED
Oct 31, 2013 9:23:43 PM org.apache.maven.cli.event.ExecutionEventLogger logReactorSummary
INFO: Flume NG IRC Sink ................................. SKIPPED
Oct 31, 2013 9:23:43 PM org.apache.maven.cli.event.ExecutionEventLogger logReactorSummary
INFO: Flume NG Channels ................................. SUCCESS [4.623s]
Oct 31, 2013 9:23:43 PM org.apache.maven.cli.event.ExecutionEventLogger logReactorSummary
INFO: Flume NG JDBC channel ............................. SKIPPED
Oct 31, 2013 9:23:43 PM org.apache.maven.cli.event.ExecutionEventLogger logReactorSummary
INFO: Flume NG file-based channel ....................... SKIPPED
Oct 31, 2013 9:23:43 PM org.apache.maven.cli.event.ExecutionEventLogger logReactorSummary
INFO: Flume NG Node ..................................... SKIPPED
Oct 31, 2013 9:23:43 PM org.apache.maven.cli.event.ExecutionEventLogger logReactorSummary
INFO: Flume NG Embedded Agent ........................... SKIPPED
Oct 31, 2013 9:23:43 PM org.apache.maven.cli.event.ExecutionEventLogger logReactorSummary
INFO: Flume NG HBase Sink ............................... SKIPPED
Oct 31, 2013 9:23:43 PM org.apache.maven.cli.event.ExecutionEventLogger logReactorSummary
INFO: Flume NG ElasticSearch Sink ....................... SKIPPED
Oct 31, 2013 9:23:43 PM org.apache.maven.cli.event.ExecutionEventLogger logReactorSummary
INFO: Flume NG Morphline Solr Sink ...................... SKIPPED
Oct 31, 2013 9:23:43 PM org.apache.maven.cli.event.ExecutionEventLogger logReactorSummary
INFO: Flume Sources ..................................... SUCCESS [5.201s]
Oct 31, 2013 9:23:43 PM org.apache.maven.cli.event.ExecutionEventLogger logReactorSummary
INFO: Flume Scribe Source ............................... SKIPPED
Oct 31, 2013 9:23:43 PM org.apache.maven.cli.event.ExecutionEventLogger logReactorSummary
INFO: Flume JMS Source .................................. SKIPPED
Oct 31, 2013 9:23:43 PM org.apache.maven.cli.event.ExecutionEventLogger logReactorSummary
INFO: Flume Twitter Source .............................. SKIPPED
Oct 31, 2013 9:23:43 PM org.apache.maven.cli.event.ExecutionEventLogger logReactorSummary
INFO: Flume legacy Sources .............................. SUCCESS [8.200s]
Oct 31, 2013 9:23:43 PM org.apache.maven.cli.event.ExecutionEventLogger logReactorSummary
INFO: Flume legacy Avro source .......................... SKIPPED
Oct 31, 2013 9:23:43 PM org.apache.maven.cli.event.ExecutionEventLogger logReactorSummary
INFO: Flume legacy Thrift Source ........................ SKIPPED
Oct 31, 2013 9:23:43 PM org.apache.maven.cli.event.ExecutionEventLogger logReactorSummary
INFO: Flume NG Clients .................................. SUCCESS [4.826s]
Oct 31, 2013 9:23:43 PM org.apache.maven.cli.event.ExecutionEventLogger logReactorSummary
INFO: Flume NG Log4j Appender ........................... SKIPPED
Oct 31, 2013 9:23:43 PM org.apache.maven.cli.event.ExecutionEventLogger logReactorSummary
INFO: Flume NG Tools .................................... SKIPPED
Oct 31, 2013 9:23:43 PM org.apache.maven.cli.event.ExecutionEventLogger logReactorSummary
INFO: Flume NG distribution ............................. SKIPPED
Oct 31, 2013 9:23:43 PM org.apache.maven.cli.event.ExecutionEventLogger logReactorSummary
INFO: Flume NG Integration Tests ........................ SKIPPED
Oct 31, 2013 9:23:43 PM org.apache.maven.cli.event.ExecutionEventLogger logResult
INFO: ------------------------------------------------------------------------
Oct 31, 2013 9:23:43 PM org.apache.maven.cli.event.ExecutionEventLogger logResult
INFO: BUILD FAILURE
Oct 31, 2013 9:23:43 PM org.apache.maven.cli.event.ExecutionEventLogger logStats
INFO: ------------------------------------------------------------------------
Oct 31, 2013 9:23:43 PM org.apache.maven.cli.event.ExecutionEventLogger logStats
INFO: Total time: 8:03.603s
Oct 31, 2013 9:23:43 PM org.apache.maven.cli.event.ExecutionEventLogger logStats
INFO: Finished at: Thu Oct 31 21:23:43 UTC 2013
Oct 31, 2013 9:23:44 PM org.apache.maven.cli.event.ExecutionEventLogger logStats
INFO: Final Memory: 42M/116M
Oct 31, 2013 9:23:44 PM org.apache.maven.cli.event.ExecutionEventLogger sessionEnded
INFO: ------------------------------------------------------------------------
[JENKINS] Archiving <https://builds.apache.org/job/flume-trunk/ws/flume-ng-sinks/flume-ng-morphline-solr-sink/pom.xml> to /home/hudson/hudson/jobs/flume-trunk/modules/org.apache.flume.flume-ng-sinks$flume-ng-morphline-solr-sink/builds/2013-10-31_21-15-27/archive/org.apache.flume.flume-ng-sinks/flume-ng-morphline-solr-sink/1.5.0-SNAPSHOT/flume-ng-morphline-solr-sink-1.5.0-SNAPSHOT.pom
[JENKINS] Archiving <https://builds.apache.org/job/flume-trunk/ws/flume-ng-legacy-sources/pom.xml> to /home/hudson/hudson/jobs/flume-trunk/modules/org.apache.flume$flume-ng-legacy-sources/builds/2013-10-31_21-15-27/archive/org.apache.flume/flume-ng-legacy-sources/1.5.0-SNAPSHOT/flume-ng-legacy-sources-1.5.0-SNAPSHOT.pom
[JENKINS] Archiving <https://builds.apache.org/job/flume-trunk/ws/flume-ng-channels/flume-file-channel/pom.xml> to /home/hudson/hudson/jobs/flume-trunk/modules/org.apache.flume.flume-ng-channels$flume-file-channel/builds/2013-10-31_21-15-27/archive/org.apache.flume.flume-ng-channels/flume-file-channel/1.5.0-SNAPSHOT/flume-file-channel-1.5.0-SNAPSHOT.pom
[JENKINS] Archiving <https://builds.apache.org/job/flume-trunk/ws/flume-ng-core/pom.xml> to /home/hudson/hudson/jobs/flume-trunk/modules/org.apache.flume$flume-ng-core/builds/2013-10-31_21-15-27/archive/org.apache.flume/flume-ng-core/1.5.0-SNAPSHOT/flume-ng-core-1.5.0-SNAPSHOT.pom
[JENKINS] Archiving <https://builds.apache.org/job/flume-trunk/ws/flume-ng-sinks/flume-ng-elasticsearch-sink/pom.xml> to /home/hudson/hudson/jobs/flume-trunk/modules/org.apache.flume.flume-ng-sinks$flume-ng-elasticsearch-sink/builds/2013-10-31_21-15-27/archive/org.apache.flume.flume-ng-sinks/flume-ng-elasticsearch-sink/1.5.0-SNAPSHOT/flume-ng-elasticsearch-sink-1.5.0-SNAPSHOT.pom
[JENKINS] Archiving <https://builds.apache.org/job/flume-trunk/ws/flume-ng-sinks/flume-hdfs-sink/pom.xml> to /home/hudson/hudson/jobs/flume-trunk/modules/org.apache.flume.flume-ng-sinks$flume-hdfs-sink/builds/2013-10-31_21-15-27/archive/org.apache.flume.flume-ng-sinks/flume-hdfs-sink/1.5.0-SNAPSHOT/flume-hdfs-sink-1.5.0-SNAPSHOT.pom
[JENKINS] Archiving <https://builds.apache.org/job/flume-trunk/ws/flume-tools/pom.xml> to /home/hudson/hudson/jobs/flume-trunk/modules/org.apache.flume$flume-tools/builds/2013-10-31_21-15-27/archive/org.apache.flume/flume-tools/1.5.0-SNAPSHOT/flume-tools-1.5.0-SNAPSHOT.pom
[JENKINS] Archiving <https://builds.apache.org/job/flume-trunk/ws/flume-ng-sources/flume-jms-source/pom.xml> to /home/hudson/hudson/jobs/flume-trunk/modules/org.apache.flume.flume-ng-sources$flume-jms-source/builds/2013-10-31_21-15-27/archive/org.apache.flume.flume-ng-sources/flume-jms-source/1.5.0-SNAPSHOT/flume-jms-source-1.5.0-SNAPSHOT.pom
[JENKINS] Archiving <https://builds.apache.org/job/flume-trunk/ws/flume-ng-sources/pom.xml> to /home/hudson/hudson/jobs/flume-trunk/modules/org.apache.flume$flume-ng-sources/builds/2013-10-31_21-15-27/archive/org.apache.flume/flume-ng-sources/1.5.0-SNAPSHOT/flume-ng-sources-1.5.0-SNAPSHOT.pom
[JENKINS] Archiving <https://builds.apache.org/job/flume-trunk/ws/flume-ng-legacy-sources/flume-avro-source/pom.xml> to /home/hudson/hudson/jobs/flume-trunk/modules/org.apache.flume.flume-ng-legacy-sources$flume-avro-source/builds/2013-10-31_21-15-27/archive/org.apache.flume.flume-ng-legacy-sources/flume-avro-source/1.5.0-SNAPSHOT/flume-avro-source-1.5.0-SNAPSHOT.pom
[JENKINS] Archiving <https://builds.apache.org/job/flume-trunk/ws/flume-ng-embedded-agent/pom.xml> to /home/hudson/hudson/jobs/flume-trunk/modules/org.apache.flume$flume-ng-embedded-agent/builds/2013-10-31_21-15-27/archive/org.apache.flume/flume-ng-embedded-agent/1.5.0-SNAPSHOT/flume-ng-embedded-agent-1.5.0-SNAPSHOT.pom
[JENKINS] Archiving <https://builds.apache.org/job/flume-trunk/ws/flume-ng-node/pom.xml> to /home/hudson/hudson/jobs/flume-trunk/modules/org.apache.flume$flume-ng-node/builds/2013-10-31_21-15-27/archive/org.apache.flume/flume-ng-node/1.5.0-SNAPSHOT/flume-ng-node-1.5.0-SNAPSHOT.pom
[JENKINS] Archiving <https://builds.apache.org/job/flume-trunk/ws/flume-ng-legacy-sources/flume-thrift-source/pom.xml> to /home/hudson/hudson/jobs/flume-trunk/modules/org.apache.flume.flume-ng-legacy-sources$flume-thrift-source/builds/2013-10-31_21-15-27/archive/org.apache.flume.flume-ng-legacy-sources/flume-thrift-source/1.5.0-SNAPSHOT/flume-thrift-source-1.5.0-SNAPSHOT.pom
[JENKINS] Archiving <https://builds.apache.org/job/flume-trunk/ws/flume-ng-sources/flume-scribe-source/pom.xml> to /home/hudson/hudson/jobs/flume-trunk/modules/org.apache.flume.flume-ng-sources$flume-scribe-source/builds/2013-10-31_21-15-27/archive/org.apache.flume.flume-ng-sources/flume-scribe-source/1.5.0-SNAPSHOT/flume-scribe-source-1.5.0-SNAPSHOT.pom
[JENKINS] Archiving <https://builds.apache.org/job/flume-trunk/ws/flume-ng-tests/pom.xml> to /home/hudson/hudson/jobs/flume-trunk/modules/org.apache.flume$flume-ng-tests/builds/2013-10-31_21-15-27/archive/org.apache.flume/flume-ng-tests/1.5.0-SNAPSHOT/flume-ng-tests-1.5.0-SNAPSHOT.pom
[JENKINS] Archiving <https://builds.apache.org/job/flume-trunk/ws/flume-ng-sinks/flume-irc-sink/pom.xml> to /home/hudson/hudson/jobs/flume-trunk/modules/org.apache.flume.flume-ng-sinks$flume-irc-sink/builds/2013-10-31_21-15-27/archive/org.apache.flume.flume-ng-sinks/flume-irc-sink/1.5.0-SNAPSHOT/flume-irc-sink-1.5.0-SNAPSHOT.pom
[JENKINS] Archiving <https://builds.apache.org/job/flume-trunk/ws/flume-ng-configuration/pom.xml> to /home/hudson/hudson/jobs/flume-trunk/modules/org.apache.flume$flume-ng-configuration/builds/2013-10-31_21-15-27/archive/org.apache.flume/flume-ng-configuration/1.5.0-SNAPSHOT/flume-ng-configuration-1.5.0-SNAPSHOT.pom
[JENKINS] Archiving <https://builds.apache.org/job/flume-trunk/ws/flume-ng-configuration/target/flume-ng-configuration-1.5.0-SNAPSHOT.jar> to /home/hudson/hudson/jobs/flume-trunk/modules/org.apache.flume$flume-ng-configuration/builds/2013-10-31_21-15-27/archive/org.apache.flume/flume-ng-configuration/1.5.0-SNAPSHOT/flume-ng-configuration-1.5.0-SNAPSHOT.jar
[JENKINS] Archiving <https://builds.apache.org/job/flume-trunk/ws/flume-ng-sdk/pom.xml> to /home/hudson/hudson/jobs/flume-trunk/modules/org.apache.flume$flume-ng-sdk/builds/2013-10-31_21-15-27/archive/org.apache.flume/flume-ng-sdk/1.5.0-SNAPSHOT/flume-ng-sdk-1.5.0-SNAPSHOT.pom
[JENKINS] Archiving <https://builds.apache.org/job/flume-trunk/ws/flume-ng-sdk/target/flume-ng-sdk-1.5.0-SNAPSHOT.jar> to /home/hudson/hudson/jobs/flume-trunk/modules/org.apache.flume$flume-ng-sdk/builds/2013-10-31_21-15-27/archive/org.apache.flume/flume-ng-sdk/1.5.0-SNAPSHOT/flume-ng-sdk-1.5.0-SNAPSHOT.jar
[JENKINS] Archiving <https://builds.apache.org/job/flume-trunk/ws/flume-ng-sdk/target/flume-ng-sdk-1.5.0-SNAPSHOT-tests.jar> to /home/hudson/hudson/jobs/flume-trunk/modules/org.apache.flume$flume-ng-sdk/builds/2013-10-31_21-15-27/archive/org.apache.flume/flume-ng-sdk/1.5.0-SNAPSHOT/flume-ng-sdk-1.5.0-SNAPSHOT-tests.jar
[JENKINS] Archiving <https://builds.apache.org/job/flume-trunk/ws/flume-ng-clients/pom.xml> to /home/hudson/hudson/jobs/flume-trunk/modules/org.apache.flume$flume-ng-clients/builds/2013-10-31_21-15-27/archive/org.apache.flume/flume-ng-clients/1.5.0-SNAPSHOT/flume-ng-clients-1.5.0-SNAPSHOT.pom
[JENKINS] Archiving <https://builds.apache.org/job/flume-trunk/ws/flume-ng-dist/pom.xml> to /home/hudson/hudson/jobs/flume-trunk/modules/org.apache.flume$flume-ng-dist/builds/2013-10-31_21-15-27/archive/org.apache.flume/flume-ng-dist/1.5.0-SNAPSHOT/flume-ng-dist-1.5.0-SNAPSHOT.pom
[JENKINS] Archiving <https://builds.apache.org/job/flume-trunk/ws/pom.xml> to /home/hudson/hudson/jobs/flume-trunk/modules/org.apache.flume$flume-parent/builds/2013-10-31_21-15-27/archive/org.apache.flume/flume-parent/1.5.0-SNAPSHOT/flume-parent-1.5.0-SNAPSHOT.pom
[JENKINS] Archiving <https://builds.apache.org/job/flume-trunk/ws/flume-ng-sinks/flume-ng-hbase-sink/pom.xml> to /home/hudson/hudson/jobs/flume-trunk/modules/org.apache.flume.flume-ng-sinks$flume-ng-hbase-sink/builds/2013-10-31_21-15-27/archive/org.apache.flume.flume-ng-sinks/flume-ng-hbase-sink/1.5.0-SNAPSHOT/flume-ng-hbase-sink-1.5.0-SNAPSHOT.pom
[JENKINS] Archiving <https://builds.apache.org/job/flume-trunk/ws/flume-ng-clients/flume-ng-log4jappender/pom.xml> to /home/hudson/hudson/jobs/flume-trunk/modules/org.apache.flume.flume-ng-clients$flume-ng-log4jappender/builds/2013-10-31_21-15-27/archive/org.apache.flume.flume-ng-clients/flume-ng-log4jappender/1.5.0-SNAPSHOT/flume-ng-log4jappender-1.5.0-SNAPSHOT.pom
[JENKINS] Archiving <https://builds.apache.org/job/flume-trunk/ws/flume-ng-channels/pom.xml> to /home/hudson/hudson/jobs/flume-trunk/modules/org.apache.flume$flume-ng-channels/builds/2013-10-31_21-15-27/archive/org.apache.flume/flume-ng-channels/1.5.0-SNAPSHOT/flume-ng-channels-1.5.0-SNAPSHOT.pom
[JENKINS] Archiving <https://builds.apache.org/job/flume-trunk/ws/flume-ng-channels/flume-jdbc-channel/pom.xml> to /home/hudson/hudson/jobs/flume-trunk/modules/org.apache.flume.flume-ng-channels$flume-jdbc-channel/builds/2013-10-31_21-15-27/archive/org.apache.flume.flume-ng-channels/flume-jdbc-channel/1.5.0-SNAPSHOT/flume-jdbc-channel-1.5.0-SNAPSHOT.pom
[JENKINS] Archiving <https://builds.apache.org/job/flume-trunk/ws/flume-ng-sources/flume-twitter-source/pom.xml> to /home/hudson/hudson/jobs/flume-trunk/modules/org.apache.flume.flume-ng-sources$flume-twitter-source/builds/2013-10-31_21-15-27/archive/org.apache.flume.flume-ng-sources/flume-twitter-source/1.5.0-SNAPSHOT/flume-twitter-source-1.5.0-SNAPSHOT.pom
[JENKINS] Archiving <https://builds.apache.org/job/flume-trunk/ws/flume-ng-sinks/pom.xml> to /home/hudson/hudson/jobs/flume-trunk/modules/org.apache.flume$flume-ng-sinks/builds/2013-10-31_21-15-27/archive/org.apache.flume/flume-ng-sinks/1.5.0-SNAPSHOT/flume-ng-sinks-1.5.0-SNAPSHOT.pom
Waiting for Jenkins to finish collecting data
channel stopped
[WARNINGS] Skipping publisher since build result is FAILURE
Updating FLUME-2229

Jenkins build is back to normal : flume-trunk #525

Posted by Apache Jenkins Server <je...@builds.apache.org>.
See <https://builds.apache.org/job/flume-trunk/525/changes>


Build failed in Jenkins: flume-trunk #524

Posted by Apache Jenkins Server <je...@builds.apache.org>.
See <https://builds.apache.org/job/flume-trunk/524/changes>

Changes:

[hshreedharan] FLUME-2262. Log4j Appender should use timeStamp field not getTimestamp, which was not available in older log4j versions.

[hshreedharan] FLUME-2238. Provide option to configure worker threads in NettyAvroRpcClient

[hshreedharan] FLUME-2209. AsyncHBaseSink will never recover if the column family does not exists for the first start.

------------------------------------------
[...truncated 4143 lines...]
Running org.apache.flume.test.agent.TestFileChannel
Tests run: 2, Failures: 0, Errors: 2, Skipped: 0, Time elapsed: 0.145 sec <<< FAILURE!
testInOut(org.apache.flume.test.agent.TestFileChannel)  Time elapsed: 0.044 sec  <<< ERROR!
java.lang.Exception: Failed to locate tar-ball distribution. Please specify explicitly via system property: flume.dist.tarball
	at org.apache.flume.test.util.StagedInstall.<init>(StagedInstall.java:229)
	at org.apache.flume.test.util.StagedInstall.getInstance(StagedInstall.java:79)
	at org.apache.flume.test.agent.TestFileChannel.testInOut(TestFileChannel.java:130)

testInOut(org.apache.flume.test.agent.TestFileChannel)  Time elapsed: 0.045 sec  <<< ERROR!
java.lang.Exception: Failed to locate tar-ball distribution. Please specify explicitly via system property: flume.dist.tarball
	at org.apache.flume.test.util.StagedInstall.<init>(StagedInstall.java:229)
	at org.apache.flume.test.util.StagedInstall.getInstance(StagedInstall.java:79)
	at org.apache.flume.test.agent.TestFileChannel.tearDown(TestFileChannel.java:103)

Running org.apache.flume.test.agent.TestRpcClientCommunicationFailure
Tests run: 1, Failures: 0, Errors: 1, Skipped: 0, Time elapsed: 0.122 sec <<< FAILURE!
testFailure(org.apache.flume.test.agent.TestRpcClientCommunicationFailure)  Time elapsed: 0.069 sec  <<< ERROR!
java.lang.Exception: Failed to locate tar-ball distribution. Please specify explicitly via system property: flume.dist.tarball
	at org.apache.flume.test.util.StagedInstall.<init>(StagedInstall.java:229)
	at org.apache.flume.test.util.StagedInstall.getInstance(StagedInstall.java:79)
	at org.apache.flume.test.agent.TestRpcClientCommunicationFailure.testFailure(TestRpcClientCommunicationFailure.java:61)

Running org.apache.flume.test.agent.TestSpooldirSource
Tests run: 2, Failures: 0, Errors: 2, Skipped: 0, Time elapsed: 0.142 sec <<< FAILURE!
testManySpooldirs(org.apache.flume.test.agent.TestSpooldirSource)  Time elapsed: 0.017 sec  <<< ERROR!
java.lang.Exception: Failed to locate tar-ball distribution. Please specify explicitly via system property: flume.dist.tarball
	at org.apache.flume.test.util.StagedInstall.<init>(StagedInstall.java:229)
	at org.apache.flume.test.util.StagedInstall.getInstance(StagedInstall.java:79)
	at org.apache.flume.test.agent.TestSpooldirSource.setup(TestSpooldirSource.java:59)

testManySpooldirs(org.apache.flume.test.agent.TestSpooldirSource)  Time elapsed: 0.017 sec  <<< ERROR!
java.lang.Exception: Failed to locate tar-ball distribution. Please specify explicitly via system property: flume.dist.tarball
	at org.apache.flume.test.util.StagedInstall.<init>(StagedInstall.java:229)
	at org.apache.flume.test.util.StagedInstall.getInstance(StagedInstall.java:79)
	at org.apache.flume.test.agent.TestSpooldirSource.teardown(TestSpooldirSource.java:111)

Running org.apache.flume.test.agent.TestRpcClient
Tests run: 2, Failures: 0, Errors: 2, Skipped: 0, Time elapsed: 0.125 sec <<< FAILURE!
testRpcClient(org.apache.flume.test.agent.TestRpcClient)  Time elapsed: 0.069 sec  <<< ERROR!
java.lang.Exception: Failed to locate tar-ball distribution. Please specify explicitly via system property: flume.dist.tarball
	at org.apache.flume.test.util.StagedInstall.<init>(StagedInstall.java:229)
	at org.apache.flume.test.util.StagedInstall.getInstance(StagedInstall.java:79)
	at org.apache.flume.test.agent.TestRpcClient.setUp(TestRpcClient.java:36)

testRpcClient(org.apache.flume.test.agent.TestRpcClient)  Time elapsed: 0.069 sec  <<< ERROR!
java.lang.Exception: Failed to locate tar-ball distribution. Please specify explicitly via system property: flume.dist.tarball
	at org.apache.flume.test.util.StagedInstall.<init>(StagedInstall.java:229)
	at org.apache.flume.test.util.StagedInstall.getInstance(StagedInstall.java:79)
	at org.apache.flume.test.agent.TestRpcClient.tearDown(TestRpcClient.java:42)


Results :

Tests in error: 
  TestFileChannel.testInOut:130 ?  Failed to locate tar-ball distribution. Pleas...
  TestFileChannel.tearDown:103 ?  Failed to locate tar-ball distribution. Please...
  TestRpcClientCommunicationFailure.testFailure:61 ?  Failed to locate tar-ball ...
  TestSpooldirSource.setup:59 ?  Failed to locate tar-ball distribution. Please ...
  TestSpooldirSource.teardown:111 ?  Failed to locate tar-ball distribution. Ple...
  TestRpcClient.setUp:36 ?  Failed to locate tar-ball distribution. Please speci...
  TestRpcClient.tearDown:42 ?  Failed to locate tar-ball distribution. Please sp...

Tests run: 7, Failures: 0, Errors: 7, Skipped: 0

[ERROR] There are test failures.

Please refer to <https://builds.apache.org/job/flume-trunk/ws/flume-ng-tests/target/surefire-reports> for the individual test results.
[JENKINS] Recording test results
[INFO] 
[INFO] --- maven-jar-plugin:2.3.1:jar (default-jar) @ flume-ng-tests ---
[INFO] Building jar: <https://builds.apache.org/job/flume-trunk/ws/flume-ng-tests/target/flume-ng-tests-1.5.0-SNAPSHOT.jar>
[INFO] 
[INFO] --- apache-rat-plugin:0.7:check (verify.rat) @ flume-ng-tests ---
[INFO] Exclude: .idea/
[INFO] Exclude: **/*.iml
[INFO] Exclude: **/nb-configuration.xml
[INFO] Exclude: .git/
[INFO] Exclude: patchprocess/
[INFO] Exclude: .gitignore
[INFO] Exclude: .repository/
[INFO] Exclude: **/*.diff
[INFO] Exclude: **/*.patch
[INFO] Exclude: **/*.avsc
[INFO] Exclude: **/*.avro
[INFO] Exclude: **/docs/**
[INFO] Exclude: **/test/resources/**
[INFO] Exclude: **/.settings/*
[INFO] Exclude: **/.classpath
[INFO] Exclude: **/.project
[INFO] Exclude: **/target/**
[INFO] ------------------------------------------------------------------------
[INFO] Reactor Summary:
[INFO] 
[INFO] Apache Flume ...................................... SUCCESS [32.337s]
[INFO] Flume NG SDK ...................................... SUCCESS [1:35.356s]
[INFO] Flume NG Configuration ............................ SUCCESS [11.440s]
[INFO] Flume NG Core ..................................... SUCCESS [4:57.279s]
[INFO] Flume NG Sinks .................................... SUCCESS [7.904s]
[INFO] Flume NG HDFS Sink ................................ SUCCESS [1:26.400s]
[INFO] Flume NG IRC Sink ................................. SUCCESS [10.531s]
[INFO] Flume NG Channels ................................. SUCCESS [11.372s]
[INFO] Flume NG JDBC channel ............................. SUCCESS [58.257s]
[INFO] Flume NG file-based channel ....................... SUCCESS [4:24.308s]
[INFO] Flume NG Node ..................................... FAILURE [15:16.288s]
[INFO] Flume NG Embedded Agent ........................... SKIPPED
[INFO] Flume NG HBase Sink ............................... SUCCESS [2:10.283s]
[INFO] Flume NG ElasticSearch Sink ....................... SUCCESS [26.798s]
[INFO] Flume NG Morphline Solr Sink ...................... SUCCESS [1:36.036s]
[INFO] Flume Sources ..................................... SUCCESS [10.770s]
[INFO] Flume Scribe Source ............................... SUCCESS [7.472s]
[INFO] Flume JMS Source .................................. SUCCESS [20.273s]
[INFO] Flume Twitter Source .............................. SUCCESS [3.927s]
[INFO] Flume legacy Sources .............................. SUCCESS [5.427s]
[INFO] Flume legacy Avro source .......................... SUCCESS [9.266s]
[INFO] Flume legacy Thrift Source ........................ SUCCESS [10.873s]
[INFO] Flume NG Clients .................................. SUCCESS [4.212s]
[INFO] Flume NG Log4j Appender ........................... SUCCESS [33.878s]
[INFO] Flume NG Tools .................................... SUCCESS [8.032s]
[INFO] Flume NG distribution ............................. SKIPPED
[INFO] Flume NG Integration Tests ........................ SUCCESS [11.146s]
[INFO] ------------------------------------------------------------------------
[INFO] BUILD FAILURE
[INFO] ------------------------------------------------------------------------
[INFO] Total time: 1:19:00.598s
[INFO] Finished at: Tue Dec 10 09:56:05 UTC 2013
[INFO] Final Memory: 112M/192M
[INFO] ------------------------------------------------------------------------
Waiting for Jenkins to finish collecting data[ERROR] Failed to execute goal org.apache.maven.plugins:maven-surefire-plugin:2.12.3:test (default-test) on project flume-ng-node: ExecutionException; nested exception is java.util.concurrent.ExecutionException: java.lang.RuntimeException: The forked VM terminated without saying properly goodbye. VM crash or System.exit called ? -> [Help 1]
org.apache.maven.lifecycle.LifecycleExecutionException: Failed to execute goal org.apache.maven.plugins:maven-surefire-plugin:2.12.3:test (default-test) on project flume-ng-node: ExecutionException; nested exception is java.util.concurrent.ExecutionException: java.lang.RuntimeException: The forked VM terminated without saying properly goodbye. VM crash or System.exit called ?
	at org.apache.maven.lifecycle.internal.MojoExecutor.execute(MojoExecutor.java:217)
	at org.apache.maven.lifecycle.internal.MojoExecutor.execute(MojoExecutor.java:153)
	at org.apache.maven.lifecycle.internal.MojoExecutor.execute(MojoExecutor.java:145)
	at org.apache.maven.lifecycle.internal.LifecycleModuleBuilder.buildProject(LifecycleModuleBuilder.java:84)
	at org.apache.maven.lifecycle.internal.LifecycleModuleBuilder.buildProject(LifecycleModuleBuilder.java:59)
	at org.apache.maven.lifecycle.internal.LifecycleStarter.singleThreadedBuild(LifecycleStarter.java:183)
	at org.apache.maven.lifecycle.internal.LifecycleStarter.execute(LifecycleStarter.java:161)
	at org.apache.maven.DefaultMaven.doExecute(DefaultMaven.java:319)
	at org.apache.maven.DefaultMaven.execute(DefaultMaven.java:156)
	at org.jvnet.hudson.maven3.launcher.Maven3Launcher.main(Maven3Launcher.java:117)
	at sun.reflect.NativeMethodAccessorImpl.invoke0(Native Method)
	at sun.reflect.NativeMethodAccessorImpl.invoke(NativeMethodAccessorImpl.java:39)
	at sun.reflect.DelegatingMethodAccessorImpl.invoke(DelegatingMethodAccessorImpl.java:25)
	at java.lang.reflect.Method.invoke(Method.java:597)
	at org.codehaus.plexus.classworlds.launcher.Launcher.launchStandard(Launcher.java:329)
	at org.codehaus.plexus.classworlds.launcher.Launcher.launch(Launcher.java:239)
	at org.jvnet.hudson.maven3.agent.Maven3Main.launch(Maven3Main.java:178)
	at sun.reflect.NativeMethodAccessorImpl.invoke0(Native Method)
	at sun.reflect.NativeMethodAccessorImpl.invoke(NativeMethodAccessorImpl.java:39)
	at sun.reflect.DelegatingMethodAccessorImpl.invoke(DelegatingMethodAccessorImpl.java:25)
	at java.lang.reflect.Method.invoke(Method.java:597)
	at hudson.maven.Maven3Builder.call(Maven3Builder.java:134)
	at hudson.maven.Maven3Builder.call(Maven3Builder.java:69)
	at hudson.remoting.UserRequest.perform(UserRequest.java:118)
	at hudson.remoting.UserRequest.perform(UserRequest.java:48)
	at hudson.remoting.Request$2.run(Request.java:328)
	at hudson.remoting.InterceptingExecutorService$1.call(InterceptingExecutorService.java:72)
	at java.util.concurrent.FutureTask$Sync.innerRun(FutureTask.java:303)
	at java.util.concurrent.FutureTask.run(FutureTask.java:138)
	at java.util.concurrent.ThreadPoolExecutor$Worker.runTask(ThreadPoolExecutor.java:895)
	at java.util.concurrent.ThreadPoolExecutor$Worker.run(ThreadPoolExecutor.java:918)
	at java.lang.Thread.run(Thread.java:662)
Caused by: org.apache.maven.plugin.MojoExecutionException: ExecutionException; nested exception is java.util.concurrent.ExecutionException: java.lang.RuntimeException: The forked VM terminated without saying properly goodbye. VM crash or System.exit called ?
	at org.apache.maven.plugin.surefire.SurefirePlugin.assertNoException(SurefirePlugin.java:160)
	at org.apache.maven.plugin.surefire.SurefirePlugin.handleSummary(SurefirePlugin.java:149)
	at org.apache.maven.plugin.surefire.AbstractSurefireMojo.executeAfterPreconditionsChecked(AbstractSurefireMojo.java:650)
	at org.apache.maven.plugin.surefire.AbstractSurefireMojo.execute(AbstractSurefireMojo.java:586)
	at org.apache.maven.plugin.DefaultBuildPluginManager.executeMojo(DefaultBuildPluginManager.java:101)
	at org.apache.maven.lifecycle.internal.MojoExecutor.execute(MojoExecutor.java:209)
	... 31 more
Caused by: org.apache.maven.surefire.booter.SurefireBooterForkException: ExecutionException; nested exception is java.util.concurrent.ExecutionException: java.lang.RuntimeException: The forked VM terminated without saying properly goodbye. VM crash or System.exit called ?
	at org.apache.maven.plugin.surefire.booterclient.ForkStarter.runSuitesForkPerTestSet(ForkStarter.java:192)
	at org.apache.maven.plugin.surefire.booterclient.ForkStarter.run(ForkStarter.java:121)
	at org.apache.maven.plugin.surefire.AbstractSurefireMojo.executeProvider(AbstractSurefireMojo.java:740)
	at org.apache.maven.plugin.surefire.AbstractSurefireMojo.executeAllProviders(AbstractSurefireMojo.java:682)
	at org.apache.maven.plugin.surefire.AbstractSurefireMojo.executeAfterPreconditionsChecked(AbstractSurefireMojo.java:648)
	... 34 more
Caused by: java.util.concurrent.ExecutionException: java.lang.RuntimeException: The forked VM terminated without saying properly goodbye. VM crash or System.exit called ?
	at java.util.concurrent.FutureTask$Sync.innerGet(FutureTask.java:222)
	at java.util.concurrent.FutureTask.get(FutureTask.java:83)
	at org.apache.maven.plugin.surefire.booterclient.ForkStarter.runSuitesForkPerTestSet(ForkStarter.java:176)
	... 38 more
Caused by: java.lang.RuntimeException: The forked VM terminated without saying properly goodbye. VM crash or System.exit called ?
	at org.apache.maven.plugin.surefire.booterclient.output.ForkClient.close(ForkClient.java:257)
	at org.apache.maven.plugin.surefire.booterclient.ForkStarter.fork(ForkStarter.java:301)
	at org.apache.maven.plugin.surefire.booterclient.ForkStarter.access$100(ForkStarter.java:75)
	at org.apache.maven.plugin.surefire.booterclient.ForkStarter$1.call(ForkStarter.java:163)
	at org.apache.maven.plugin.surefire.booterclient.ForkStarter$1.call(ForkStarter.java:160)
	... 5 more
[ERROR] 
[ERROR] Re-run Maven using the -X switch to enable full debug logging.
[ERROR] 
[ERROR] For more information about the errors and possible solutions, please read the following articles:
[ERROR] [Help 1] http://cwiki.apache.org/confluence/display/MAVEN/MojoExecutionException
[ERROR] 
[ERROR] After correcting the problems, you can resume the build with the command
[ERROR]   mvn <goals> -rf :flume-ng-node

[JENKINS] Archiving <https://builds.apache.org/job/flume-trunk/ws/flume-ng-legacy-sources/flume-thrift-source/pom.xml> to org.apache.flume.flume-ng-legacy-sources/flume-thrift-source/1.5.0-SNAPSHOT/flume-thrift-source-1.5.0-SNAPSHOT.pom
[JENKINS] Archiving <https://builds.apache.org/job/flume-trunk/ws/flume-ng-legacy-sources/flume-thrift-source/target/flume-thrift-source-1.5.0-SNAPSHOT.jar> to org.apache.flume.flume-ng-legacy-sources/flume-thrift-source/1.5.0-SNAPSHOT/flume-thrift-source-1.5.0-SNAPSHOT.jar
[JENKINS] Archiving <https://builds.apache.org/job/flume-trunk/ws/flume-ng-dist/pom.xml> to org.apache.flume/flume-ng-dist/1.5.0-SNAPSHOT/flume-ng-dist-1.5.0-SNAPSHOT.pom
[JENKINS] Archiving <https://builds.apache.org/job/flume-trunk/ws/flume-ng-legacy-sources/pom.xml> to org.apache.flume/flume-ng-legacy-sources/1.5.0-SNAPSHOT/flume-ng-legacy-sources-1.5.0-SNAPSHOT.pom
[JENKINS] Archiving <https://builds.apache.org/job/flume-trunk/ws/flume-ng-sources/flume-twitter-source/pom.xml> to org.apache.flume.flume-ng-sources/flume-twitter-source/1.5.0-SNAPSHOT/flume-twitter-source-1.5.0-SNAPSHOT.pom
[JENKINS] Archiving <https://builds.apache.org/job/flume-trunk/ws/flume-ng-sources/flume-twitter-source/target/flume-twitter-source-1.5.0-SNAPSHOT.jar> to org.apache.flume.flume-ng-sources/flume-twitter-source/1.5.0-SNAPSHOT/flume-twitter-source-1.5.0-SNAPSHOT.jar
[JENKINS] Archiving <https://builds.apache.org/job/flume-trunk/ws/flume-ng-channels/flume-jdbc-channel/pom.xml> to org.apache.flume.flume-ng-channels/flume-jdbc-channel/1.5.0-SNAPSHOT/flume-jdbc-channel-1.5.0-SNAPSHOT.pom
[JENKINS] Archiving <https://builds.apache.org/job/flume-trunk/ws/flume-ng-channels/flume-jdbc-channel/target/flume-jdbc-channel-1.5.0-SNAPSHOT.jar> to org.apache.flume.flume-ng-channels/flume-jdbc-channel/1.5.0-SNAPSHOT/flume-jdbc-channel-1.5.0-SNAPSHOT.jar
[JENKINS] Archiving <https://builds.apache.org/job/flume-trunk/ws/flume-ng-clients/pom.xml> to org.apache.flume/flume-ng-clients/1.5.0-SNAPSHOT/flume-ng-clients-1.5.0-SNAPSHOT.pom
[JENKINS] Archiving <https://builds.apache.org/job/flume-trunk/ws/flume-ng-sinks/flume-ng-morphline-solr-sink/pom.xml> to org.apache.flume.flume-ng-sinks/flume-ng-morphline-solr-sink/1.5.0-SNAPSHOT/flume-ng-morphline-solr-sink-1.5.0-SNAPSHOT.pom
[JENKINS] Archiving <https://builds.apache.org/job/flume-trunk/ws/flume-ng-sinks/flume-ng-morphline-solr-sink/target/flume-ng-morphline-solr-sink-1.5.0-SNAPSHOT.jar> to org.apache.flume.flume-ng-sinks/flume-ng-morphline-solr-sink/1.5.0-SNAPSHOT/flume-ng-morphline-solr-sink-1.5.0-SNAPSHOT.jar
[JENKINS] Archiving <https://builds.apache.org/job/flume-trunk/ws/flume-ng-sinks/flume-ng-elasticsearch-sink/pom.xml> to org.apache.flume.flume-ng-sinks/flume-ng-elasticsearch-sink/1.5.0-SNAPSHOT/flume-ng-elasticsearch-sink-1.5.0-SNAPSHOT.pom
[JENKINS] Archiving <https://builds.apache.org/job/flume-trunk/ws/flume-ng-sinks/flume-ng-elasticsearch-sink/target/flume-ng-elasticsearch-sink-1.5.0-SNAPSHOT.jar> to org.apache.flume.flume-ng-sinks/flume-ng-elasticsearch-sink/1.5.0-SNAPSHOT/flume-ng-elasticsearch-sink-1.5.0-SNAPSHOT.jar
[JENKINS] Archiving <https://builds.apache.org/job/flume-trunk/ws/flume-ng-core/pom.xml> to org.apache.flume/flume-ng-core/1.5.0-SNAPSHOT/flume-ng-core-1.5.0-SNAPSHOT.pom
[JENKINS] Archiving <https://builds.apache.org/job/flume-trunk/ws/flume-ng-core/target/flume-ng-core-1.5.0-SNAPSHOT.jar> to org.apache.flume/flume-ng-core/1.5.0-SNAPSHOT/flume-ng-core-1.5.0-SNAPSHOT.jar
[JENKINS] Archiving <https://builds.apache.org/job/flume-trunk/ws/flume-ng-sources/flume-scribe-source/pom.xml> to org.apache.flume.flume-ng-sources/flume-scribe-source/1.5.0-SNAPSHOT/flume-scribe-source-1.5.0-SNAPSHOT.pom
[JENKINS] Archiving <https://builds.apache.org/job/flume-trunk/ws/flume-ng-sources/flume-scribe-source/target/flume-scribe-source-1.5.0-SNAPSHOT.jar> to org.apache.flume.flume-ng-sources/flume-scribe-source/1.5.0-SNAPSHOT/flume-scribe-source-1.5.0-SNAPSHOT.jar
[JENKINS] Archiving <https://builds.apache.org/job/flume-trunk/ws/flume-ng-channels/flume-file-channel/pom.xml> to org.apache.flume.flume-ng-channels/flume-file-channel/1.5.0-SNAPSHOT/flume-file-channel-1.5.0-SNAPSHOT.pom
[JENKINS] Archiving <https://builds.apache.org/job/flume-trunk/ws/flume-ng-channels/flume-file-channel/target/flume-file-channel-1.5.0-SNAPSHOT.jar> to org.apache.flume.flume-ng-channels/flume-file-channel/1.5.0-SNAPSHOT/flume-file-channel-1.5.0-SNAPSHOT.jar
[JENKINS] Archiving <https://builds.apache.org/job/flume-trunk/ws/flume-ng-configuration/pom.xml> to org.apache.flume/flume-ng-configuration/1.5.0-SNAPSHOT/flume-ng-configuration-1.5.0-SNAPSHOT.pom
[JENKINS] Archiving <https://builds.apache.org/job/flume-trunk/ws/flume-ng-configuration/target/flume-ng-configuration-1.5.0-SNAPSHOT.jar> to org.apache.flume/flume-ng-configuration/1.5.0-SNAPSHOT/flume-ng-configuration-1.5.0-SNAPSHOT.jar
[JENKINS] Archiving <https://builds.apache.org/job/flume-trunk/ws/flume-ng-legacy-sources/flume-avro-source/pom.xml> to org.apache.flume.flume-ng-legacy-sources/flume-avro-source/1.5.0-SNAPSHOT/flume-avro-source-1.5.0-SNAPSHOT.pom
[JENKINS] Archiving <https://builds.apache.org/job/flume-trunk/ws/flume-ng-legacy-sources/flume-avro-source/target/flume-avro-source-1.5.0-SNAPSHOT.jar> to org.apache.flume.flume-ng-legacy-sources/flume-avro-source/1.5.0-SNAPSHOT/flume-avro-source-1.5.0-SNAPSHOT.jar
[JENKINS] Archiving <https://builds.apache.org/job/flume-trunk/ws/flume-ng-sinks/flume-irc-sink/pom.xml> to org.apache.flume.flume-ng-sinks/flume-irc-sink/1.5.0-SNAPSHOT/flume-irc-sink-1.5.0-SNAPSHOT.pom
[JENKINS] Archiving <https://builds.apache.org/job/flume-trunk/ws/flume-ng-sinks/flume-irc-sink/target/flume-irc-sink-1.5.0-SNAPSHOT.jar> to org.apache.flume.flume-ng-sinks/flume-irc-sink/1.5.0-SNAPSHOT/flume-irc-sink-1.5.0-SNAPSHOT.jar
[JENKINS] Archiving <https://builds.apache.org/job/flume-trunk/ws/flume-tools/pom.xml> to org.apache.flume/flume-tools/1.5.0-SNAPSHOT/flume-tools-1.5.0-SNAPSHOT.pom
[JENKINS] Archiving <https://builds.apache.org/job/flume-trunk/ws/flume-tools/target/flume-tools-1.5.0-SNAPSHOT.jar> to org.apache.flume/flume-tools/1.5.0-SNAPSHOT/flume-tools-1.5.0-SNAPSHOT.jar
[JENKINS] Archiving <https://builds.apache.org/job/flume-trunk/ws/pom.xml> to org.apache.flume/flume-parent/1.5.0-SNAPSHOT/flume-parent-1.5.0-SNAPSHOT.pom
[JENKINS] Archiving <https://builds.apache.org/job/flume-trunk/ws/flume-ng-node/pom.xml> to org.apache.flume/flume-ng-node/1.5.0-SNAPSHOT/flume-ng-node-1.5.0-SNAPSHOT.pom
[JENKINS] Archiving <https://builds.apache.org/job/flume-trunk/ws/flume-ng-sinks/pom.xml> to org.apache.flume/flume-ng-sinks/1.5.0-SNAPSHOT/flume-ng-sinks-1.5.0-SNAPSHOT.pom
[JENKINS] Archiving <https://builds.apache.org/job/flume-trunk/ws/flume-ng-channels/pom.xml> to org.apache.flume/flume-ng-channels/1.5.0-SNAPSHOT/flume-ng-channels-1.5.0-SNAPSHOT.pom
[JENKINS] Archiving <https://builds.apache.org/job/flume-trunk/ws/flume-ng-sources/flume-jms-source/pom.xml> to org.apache.flume.flume-ng-sources/flume-jms-source/1.5.0-SNAPSHOT/flume-jms-source-1.5.0-SNAPSHOT.pom
[JENKINS] Archiving <https://builds.apache.org/job/flume-trunk/ws/flume-ng-sources/flume-jms-source/target/flume-jms-source-1.5.0-SNAPSHOT.jar> to org.apache.flume.flume-ng-sources/flume-jms-source/1.5.0-SNAPSHOT/flume-jms-source-1.5.0-SNAPSHOT.jar
[JENKINS] Archiving <https://builds.apache.org/job/flume-trunk/ws/flume-ng-clients/flume-ng-log4jappender/pom.xml> to org.apache.flume.flume-ng-clients/flume-ng-log4jappender/1.5.0-SNAPSHOT/flume-ng-log4jappender-1.5.0-SNAPSHOT.pom
[JENKINS] Archiving <https://builds.apache.org/job/flume-trunk/ws/flume-ng-clients/flume-ng-log4jappender/target/flume-ng-log4jappender-1.5.0-SNAPSHOT.jar> to org.apache.flume.flume-ng-clients/flume-ng-log4jappender/1.5.0-SNAPSHOT/flume-ng-log4jappender-1.5.0-SNAPSHOT.jar
[JENKINS] Archiving <https://builds.apache.org/job/flume-trunk/ws/flume-ng-clients/flume-ng-log4jappender/target/flume-ng-log4jappender-1.5.0-SNAPSHOT-jar-with-dependencies.jar> to org.apache.flume.flume-ng-clients/flume-ng-log4jappender/1.5.0-SNAPSHOT/flume-ng-log4jappender-1.5.0-SNAPSHOT-jar-with-dependencies.jar
[JENKINS] Archiving <https://builds.apache.org/job/flume-trunk/ws/flume-ng-tests/pom.xml> to org.apache.flume/flume-ng-tests/1.5.0-SNAPSHOT/flume-ng-tests-1.5.0-SNAPSHOT.pom
[JENKINS] Archiving <https://builds.apache.org/job/flume-trunk/ws/flume-ng-tests/target/flume-ng-tests-1.5.0-SNAPSHOT.jar> to org.apache.flume/flume-ng-tests/1.5.0-SNAPSHOT/flume-ng-tests-1.5.0-SNAPSHOT.jar
[JENKINS] Archiving <https://builds.apache.org/job/flume-trunk/ws/flume-ng-sdk/pom.xml> to org.apache.flume/flume-ng-sdk/1.5.0-SNAPSHOT/flume-ng-sdk-1.5.0-SNAPSHOT.pom
[JENKINS] Archiving <https://builds.apache.org/job/flume-trunk/ws/flume-ng-sdk/target/flume-ng-sdk-1.5.0-SNAPSHOT.jar> to org.apache.flume/flume-ng-sdk/1.5.0-SNAPSHOT/flume-ng-sdk-1.5.0-SNAPSHOT.jar
[JENKINS] Archiving <https://builds.apache.org/job/flume-trunk/ws/flume-ng-sdk/target/flume-ng-sdk-1.5.0-SNAPSHOT-tests.jar> to org.apache.flume/flume-ng-sdk/1.5.0-SNAPSHOT/flume-ng-sdk-1.5.0-SNAPSHOT-tests.jar
[JENKINS] Archiving <https://builds.apache.org/job/flume-trunk/ws/flume-ng-embedded-agent/pom.xml> to org.apache.flume/flume-ng-embedded-agent/1.5.0-SNAPSHOT/flume-ng-embedded-agent-1.5.0-SNAPSHOT.pom
[JENKINS] Archiving <https://builds.apache.org/job/flume-trunk/ws/flume-ng-sinks/flume-ng-hbase-sink/pom.xml> to org.apache.flume.flume-ng-sinks/flume-ng-hbase-sink/1.5.0-SNAPSHOT/flume-ng-hbase-sink-1.5.0-SNAPSHOT.pom
[JENKINS] Archiving <https://builds.apache.org/job/flume-trunk/ws/flume-ng-sinks/flume-ng-hbase-sink/target/flume-ng-hbase-sink-1.5.0-SNAPSHOT.jar> to org.apache.flume.flume-ng-sinks/flume-ng-hbase-sink/1.5.0-SNAPSHOT/flume-ng-hbase-sink-1.5.0-SNAPSHOT.jar
[JENKINS] Archiving <https://builds.apache.org/job/flume-trunk/ws/flume-ng-sinks/flume-hdfs-sink/pom.xml> to org.apache.flume.flume-ng-sinks/flume-hdfs-sink/1.5.0-SNAPSHOT/flume-hdfs-sink-1.5.0-SNAPSHOT.pom
[JENKINS] Archiving <https://builds.apache.org/job/flume-trunk/ws/flume-ng-sinks/flume-hdfs-sink/target/flume-hdfs-sink-1.5.0-SNAPSHOT.jar> to org.apache.flume.flume-ng-sinks/flume-hdfs-sink/1.5.0-SNAPSHOT/flume-hdfs-sink-1.5.0-SNAPSHOT.jar
[JENKINS] Archiving <https://builds.apache.org/job/flume-trunk/ws/flume-ng-sources/pom.xml> to org.apache.flume/flume-ng-sources/1.5.0-SNAPSHOT/flume-ng-sources-1.5.0-SNAPSHOT.pom
channel stopped
[WARNINGS] Skipping publisher since build result is FAILURE
Updating FLUME-2209
Updating FLUME-2262
Updating FLUME-2238

Build failed in Jenkins: flume-trunk #523

Posted by Apache Jenkins Server <je...@builds.apache.org>.
See <https://builds.apache.org/job/flume-trunk/523/changes>

Changes:

[mpercy] FLUME-2255. Correctly handle ChannelExceptions in SpoolingDirectorySource

------------------------------------------
[...truncated 3977 lines...]
[INFO] 
[INFO] --- maven-remote-resources-plugin:1.1:process (default) @ flume-ng-tests ---
[INFO] 
[INFO] --- maven-resources-plugin:2.4.3:resources (default-resources) @ flume-ng-tests ---
[INFO] Using 'UTF-8' encoding to copy filtered resources.
[INFO] skip non existing resourceDirectory <https://builds.apache.org/job/flume-trunk/ws/flume-ng-tests/src/main/resources>
[INFO] Copying 3 resources
[INFO] 
[INFO] --- maven-compiler-plugin:2.3.2:compile (default-compile) @ flume-ng-tests ---
[INFO] Compiling 1 source file to <https://builds.apache.org/job/flume-trunk/ws/flume-ng-tests/target/classes>
[INFO] 
[INFO] --- maven-resources-plugin:2.4.3:testResources (default-testResources) @ flume-ng-tests ---
[INFO] Using 'UTF-8' encoding to copy filtered resources.
[INFO] Copying 2 resources
[INFO] Copying 3 resources
[INFO] 
[INFO] --- maven-compiler-plugin:2.3.2:testCompile (default-testCompile) @ flume-ng-tests ---
[INFO] Compiling 5 source files to <https://builds.apache.org/job/flume-trunk/ws/flume-ng-tests/target/test-classes>
[INFO] 
[INFO] --- maven-surefire-plugin:2.14.1:test (default-test) @ flume-ng-tests ---
Downloading: http://repo1.maven.org/maven2/org/apache/maven/surefire/maven-surefire-common/2.14.1/maven-surefire-common-2.14.1.pom
Downloaded: http://repo1.maven.org/maven2/org/apache/maven/surefire/maven-surefire-common/2.14.1/maven-surefire-common-2.14.1.pom (6 KB at 105.7 KB/sec)
Downloading: http://repo1.maven.org/maven2/org/apache/maven/plugin-tools/maven-plugin-annotations/3.2/maven-plugin-annotations-3.2.pom
Downloaded: http://repo1.maven.org/maven2/org/apache/maven/plugin-tools/maven-plugin-annotations/3.2/maven-plugin-annotations-3.2.pom (2 KB at 31.1 KB/sec)
Downloading: http://repo1.maven.org/maven2/org/apache/maven/plugin-tools/maven-plugin-tools/3.2/maven-plugin-tools-3.2.pom
Downloaded: http://repo1.maven.org/maven2/org/apache/maven/plugin-tools/maven-plugin-tools/3.2/maven-plugin-tools-3.2.pom (17 KB at 316.5 KB/sec)
Downloading: http://repo1.maven.org/maven2/org/codehaus/plexus/plexus-utils/1.5.1/plexus-utils-1.5.1.pom
Downloaded: http://repo1.maven.org/maven2/org/codehaus/plexus/plexus-utils/1.5.1/plexus-utils-1.5.1.pom (3 KB at 44.0 KB/sec)
Downloading: http://repo1.maven.org/maven2/org/apache/maven/surefire/surefire-api/2.14.1/surefire-api-2.14.1.pom
Downloaded: http://repo1.maven.org/maven2/org/apache/maven/surefire/surefire-api/2.14.1/surefire-api-2.14.1.pom (3 KB at 47.8 KB/sec)
Downloading: http://repo1.maven.org/maven2/org/apache/maven/surefire/surefire-booter/2.14.1/surefire-booter-2.14.1.pom
Downloaded: http://repo1.maven.org/maven2/org/apache/maven/surefire/surefire-booter/2.14.1/surefire-booter-2.14.1.pom (3 KB at 56.9 KB/sec)
Downloading: http://repo1.maven.org/maven2/org/apache/maven/surefire/maven-surefire-common/2.14.1/maven-surefire-common-2.14.1.jar
Downloading: http://repo1.maven.org/maven2/org/apache/maven/surefire/surefire-booter/2.14.1/surefire-booter-2.14.1.jar
Downloading: http://repo1.maven.org/maven2/org/codehaus/plexus/plexus-utils/1.5.1/plexus-utils-1.5.1.jar
Downloading: http://repo1.maven.org/maven2/org/apache/maven/surefire/surefire-api/2.14.1/surefire-api-2.14.1.jar
Downloading: http://repo1.maven.org/maven2/org/apache/maven/plugin-tools/maven-plugin-annotations/3.2/maven-plugin-annotations-3.2.jar
Downloaded: http://repo1.maven.org/maven2/org/apache/maven/plugin-tools/maven-plugin-annotations/3.2/maven-plugin-annotations-3.2.jar (15 KB at 155.0 KB/sec)
Downloaded: http://repo1.maven.org/maven2/org/apache/maven/surefire/surefire-booter/2.14.1/surefire-booter-2.14.1.jar (36 KB at 276.6 KB/sec)
Downloaded: http://repo1.maven.org/maven2/org/apache/maven/surefire/maven-surefire-common/2.14.1/maven-surefire-common-2.14.1.jar (228 KB at 1137.5 KB/sec)
Downloaded: http://repo1.maven.org/maven2/org/apache/maven/surefire/surefire-api/2.14.1/surefire-api-2.14.1.jar (153 KB at 754.5 KB/sec)
Downloaded: http://repo1.maven.org/maven2/org/codehaus/plexus/plexus-utils/1.5.1/plexus-utils-1.5.1.jar (206 KB at 868.1 KB/sec)
[WARNING] The parameter forkMode is deprecated since version 2.14. Use forkCount and reuseForks instead.
[INFO] Surefire report directory: <https://builds.apache.org/job/flume-trunk/ws/flume-ng-tests/target/surefire-reports>
Downloading: http://repo1.maven.org/maven2/org/apache/maven/surefire/surefire-junit4/2.14.1/surefire-junit4-2.14.1.pom
Downloaded: http://repo1.maven.org/maven2/org/apache/maven/surefire/surefire-junit4/2.14.1/surefire-junit4-2.14.1.pom (3 KB at 48.7 KB/sec)
Downloading: http://repo1.maven.org/maven2/org/apache/maven/surefire/surefire-providers/2.14.1/surefire-providers-2.14.1.pom
Downloaded: http://repo1.maven.org/maven2/org/apache/maven/surefire/surefire-providers/2.14.1/surefire-providers-2.14.1.pom (3 KB at 47.4 KB/sec)
Downloading: http://repo1.maven.org/maven2/org/apache/maven/surefire/surefire-junit4/2.14.1/surefire-junit4-2.14.1.jar
Downloaded: http://repo1.maven.org/maven2/org/apache/maven/surefire/surefire-junit4/2.14.1/surefire-junit4-2.14.1.jar (78 KB at 1078.2 KB/sec)

-------------------------------------------------------
 T E S T S
-------------------------------------------------------

-------------------------------------------------------
 T E S T S
-------------------------------------------------------
Running org.apache.flume.test.agent.TestFileChannel
Tests run: 1, Failures: 0, Errors: 0, Skipped: 0, Time elapsed: 16.977 sec
Running org.apache.flume.test.agent.TestSpooldirSource
Tests run: 1, Failures: 0, Errors: 0, Skipped: 0, Time elapsed: 17.123 sec
Running org.apache.flume.test.agent.TestRpcClient
Tests run: 1, Failures: 0, Errors: 0, Skipped: 0, Time elapsed: 7.255 sec
Running org.apache.flume.test.agent.TestRpcClientCommunicationFailure
Tests run: 1, Failures: 0, Errors: 0, Skipped: 0, Time elapsed: 7.244 sec

Results :

Tests run: 4, Failures: 0, Errors: 0, Skipped: 0

[JENKINS] Recording test results
[INFO] 
[INFO] --- maven-jar-plugin:2.3.1:jar (default-jar) @ flume-ng-tests ---
[INFO] Building jar: <https://builds.apache.org/job/flume-trunk/ws/flume-ng-tests/target/flume-ng-tests-1.5.0-SNAPSHOT.jar>
[INFO] 
[INFO] --- apache-rat-plugin:0.7:check (verify.rat) @ flume-ng-tests ---
[INFO] Exclude: .idea/
[INFO] Exclude: **/*.iml
[INFO] Exclude: **/nb-configuration.xml
[INFO] Exclude: .git/
[INFO] Exclude: patchprocess/
[INFO] Exclude: .gitignore
[INFO] Exclude: .repository/
[INFO] Exclude: **/*.diff
[INFO] Exclude: **/*.patch
[INFO] Exclude: **/*.avsc
[INFO] Exclude: **/*.avro
[INFO] Exclude: **/docs/**
[INFO] Exclude: **/test/resources/**
[INFO] Exclude: **/.settings/*
[INFO] Exclude: **/.classpath
[INFO] Exclude: **/.project
[INFO] Exclude: **/target/**
[INFO] ------------------------------------------------------------------------
[INFO] Reactor Summary:
[INFO] 
[INFO] Apache Flume ...................................... SUCCESS [24.140s]
[INFO] Flume NG SDK ...................................... SUCCESS [1:41.778s]
[INFO] Flume NG Configuration ............................ SUCCESS [9.072s]
[INFO] Flume NG Core ..................................... SUCCESS [5:02.417s]
[INFO] Flume NG Sinks .................................... SUCCESS [5.009s]
[INFO] Flume NG HDFS Sink ................................ SUCCESS [1:23.510s]
[INFO] Flume NG IRC Sink ................................. SUCCESS [5.545s]
[INFO] Flume NG Channels ................................. SUCCESS [5.929s]
[INFO] Flume NG JDBC channel ............................. SUCCESS [46.411s]
[INFO] Flume NG file-based channel ....................... FAILURE [4:13.073s]
[INFO] Flume NG Node ..................................... SKIPPED
[INFO] Flume NG Embedded Agent ........................... SKIPPED
[INFO] Flume NG HBase Sink ............................... SUCCESS [2:09.719s]
[INFO] Flume NG ElasticSearch Sink ....................... SUCCESS [19.786s]
[INFO] Flume NG Morphline Solr Sink ...................... SUCCESS [1:47.224s]
[INFO] Flume Sources ..................................... SUCCESS [4.371s]
[INFO] Flume Scribe Source ............................... SUCCESS [6.499s]
[INFO] Flume JMS Source .................................. SUCCESS [20.427s]
[INFO] Flume Twitter Source .............................. SUCCESS [3.396s]
[INFO] Flume legacy Sources .............................. SUCCESS [4.407s]
[INFO] Flume legacy Avro source .......................... SUCCESS [7.068s]
[INFO] Flume legacy Thrift Source ........................ SUCCESS [7.759s]
[INFO] Flume NG Clients .................................. SUCCESS [6.585s]
[INFO] Flume NG Log4j Appender ........................... SUCCESS [41.511s]
[INFO] Flume NG Tools .................................... SKIPPED
[INFO] Flume NG distribution ............................. SKIPPED
[INFO] Flume NG Integration Tests ........................ SUCCESS [1:00.002s]
[INFO] ------------------------------------------------------------------------
[INFO] BUILD FAILURE
[INFO] ------------------------------------------------------------------------
[INFO] Total time: 22:31.207s
[INFO] Finished at: Fri Dec 06 10:50:40 UTC 2013
[INFO] Final Memory: 164M/441M
[INFO] ------------------------------------------------------------------------
Waiting for Jenkins to finish collecting data
[JENKINS] Archiving <https://builds.apache.org/job/flume-trunk/ws/flume-ng-legacy-sources/flume-thrift-source/pom.xml> to org.apache.flume.flume-ng-legacy-sources/flume-thrift-source/1.5.0-SNAPSHOT/flume-thrift-source-1.5.0-SNAPSHOT.pom
[JENKINS] Archiving <https://builds.apache.org/job/flume-trunk/ws/flume-ng-legacy-sources/flume-thrift-source/target/flume-thrift-source-1.5.0-SNAPSHOT.jar> to org.apache.flume.flume-ng-legacy-sources/flume-thrift-source/1.5.0-SNAPSHOT/flume-thrift-source-1.5.0-SNAPSHOT.jar
[ERROR] Failed to execute goal org.apache.maven.plugins:maven-surefire-plugin:2.12.3:test (default-test) on project flume-file-channel: ExecutionException; nested exception is java.util.concurrent.ExecutionException: java.lang.RuntimeException: The forked VM terminated without saying properly goodbye. VM crash or System.exit called ? -> [Help 1]
org.apache.maven.lifecycle.LifecycleExecutionException: Failed to execute goal org.apache.maven.plugins:maven-surefire-plugin:2.12.3:test (default-test) on project flume-file-channel: ExecutionException; nested exception is java.util.concurrent.ExecutionException: java.lang.RuntimeException: The forked VM terminated without saying properly goodbye. VM crash or System.exit called ?
	at org.apache.maven.lifecycle.internal.MojoExecutor.execute(MojoExecutor.java:217)
	at org.apache.maven.lifecycle.internal.MojoExecutor.execute(MojoExecutor.java:153)
	at org.apache.maven.lifecycle.internal.MojoExecutor.execute(MojoExecutor.java:145)
	at org.apache.maven.lifecycle.internal.LifecycleModuleBuilder.buildProject(LifecycleModuleBuilder.java:84)
	at org.apache.maven.lifecycle.internal.LifecycleModuleBuilder.buildProject(LifecycleModuleBuilder.java:59)
	at org.apache.maven.lifecycle.internal.LifecycleStarter.singleThreadedBuild(LifecycleStarter.java:183)
	at org.apache.maven.lifecycle.internal.LifecycleStarter.execute(LifecycleStarter.java:161)
	at org.apache.maven.DefaultMaven.doExecute(DefaultMaven.java:319)
	at org.apache.maven.DefaultMaven.execute(DefaultMaven.java:156)
	at org.jvnet.hudson.maven3.launcher.Maven3Launcher.main(Maven3Launcher.java:117)
	at sun.reflect.NativeMethodAccessorImpl.invoke0(Native Method)
	at sun.reflect.NativeMethodAccessorImpl.invoke(NativeMethodAccessorImpl.java:39)
	at sun.reflect.DelegatingMethodAccessorImpl.invoke(DelegatingMethodAccessorImpl.java:25)
	at java.lang.reflect.Method.invoke(Method.java:597)
	at org.codehaus.plexus.classworlds.launcher.Launcher.launchStandard(Launcher.java:329)
	at org.codehaus.plexus.classworlds.launcher.Launcher.launch(Launcher.java:239)
	at org.jvnet.hudson.maven3.agent.Maven3Main.launch(Maven3Main.java:178)
	at sun.reflect.NativeMethodAccessorImpl.invoke0(Native Method)
	at sun.reflect.NativeMethodAccessorImpl.invoke(NativeMethodAccessorImpl.java:39)
	at sun.reflect.DelegatingMethodAccessorImpl.invoke(DelegatingMethodAccessorImpl.java:25)
	at java.lang.reflect.Method.invoke(Method.java:597)
	at hudson.maven.Maven3Builder.call(Maven3Builder.java:134)
	at hudson.maven.Maven3Builder.call(Maven3Builder.java:69)
	at hudson.remoting.UserRequest.perform(UserRequest.java:118)
	at hudson.remoting.UserRequest.perform(UserRequest.java:48)
	at hudson.remoting.Request$2.run(Request.java:328)
	at hudson.remoting.InterceptingExecutorService$1.call(InterceptingExecutorService.java:72)
	at java.util.concurrent.FutureTask$Sync.innerRun(FutureTask.java:303)
	at java.util.concurrent.FutureTask.run(FutureTask.java:138)
	at java.util.concurrent.ThreadPoolExecutor$Worker.runTask(ThreadPoolExecutor.java:895)
	at java.util.concurrent.ThreadPoolExecutor$Worker.run(ThreadPoolExecutor.java:918)
	at java.lang.Thread.run(Thread.java:662)
Caused by: org.apache.maven.plugin.MojoExecutionException: ExecutionException; nested exception is java.util.concurrent.ExecutionException: java.lang.RuntimeException: The forked VM terminated without saying properly goodbye. VM crash or System.exit called ?
	at org.apache.maven.plugin.surefire.SurefirePlugin.assertNoException(SurefirePlugin.java:160)
	at org.apache.maven.plugin.surefire.SurefirePlugin.handleSummary(SurefirePlugin.java:149)
	at org.apache.maven.plugin.surefire.AbstractSurefireMojo.executeAfterPreconditionsChecked(AbstractSurefireMojo.java:650)
	at org.apache.maven.plugin.surefire.AbstractSurefireMojo.execute(AbstractSurefireMojo.java:586)
	at org.apache.maven.plugin.DefaultBuildPluginManager.executeMojo(DefaultBuildPluginManager.java:101)
	at org.apache.maven.lifecycle.internal.MojoExecutor.execute(MojoExecutor.java:209)
	... 31 more
Caused by: org.apache.maven.surefire.booter.SurefireBooterForkException: ExecutionException; nested exception is java.util.concurrent.ExecutionException: java.lang.RuntimeException: The forked VM terminated without saying properly goodbye. VM crash or System.exit called ?
	at org.apache.maven.plugin.surefire.booterclient.ForkStarter.runSuitesForkPerTestSet(ForkStarter.java:192)
	at org.apache.maven.plugin.surefire.booterclient.ForkStarter.run(ForkStarter.java:121)
	at org.apache.maven.plugin.surefire.AbstractSurefireMojo.executeProvider(AbstractSurefireMojo.java:740)
	at org.apache.maven.plugin.surefire.AbstractSurefireMojo.executeAllProviders(AbstractSurefireMojo.java:682)
	at org.apache.maven.plugin.surefire.AbstractSurefireMojo.executeAfterPreconditionsChecked(AbstractSurefireMojo.java:648)
	... 34 more
Caused by: java.util.concurrent.ExecutionException: java.lang.RuntimeException: The forked VM terminated without saying properly goodbye. VM crash or System.exit called ?
	at java.util.concurrent.FutureTask$Sync.innerGet(FutureTask.java:222)
	at java.util.concurrent.FutureTask.get(FutureTask.java:83)
	at org.apache.maven.plugin.surefire.booterclient.ForkStarter.runSuitesForkPerTestSet(ForkStarter.java:176)
	... 38 more
Caused by: java.lang.RuntimeException: The forked VM terminated without saying properly goodbye. VM crash or System.exit called ?
	at org.apache.maven.plugin.surefire.booterclient.output.ForkClient.close(ForkClient.java:257)
	at org.apache.maven.plugin.surefire.booterclient.ForkStarter.fork(ForkStarter.java:301)
	at org.apache.maven.plugin.surefire.booterclient.ForkStarter.access$100(ForkStarter.java:75)
	at org.apache.maven.plugin.surefire.booterclient.ForkStarter$1.call(ForkStarter.java:163)
	at org.apache.maven.plugin.surefire.booterclient.ForkStarter$1.call(ForkStarter.java:160)
	... 5 more
[ERROR] 
[ERROR] Re-run Maven using the -X switch to enable full debug logging.
[ERROR] 
[ERROR] For more information about the errors and possible solutions, please read the following articles:
[ERROR] [Help 1] http://cwiki.apache.org/confluence/display/MAVEN/MojoExecutionException
[ERROR] 
[ERROR] After correcting the problems, you can resume the build with the command
[ERROR]   mvn <goals> -rf :flume-file-channel
[JENKINS] Archiving <https://builds.apache.org/job/flume-trunk/ws/flume-ng-dist/pom.xml> to org.apache.flume/flume-ng-dist/1.5.0-SNAPSHOT/flume-ng-dist-1.5.0-SNAPSHOT.pom
[JENKINS] Archiving <https://builds.apache.org/job/flume-trunk/ws/flume-ng-legacy-sources/pom.xml> to org.apache.flume/flume-ng-legacy-sources/1.5.0-SNAPSHOT/flume-ng-legacy-sources-1.5.0-SNAPSHOT.pom
[JENKINS] Archiving <https://builds.apache.org/job/flume-trunk/ws/flume-ng-sources/flume-twitter-source/pom.xml> to org.apache.flume.flume-ng-sources/flume-twitter-source/1.5.0-SNAPSHOT/flume-twitter-source-1.5.0-SNAPSHOT.pom
[JENKINS] Archiving <https://builds.apache.org/job/flume-trunk/ws/flume-ng-sources/flume-twitter-source/target/flume-twitter-source-1.5.0-SNAPSHOT.jar> to org.apache.flume.flume-ng-sources/flume-twitter-source/1.5.0-SNAPSHOT/flume-twitter-source-1.5.0-SNAPSHOT.jar
[JENKINS] Archiving <https://builds.apache.org/job/flume-trunk/ws/flume-ng-channels/flume-jdbc-channel/pom.xml> to org.apache.flume.flume-ng-channels/flume-jdbc-channel/1.5.0-SNAPSHOT/flume-jdbc-channel-1.5.0-SNAPSHOT.pom
[JENKINS] Archiving <https://builds.apache.org/job/flume-trunk/ws/flume-ng-channels/flume-jdbc-channel/target/flume-jdbc-channel-1.5.0-SNAPSHOT.jar> to org.apache.flume.flume-ng-channels/flume-jdbc-channel/1.5.0-SNAPSHOT/flume-jdbc-channel-1.5.0-SNAPSHOT.jar
[JENKINS] Archiving <https://builds.apache.org/job/flume-trunk/ws/flume-ng-clients/pom.xml> to org.apache.flume/flume-ng-clients/1.5.0-SNAPSHOT/flume-ng-clients-1.5.0-SNAPSHOT.pom
[JENKINS] Archiving <https://builds.apache.org/job/flume-trunk/ws/flume-ng-sinks/flume-ng-morphline-solr-sink/pom.xml> to org.apache.flume.flume-ng-sinks/flume-ng-morphline-solr-sink/1.5.0-SNAPSHOT/flume-ng-morphline-solr-sink-1.5.0-SNAPSHOT.pom
[JENKINS] Archiving <https://builds.apache.org/job/flume-trunk/ws/flume-ng-sinks/flume-ng-morphline-solr-sink/target/flume-ng-morphline-solr-sink-1.5.0-SNAPSHOT.jar> to org.apache.flume.flume-ng-sinks/flume-ng-morphline-solr-sink/1.5.0-SNAPSHOT/flume-ng-morphline-solr-sink-1.5.0-SNAPSHOT.jar
[JENKINS] Archiving <https://builds.apache.org/job/flume-trunk/ws/flume-ng-sinks/flume-ng-elasticsearch-sink/pom.xml> to org.apache.flume.flume-ng-sinks/flume-ng-elasticsearch-sink/1.5.0-SNAPSHOT/flume-ng-elasticsearch-sink-1.5.0-SNAPSHOT.pom
[JENKINS] Archiving <https://builds.apache.org/job/flume-trunk/ws/flume-ng-sinks/flume-ng-elasticsearch-sink/target/flume-ng-elasticsearch-sink-1.5.0-SNAPSHOT.jar> to org.apache.flume.flume-ng-sinks/flume-ng-elasticsearch-sink/1.5.0-SNAPSHOT/flume-ng-elasticsearch-sink-1.5.0-SNAPSHOT.jar
[JENKINS] Archiving <https://builds.apache.org/job/flume-trunk/ws/flume-ng-core/pom.xml> to org.apache.flume/flume-ng-core/1.5.0-SNAPSHOT/flume-ng-core-1.5.0-SNAPSHOT.pom
[JENKINS] Archiving <https://builds.apache.org/job/flume-trunk/ws/flume-ng-core/target/flume-ng-core-1.5.0-SNAPSHOT.jar> to org.apache.flume/flume-ng-core/1.5.0-SNAPSHOT/flume-ng-core-1.5.0-SNAPSHOT.jar
[JENKINS] Archiving <https://builds.apache.org/job/flume-trunk/ws/flume-ng-sources/flume-scribe-source/pom.xml> to org.apache.flume.flume-ng-sources/flume-scribe-source/1.5.0-SNAPSHOT/flume-scribe-source-1.5.0-SNAPSHOT.pom
[JENKINS] Archiving <https://builds.apache.org/job/flume-trunk/ws/flume-ng-sources/flume-scribe-source/target/flume-scribe-source-1.5.0-SNAPSHOT.jar> to org.apache.flume.flume-ng-sources/flume-scribe-source/1.5.0-SNAPSHOT/flume-scribe-source-1.5.0-SNAPSHOT.jar
[JENKINS] Archiving <https://builds.apache.org/job/flume-trunk/ws/flume-ng-channels/flume-file-channel/pom.xml> to org.apache.flume.flume-ng-channels/flume-file-channel/1.5.0-SNAPSHOT/flume-file-channel-1.5.0-SNAPSHOT.pom
[JENKINS] Archiving <https://builds.apache.org/job/flume-trunk/ws/flume-ng-configuration/pom.xml> to org.apache.flume/flume-ng-configuration/1.5.0-SNAPSHOT/flume-ng-configuration-1.5.0-SNAPSHOT.pom
[JENKINS] Archiving <https://builds.apache.org/job/flume-trunk/ws/flume-ng-configuration/target/flume-ng-configuration-1.5.0-SNAPSHOT.jar> to org.apache.flume/flume-ng-configuration/1.5.0-SNAPSHOT/flume-ng-configuration-1.5.0-SNAPSHOT.jar
[JENKINS] Archiving <https://builds.apache.org/job/flume-trunk/ws/flume-ng-legacy-sources/flume-avro-source/pom.xml> to org.apache.flume.flume-ng-legacy-sources/flume-avro-source/1.5.0-SNAPSHOT/flume-avro-source-1.5.0-SNAPSHOT.pom
[JENKINS] Archiving <https://builds.apache.org/job/flume-trunk/ws/flume-ng-legacy-sources/flume-avro-source/target/flume-avro-source-1.5.0-SNAPSHOT.jar> to org.apache.flume.flume-ng-legacy-sources/flume-avro-source/1.5.0-SNAPSHOT/flume-avro-source-1.5.0-SNAPSHOT.jar
[JENKINS] Archiving <https://builds.apache.org/job/flume-trunk/ws/flume-ng-sinks/flume-irc-sink/pom.xml> to org.apache.flume.flume-ng-sinks/flume-irc-sink/1.5.0-SNAPSHOT/flume-irc-sink-1.5.0-SNAPSHOT.pom
[JENKINS] Archiving <https://builds.apache.org/job/flume-trunk/ws/flume-ng-sinks/flume-irc-sink/target/flume-irc-sink-1.5.0-SNAPSHOT.jar> to org.apache.flume.flume-ng-sinks/flume-irc-sink/1.5.0-SNAPSHOT/flume-irc-sink-1.5.0-SNAPSHOT.jar
[JENKINS] Archiving <https://builds.apache.org/job/flume-trunk/ws/flume-tools/pom.xml> to org.apache.flume/flume-tools/1.5.0-SNAPSHOT/flume-tools-1.5.0-SNAPSHOT.pom
[JENKINS] Archiving <https://builds.apache.org/job/flume-trunk/ws/pom.xml> to org.apache.flume/flume-parent/1.5.0-SNAPSHOT/flume-parent-1.5.0-SNAPSHOT.pom
[JENKINS] Archiving <https://builds.apache.org/job/flume-trunk/ws/flume-ng-node/pom.xml> to org.apache.flume/flume-ng-node/1.5.0-SNAPSHOT/flume-ng-node-1.5.0-SNAPSHOT.pom
[JENKINS] Archiving <https://builds.apache.org/job/flume-trunk/ws/flume-ng-sinks/pom.xml> to org.apache.flume/flume-ng-sinks/1.5.0-SNAPSHOT/flume-ng-sinks-1.5.0-SNAPSHOT.pom
[JENKINS] Archiving <https://builds.apache.org/job/flume-trunk/ws/flume-ng-channels/pom.xml> to org.apache.flume/flume-ng-channels/1.5.0-SNAPSHOT/flume-ng-channels-1.5.0-SNAPSHOT.pom
[JENKINS] Archiving <https://builds.apache.org/job/flume-trunk/ws/flume-ng-sources/flume-jms-source/pom.xml> to org.apache.flume.flume-ng-sources/flume-jms-source/1.5.0-SNAPSHOT/flume-jms-source-1.5.0-SNAPSHOT.pom
[JENKINS] Archiving <https://builds.apache.org/job/flume-trunk/ws/flume-ng-sources/flume-jms-source/target/flume-jms-source-1.5.0-SNAPSHOT.jar> to org.apache.flume.flume-ng-sources/flume-jms-source/1.5.0-SNAPSHOT/flume-jms-source-1.5.0-SNAPSHOT.jar
[JENKINS] Archiving <https://builds.apache.org/job/flume-trunk/ws/flume-ng-clients/flume-ng-log4jappender/pom.xml> to org.apache.flume.flume-ng-clients/flume-ng-log4jappender/1.5.0-SNAPSHOT/flume-ng-log4jappender-1.5.0-SNAPSHOT.pom
[JENKINS] Archiving <https://builds.apache.org/job/flume-trunk/ws/flume-ng-clients/flume-ng-log4jappender/target/flume-ng-log4jappender-1.5.0-SNAPSHOT.jar> to org.apache.flume.flume-ng-clients/flume-ng-log4jappender/1.5.0-SNAPSHOT/flume-ng-log4jappender-1.5.0-SNAPSHOT.jar
[JENKINS] Archiving <https://builds.apache.org/job/flume-trunk/ws/flume-ng-clients/flume-ng-log4jappender/target/flume-ng-log4jappender-1.5.0-SNAPSHOT-jar-with-dependencies.jar> to org.apache.flume.flume-ng-clients/flume-ng-log4jappender/1.5.0-SNAPSHOT/flume-ng-log4jappender-1.5.0-SNAPSHOT-jar-with-dependencies.jar
[JENKINS] Archiving <https://builds.apache.org/job/flume-trunk/ws/flume-ng-tests/pom.xml> to org.apache.flume/flume-ng-tests/1.5.0-SNAPSHOT/flume-ng-tests-1.5.0-SNAPSHOT.pom
[JENKINS] Archiving <https://builds.apache.org/job/flume-trunk/ws/flume-ng-tests/target/flume-ng-tests-1.5.0-SNAPSHOT.jar> to org.apache.flume/flume-ng-tests/1.5.0-SNAPSHOT/flume-ng-tests-1.5.0-SNAPSHOT.jar
[JENKINS] Archiving <https://builds.apache.org/job/flume-trunk/ws/flume-ng-sdk/pom.xml> to org.apache.flume/flume-ng-sdk/1.5.0-SNAPSHOT/flume-ng-sdk-1.5.0-SNAPSHOT.pom
[JENKINS] Archiving <https://builds.apache.org/job/flume-trunk/ws/flume-ng-sdk/target/flume-ng-sdk-1.5.0-SNAPSHOT.jar> to org.apache.flume/flume-ng-sdk/1.5.0-SNAPSHOT/flume-ng-sdk-1.5.0-SNAPSHOT.jar
[JENKINS] Archiving <https://builds.apache.org/job/flume-trunk/ws/flume-ng-sdk/target/flume-ng-sdk-1.5.0-SNAPSHOT-tests.jar> to org.apache.flume/flume-ng-sdk/1.5.0-SNAPSHOT/flume-ng-sdk-1.5.0-SNAPSHOT-tests.jar
[JENKINS] Archiving <https://builds.apache.org/job/flume-trunk/ws/flume-ng-embedded-agent/pom.xml> to org.apache.flume/flume-ng-embedded-agent/1.5.0-SNAPSHOT/flume-ng-embedded-agent-1.5.0-SNAPSHOT.pom
[JENKINS] Archiving <https://builds.apache.org/job/flume-trunk/ws/flume-ng-sinks/flume-ng-hbase-sink/pom.xml> to org.apache.flume.flume-ng-sinks/flume-ng-hbase-sink/1.5.0-SNAPSHOT/flume-ng-hbase-sink-1.5.0-SNAPSHOT.pom
[JENKINS] Archiving <https://builds.apache.org/job/flume-trunk/ws/flume-ng-sinks/flume-ng-hbase-sink/target/flume-ng-hbase-sink-1.5.0-SNAPSHOT.jar> to org.apache.flume.flume-ng-sinks/flume-ng-hbase-sink/1.5.0-SNAPSHOT/flume-ng-hbase-sink-1.5.0-SNAPSHOT.jar
[JENKINS] Archiving <https://builds.apache.org/job/flume-trunk/ws/flume-ng-sinks/flume-hdfs-sink/pom.xml> to org.apache.flume.flume-ng-sinks/flume-hdfs-sink/1.5.0-SNAPSHOT/flume-hdfs-sink-1.5.0-SNAPSHOT.pom
[JENKINS] Archiving <https://builds.apache.org/job/flume-trunk/ws/flume-ng-sinks/flume-hdfs-sink/target/flume-hdfs-sink-1.5.0-SNAPSHOT.jar> to org.apache.flume.flume-ng-sinks/flume-hdfs-sink/1.5.0-SNAPSHOT/flume-hdfs-sink-1.5.0-SNAPSHOT.jar
[JENKINS] Archiving <https://builds.apache.org/job/flume-trunk/ws/flume-ng-sources/pom.xml> to org.apache.flume/flume-ng-sources/1.5.0-SNAPSHOT/flume-ng-sources-1.5.0-SNAPSHOT.pom
channel stopped
[WARNINGS] Skipping publisher since build result is FAILURE
Updating FLUME-2255

Build failed in Jenkins: flume-trunk #522

Posted by Apache Jenkins Server <je...@builds.apache.org>.
See <https://builds.apache.org/job/flume-trunk/522/changes>

Changes:

[roshan] FLUME-2233. MemoryChannel lock contention on every put due to bytesRemaining Semaphore

[roshan] FLUME-2231. Add details in Flume Ganglia config in User Guide

[jarcec] FLUME-2235. idleFuture should be cancelled at the start of append

------------------------------------------
[...truncated 1956 lines...]
[INFO] Exclude: **/*.patch
[INFO] Exclude: **/*.avsc
[INFO] Exclude: **/*.avro
[INFO] Exclude: **/docs/**
[INFO] Exclude: **/test/resources/**
[INFO] Exclude: **/.settings/*
[INFO] Exclude: **/.classpath
[INFO] Exclude: **/.project
[INFO] Exclude: **/target/**
[INFO] ------------------------------------------------------------------------
[INFO] Reactor Summary:
[INFO] 
[INFO] Apache Flume ...................................... SUCCESS [35.266s]
[INFO] Flume NG SDK ...................................... SUCCESS [1:44.755s]
[INFO] Flume NG Configuration ............................ SUCCESS [17.476s]
[INFO] Flume NG Core ..................................... SUCCESS [5:03.989s]
[INFO] Flume NG Sinks .................................... SUCCESS [11.465s]
[INFO] Flume NG HDFS Sink ................................ SUCCESS [1:32.830s]
[INFO] Flume NG IRC Sink ................................. SUCCESS [15.053s]
[INFO] Flume NG Channels ................................. SUCCESS [14.713s]
[INFO] Flume NG JDBC channel ............................. SUCCESS [1:13.452s]
[INFO] Flume NG file-based channel ....................... SUCCESS [4:53.842s]
[INFO] Flume NG Node ..................................... SUCCESS [56.688s]
[INFO] Flume NG Embedded Agent ........................... SUCCESS [47.797s]
[INFO] Flume NG HBase Sink ............................... SUCCESS [2:27.938s]
[INFO] Flume NG ElasticSearch Sink ....................... SUCCESS [1:42.942s]
[INFO] Flume NG Morphline Solr Sink ...................... SUCCESS [1:43.627s]
[INFO] Flume Sources ..................................... SUCCESS [37.322s]
[INFO] Flume Scribe Source ............................... SUCCESS [14.883s]
[INFO] Flume JMS Source .................................. SUCCESS [1:01.949s]
[INFO] Flume Twitter Source .............................. SUCCESS [1:04.348s]
[INFO] Flume legacy Sources .............................. SUCCESS [21.063s]
[INFO] Flume legacy Avro source .......................... SUCCESS [17.119s]
[INFO] Flume legacy Thrift Source ........................ SUCCESS [34.090s]
[INFO] Flume NG Clients .................................. SUCCESS [8.590s]
[INFO] Flume NG Log4j Appender ........................... SUCCESS [1:07.644s]
[INFO] Flume NG Tools .................................... SUCCESS [11.878s]
[INFO] Flume NG distribution ............................. SUCCESS [35.481s]
[INFO] Flume NG Integration Tests ........................ SUCCESS [1:07.948s]
[INFO] ------------------------------------------------------------------------
[INFO] BUILD SUCCESS
[INFO] ------------------------------------------------------------------------
[INFO] Total time: 40:36.383s
[INFO] Finished at: Sat Nov 09 07:07:50 UTC 2013
[INFO] Final Memory: 150M/508M
[INFO] ------------------------------------------------------------------------
Waiting for Jenkins to finish collecting data
[JENKINS] Archiving <https://builds.apache.org/job/flume-trunk/ws/flume-ng-legacy-sources/flume-thrift-source/pom.xml> to org.apache.flume.flume-ng-legacy-sources/flume-thrift-source/1.5.0-SNAPSHOT/flume-thrift-source-1.5.0-SNAPSHOT.pom
[JENKINS] Archiving <https://builds.apache.org/job/flume-trunk/ws/flume-ng-legacy-sources/flume-thrift-source/target/flume-thrift-source-1.5.0-SNAPSHOT.jar> to org.apache.flume.flume-ng-legacy-sources/flume-thrift-source/1.5.0-SNAPSHOT/flume-thrift-source-1.5.0-SNAPSHOT.jar
[JENKINS] Archiving <https://builds.apache.org/job/flume-trunk/ws/flume-ng-dist/pom.xml> to org.apache.flume/flume-ng-dist/1.5.0-SNAPSHOT/flume-ng-dist-1.5.0-SNAPSHOT.pom
[JENKINS] Archiving <https://builds.apache.org/job/flume-trunk/ws/flume-ng-dist/target/apache-flume-1.5.0-SNAPSHOT-bin.tar.gz> to org.apache.flume/flume-ng-dist/1.5.0-SNAPSHOT/flume-ng-dist-1.5.0-SNAPSHOT-bin.tar.gz
[JENKINS] Archiving <https://builds.apache.org/job/flume-trunk/ws/flume-ng-dist/target/apache-flume-1.5.0-SNAPSHOT-src.tar.gz> to org.apache.flume/flume-ng-dist/1.5.0-SNAPSHOT/flume-ng-dist-1.5.0-SNAPSHOT-src.tar.gz
[JENKINS] Archiving <https://builds.apache.org/job/flume-trunk/ws/flume-ng-legacy-sources/pom.xml> to org.apache.flume/flume-ng-legacy-sources/1.5.0-SNAPSHOT/flume-ng-legacy-sources-1.5.0-SNAPSHOT.pom
[JENKINS] Archiving <https://builds.apache.org/job/flume-trunk/ws/flume-ng-sources/flume-twitter-source/pom.xml> to org.apache.flume.flume-ng-sources/flume-twitter-source/1.5.0-SNAPSHOT/flume-twitter-source-1.5.0-SNAPSHOT.pom
[JENKINS] Archiving <https://builds.apache.org/job/flume-trunk/ws/flume-ng-sources/flume-twitter-source/target/flume-twitter-source-1.5.0-SNAPSHOT.jar> to org.apache.flume.flume-ng-sources/flume-twitter-source/1.5.0-SNAPSHOT/flume-twitter-source-1.5.0-SNAPSHOT.jar
[JENKINS] Archiving <https://builds.apache.org/job/flume-trunk/ws/flume-ng-channels/flume-jdbc-channel/pom.xml> to org.apache.flume.flume-ng-channels/flume-jdbc-channel/1.5.0-SNAPSHOT/flume-jdbc-channel-1.5.0-SNAPSHOT.pom
[JENKINS] Archiving <https://builds.apache.org/job/flume-trunk/ws/flume-ng-channels/flume-jdbc-channel/target/flume-jdbc-channel-1.5.0-SNAPSHOT.jar> to org.apache.flume.flume-ng-channels/flume-jdbc-channel/1.5.0-SNAPSHOT/flume-jdbc-channel-1.5.0-SNAPSHOT.jar
[JENKINS] Archiving <https://builds.apache.org/job/flume-trunk/ws/flume-ng-clients/pom.xml> to org.apache.flume/flume-ng-clients/1.5.0-SNAPSHOT/flume-ng-clients-1.5.0-SNAPSHOT.pom
[JENKINS] Archiving <https://builds.apache.org/job/flume-trunk/ws/flume-ng-sinks/flume-ng-morphline-solr-sink/pom.xml> to org.apache.flume.flume-ng-sinks/flume-ng-morphline-solr-sink/1.5.0-SNAPSHOT/flume-ng-morphline-solr-sink-1.5.0-SNAPSHOT.pom
[JENKINS] Archiving <https://builds.apache.org/job/flume-trunk/ws/flume-ng-sinks/flume-ng-morphline-solr-sink/target/flume-ng-morphline-solr-sink-1.5.0-SNAPSHOT.jar> to org.apache.flume.flume-ng-sinks/flume-ng-morphline-solr-sink/1.5.0-SNAPSHOT/flume-ng-morphline-solr-sink-1.5.0-SNAPSHOT.jar
[JENKINS] Archiving <https://builds.apache.org/job/flume-trunk/ws/flume-ng-sinks/flume-ng-elasticsearch-sink/pom.xml> to org.apache.flume.flume-ng-sinks/flume-ng-elasticsearch-sink/1.5.0-SNAPSHOT/flume-ng-elasticsearch-sink-1.5.0-SNAPSHOT.pom
[JENKINS] Archiving <https://builds.apache.org/job/flume-trunk/ws/flume-ng-sinks/flume-ng-elasticsearch-sink/target/flume-ng-elasticsearch-sink-1.5.0-SNAPSHOT.jar> to org.apache.flume.flume-ng-sinks/flume-ng-elasticsearch-sink/1.5.0-SNAPSHOT/flume-ng-elasticsearch-sink-1.5.0-SNAPSHOT.jar
[JENKINS] Archiving <https://builds.apache.org/job/flume-trunk/ws/flume-ng-core/pom.xml> to org.apache.flume/flume-ng-core/1.5.0-SNAPSHOT/flume-ng-core-1.5.0-SNAPSHOT.pom
[JENKINS] Archiving <https://builds.apache.org/job/flume-trunk/ws/flume-ng-core/target/flume-ng-core-1.5.0-SNAPSHOT.jar> to org.apache.flume/flume-ng-core/1.5.0-SNAPSHOT/flume-ng-core-1.5.0-SNAPSHOT.jar
[JENKINS] Archiving <https://builds.apache.org/job/flume-trunk/ws/flume-ng-sources/flume-scribe-source/pom.xml> to org.apache.flume.flume-ng-sources/flume-scribe-source/1.5.0-SNAPSHOT/flume-scribe-source-1.5.0-SNAPSHOT.pom
[JENKINS] Archiving <https://builds.apache.org/job/flume-trunk/ws/flume-ng-sources/flume-scribe-source/target/flume-scribe-source-1.5.0-SNAPSHOT.jar> to org.apache.flume.flume-ng-sources/flume-scribe-source/1.5.0-SNAPSHOT/flume-scribe-source-1.5.0-SNAPSHOT.jar
[JENKINS] Archiving <https://builds.apache.org/job/flume-trunk/ws/flume-ng-channels/flume-file-channel/pom.xml> to org.apache.flume.flume-ng-channels/flume-file-channel/1.5.0-SNAPSHOT/flume-file-channel-1.5.0-SNAPSHOT.pom
[JENKINS] Archiving <https://builds.apache.org/job/flume-trunk/ws/flume-ng-channels/flume-file-channel/target/flume-file-channel-1.5.0-SNAPSHOT.jar> to org.apache.flume.flume-ng-channels/flume-file-channel/1.5.0-SNAPSHOT/flume-file-channel-1.5.0-SNAPSHOT.jar
[JENKINS] Archiving <https://builds.apache.org/job/flume-trunk/ws/flume-ng-configuration/pom.xml> to org.apache.flume/flume-ng-configuration/1.5.0-SNAPSHOT/flume-ng-configuration-1.5.0-SNAPSHOT.pom
[JENKINS] Archiving <https://builds.apache.org/job/flume-trunk/ws/flume-ng-configuration/target/flume-ng-configuration-1.5.0-SNAPSHOT.jar> to org.apache.flume/flume-ng-configuration/1.5.0-SNAPSHOT/flume-ng-configuration-1.5.0-SNAPSHOT.jar
[JENKINS] Archiving <https://builds.apache.org/job/flume-trunk/ws/flume-ng-legacy-sources/flume-avro-source/pom.xml> to org.apache.flume.flume-ng-legacy-sources/flume-avro-source/1.5.0-SNAPSHOT/flume-avro-source-1.5.0-SNAPSHOT.pom
[JENKINS] Archiving <https://builds.apache.org/job/flume-trunk/ws/flume-ng-legacy-sources/flume-avro-source/target/flume-avro-source-1.5.0-SNAPSHOT.jar> to org.apache.flume.flume-ng-legacy-sources/flume-avro-source/1.5.0-SNAPSHOT/flume-avro-source-1.5.0-SNAPSHOT.jar
[JENKINS] Archiving <https://builds.apache.org/job/flume-trunk/ws/flume-ng-sinks/flume-irc-sink/pom.xml> to org.apache.flume.flume-ng-sinks/flume-irc-sink/1.5.0-SNAPSHOT/flume-irc-sink-1.5.0-SNAPSHOT.pom
[JENKINS] Archiving <https://builds.apache.org/job/flume-trunk/ws/flume-ng-sinks/flume-irc-sink/target/flume-irc-sink-1.5.0-SNAPSHOT.jar> to org.apache.flume.flume-ng-sinks/flume-irc-sink/1.5.0-SNAPSHOT/flume-irc-sink-1.5.0-SNAPSHOT.jar
[JENKINS] Archiving <https://builds.apache.org/job/flume-trunk/ws/flume-tools/pom.xml> to org.apache.flume/flume-tools/1.5.0-SNAPSHOT/flume-tools-1.5.0-SNAPSHOT.pom
[JENKINS] Archiving <https://builds.apache.org/job/flume-trunk/ws/flume-tools/target/flume-tools-1.5.0-SNAPSHOT.jar> to org.apache.flume/flume-tools/1.5.0-SNAPSHOT/flume-tools-1.5.0-SNAPSHOT.jar
[JENKINS] Archiving <https://builds.apache.org/job/flume-trunk/ws/pom.xml> to org.apache.flume/flume-parent/1.5.0-SNAPSHOT/flume-parent-1.5.0-SNAPSHOT.pom
[JENKINS] Archiving <https://builds.apache.org/job/flume-trunk/ws/flume-ng-node/pom.xml> to org.apache.flume/flume-ng-node/1.5.0-SNAPSHOT/flume-ng-node-1.5.0-SNAPSHOT.pom
[JENKINS] Archiving <https://builds.apache.org/job/flume-trunk/ws/flume-ng-node/target/flume-ng-node-1.5.0-SNAPSHOT.jar> to org.apache.flume/flume-ng-node/1.5.0-SNAPSHOT/flume-ng-node-1.5.0-SNAPSHOT.jar
[JENKINS] Archiving <https://builds.apache.org/job/flume-trunk/ws/flume-ng-sinks/pom.xml> to org.apache.flume/flume-ng-sinks/1.5.0-SNAPSHOT/flume-ng-sinks-1.5.0-SNAPSHOT.pom
[JENKINS] Archiving <https://builds.apache.org/job/flume-trunk/ws/flume-ng-channels/pom.xml> to org.apache.flume/flume-ng-channels/1.5.0-SNAPSHOT/flume-ng-channels-1.5.0-SNAPSHOT.pom
[JENKINS] Archiving <https://builds.apache.org/job/flume-trunk/ws/flume-ng-sources/flume-jms-source/pom.xml> to org.apache.flume.flume-ng-sources/flume-jms-source/1.5.0-SNAPSHOT/flume-jms-source-1.5.0-SNAPSHOT.pom
[JENKINS] Archiving <https://builds.apache.org/job/flume-trunk/ws/flume-ng-sources/flume-jms-source/target/flume-jms-source-1.5.0-SNAPSHOT.jar> to org.apache.flume.flume-ng-sources/flume-jms-source/1.5.0-SNAPSHOT/flume-jms-source-1.5.0-SNAPSHOT.jar
[JENKINS] Archiving <https://builds.apache.org/job/flume-trunk/ws/flume-ng-clients/flume-ng-log4jappender/pom.xml> to org.apache.flume.flume-ng-clients/flume-ng-log4jappender/1.5.0-SNAPSHOT/flume-ng-log4jappender-1.5.0-SNAPSHOT.pom
[JENKINS] Archiving <https://builds.apache.org/job/flume-trunk/ws/flume-ng-clients/flume-ng-log4jappender/target/flume-ng-log4jappender-1.5.0-SNAPSHOT.jar> to org.apache.flume.flume-ng-clients/flume-ng-log4jappender/1.5.0-SNAPSHOT/flume-ng-log4jappender-1.5.0-SNAPSHOT.jar
[JENKINS] Archiving <https://builds.apache.org/job/flume-trunk/ws/flume-ng-clients/flume-ng-log4jappender/target/flume-ng-log4jappender-1.5.0-SNAPSHOT-jar-with-dependencies.jar> to org.apache.flume.flume-ng-clients/flume-ng-log4jappender/1.5.0-SNAPSHOT/flume-ng-log4jappender-1.5.0-SNAPSHOT-jar-with-dependencies.jar
[JENKINS] Archiving <https://builds.apache.org/job/flume-trunk/ws/flume-ng-tests/pom.xml> to org.apache.flume/flume-ng-tests/1.5.0-SNAPSHOT/flume-ng-tests-1.5.0-SNAPSHOT.pom
[JENKINS] Archiving <https://builds.apache.org/job/flume-trunk/ws/flume-ng-tests/target/flume-ng-tests-1.5.0-SNAPSHOT.jar> to org.apache.flume/flume-ng-tests/1.5.0-SNAPSHOT/flume-ng-tests-1.5.0-SNAPSHOT.jar
[JENKINS] Archiving <https://builds.apache.org/job/flume-trunk/ws/flume-ng-sdk/pom.xml> to org.apache.flume/flume-ng-sdk/1.5.0-SNAPSHOT/flume-ng-sdk-1.5.0-SNAPSHOT.pom
[JENKINS] Archiving <https://builds.apache.org/job/flume-trunk/ws/flume-ng-sdk/target/flume-ng-sdk-1.5.0-SNAPSHOT.jar> to org.apache.flume/flume-ng-sdk/1.5.0-SNAPSHOT/flume-ng-sdk-1.5.0-SNAPSHOT.jar
[JENKINS] Archiving <https://builds.apache.org/job/flume-trunk/ws/flume-ng-sdk/target/flume-ng-sdk-1.5.0-SNAPSHOT-tests.jar> to org.apache.flume/flume-ng-sdk/1.5.0-SNAPSHOT/flume-ng-sdk-1.5.0-SNAPSHOT-tests.jar
[JENKINS] Archiving <https://builds.apache.org/job/flume-trunk/ws/flume-ng-embedded-agent/pom.xml> to org.apache.flume/flume-ng-embedded-agent/1.5.0-SNAPSHOT/flume-ng-embedded-agent-1.5.0-SNAPSHOT.pom
[JENKINS] Archiving <https://builds.apache.org/job/flume-trunk/ws/flume-ng-embedded-agent/target/flume-ng-embedded-agent-1.5.0-SNAPSHOT.jar> to org.apache.flume/flume-ng-embedded-agent/1.5.0-SNAPSHOT/flume-ng-embedded-agent-1.5.0-SNAPSHOT.jar
[JENKINS] Archiving <https://builds.apache.org/job/flume-trunk/ws/flume-ng-sinks/flume-ng-hbase-sink/pom.xml> to org.apache.flume.flume-ng-sinks/flume-ng-hbase-sink/1.5.0-SNAPSHOT/flume-ng-hbase-sink-1.5.0-SNAPSHOT.pom
[JENKINS] Archiving <https://builds.apache.org/job/flume-trunk/ws/flume-ng-sinks/flume-ng-hbase-sink/target/flume-ng-hbase-sink-1.5.0-SNAPSHOT.jar> to org.apache.flume.flume-ng-sinks/flume-ng-hbase-sink/1.5.0-SNAPSHOT/flume-ng-hbase-sink-1.5.0-SNAPSHOT.jar
[JENKINS] Archiving <https://builds.apache.org/job/flume-trunk/ws/flume-ng-sinks/flume-hdfs-sink/pom.xml> to org.apache.flume.flume-ng-sinks/flume-hdfs-sink/1.5.0-SNAPSHOT/flume-hdfs-sink-1.5.0-SNAPSHOT.pom
[JENKINS] Archiving <https://builds.apache.org/job/flume-trunk/ws/flume-ng-sinks/flume-hdfs-sink/target/flume-hdfs-sink-1.5.0-SNAPSHOT.jar> to org.apache.flume.flume-ng-sinks/flume-hdfs-sink/1.5.0-SNAPSHOT/flume-hdfs-sink-1.5.0-SNAPSHOT.jar
[JENKINS] Archiving <https://builds.apache.org/job/flume-trunk/ws/flume-ng-sources/pom.xml> to org.apache.flume/flume-ng-sources/1.5.0-SNAPSHOT/flume-ng-sources-1.5.0-SNAPSHOT.pom
channel stopped
[WARNINGS] Parsing warnings in console log with parser Maven
Maven RedeployPublisher use remote ubuntu3 maven settings from : /home/jenkins/.m2/settings.xml
[INFO] Deployment in https://repository.apache.org/content/repositories/snapshots (id=apache.snapshots.https,uniqueVersion=true)
Deploying the main artifact jenkins-9157293441067469705flume-ng-channels-1.5.0-SNAPSHOT.pom
Downloading: https://repository.apache.org/content/repositories/snapshots/org/apache/flume/flume-ng-channels/1.5.0-SNAPSHOT/maven-metadata.xml
Downloaded: https://repository.apache.org/content/repositories/snapshots/org/apache/flume/flume-ng-channels/1.5.0-SNAPSHOT/maven-metadata.xml (612 B at 0.1 KB/sec)
Uploading: https://repository.apache.org/content/repositories/snapshots/org/apache/flume/flume-ng-channels/1.5.0-SNAPSHOT/flume-ng-channels-1.5.0-20131109.070817-32.pom
Uploaded: https://repository.apache.org/content/repositories/snapshots/org/apache/flume/flume-ng-channels/1.5.0-SNAPSHOT/flume-ng-channels-1.5.0-20131109.070817-32.pom (2 KB at 0.2 KB/sec)
Downloading: https://repository.apache.org/content/repositories/snapshots/org/apache/flume/flume-ng-channels/maven-metadata.xml
Downloaded: https://repository.apache.org/content/repositories/snapshots/org/apache/flume/flume-ng-channels/maven-metadata.xml (353 B at 0.0 KB/sec)
Uploading: https://repository.apache.org/content/repositories/snapshots/org/apache/flume/flume-ng-channels/1.5.0-SNAPSHOT/maven-metadata.xml
Uploaded: https://repository.apache.org/content/repositories/snapshots/org/apache/flume/flume-ng-channels/1.5.0-SNAPSHOT/maven-metadata.xml (612 B at 0.8 KB/sec)
Uploading: https://repository.apache.org/content/repositories/snapshots/org/apache/flume/flume-ng-channels/maven-metadata.xml
Uploaded: https://repository.apache.org/content/repositories/snapshots/org/apache/flume/flume-ng-channels/maven-metadata.xml (353 B at 0.6 KB/sec)
[INFO] Deployment in https://repository.apache.org/content/repositories/snapshots (id=apache.snapshots.https,uniqueVersion=true)
Deploying the main artifact jenkins-8499321977646860471flume-ng-clients-1.5.0-SNAPSHOT.pom
Downloading: https://repository.apache.org/content/repositories/snapshots/org/apache/flume/flume-ng-clients/1.5.0-SNAPSHOT/maven-metadata.xml
Downloaded: https://repository.apache.org/content/repositories/snapshots/org/apache/flume/flume-ng-clients/1.5.0-SNAPSHOT/maven-metadata.xml (611 B at 0.5 KB/sec)
Uploading: https://repository.apache.org/content/repositories/snapshots/org/apache/flume/flume-ng-clients/1.5.0-SNAPSHOT/flume-ng-clients-1.5.0-20131109.070909-32.pom
Uploaded: https://repository.apache.org/content/repositories/snapshots/org/apache/flume/flume-ng-clients/1.5.0-SNAPSHOT/flume-ng-clients-1.5.0-20131109.070909-32.pom (2 KB at 21.8 KB/sec)
Downloading: https://repository.apache.org/content/repositories/snapshots/org/apache/flume/flume-ng-clients/maven-metadata.xml
Downloaded: https://repository.apache.org/content/repositories/snapshots/org/apache/flume/flume-ng-clients/maven-metadata.xml (352 B at 0.2 KB/sec)
Uploading: https://repository.apache.org/content/repositories/snapshots/org/apache/flume/flume-ng-clients/1.5.0-SNAPSHOT/maven-metadata.xml
Uploaded: https://repository.apache.org/content/repositories/snapshots/org/apache/flume/flume-ng-clients/1.5.0-SNAPSHOT/maven-metadata.xml (611 B at 1.4 KB/sec)
Uploading: https://repository.apache.org/content/repositories/snapshots/org/apache/flume/flume-ng-clients/maven-metadata.xml
Uploaded: https://repository.apache.org/content/repositories/snapshots/org/apache/flume/flume-ng-clients/maven-metadata.xml (352 B at 1.0 KB/sec)
[INFO] Deployment in https://repository.apache.org/content/repositories/snapshots (id=apache.snapshots.https,uniqueVersion=true)
Deploying the main artifact jenkins-6301482348525926298flume-ng-configuration-1.5.0-SNAPSHOT.jar
Downloading: https://repository.apache.org/content/repositories/snapshots/org/apache/flume/flume-ng-configuration/1.5.0-SNAPSHOT/maven-metadata.xml
Downloaded: https://repository.apache.org/content/repositories/snapshots/org/apache/flume/flume-ng-configuration/1.5.0-SNAPSHOT/maven-metadata.xml (791 B at 0.1 KB/sec)
Uploading: https://repository.apache.org/content/repositories/snapshots/org/apache/flume/flume-ng-configuration/1.5.0-SNAPSHOT/flume-ng-configuration-1.5.0-20131109.070955-32.jar
Uploaded: https://repository.apache.org/content/repositories/snapshots/org/apache/flume/flume-ng-configuration/1.5.0-SNAPSHOT/flume-ng-configuration-1.5.0-20131109.070955-32.jar (55 KB at 136.3 KB/sec)
Uploading: https://repository.apache.org/content/repositories/snapshots/org/apache/flume/flume-ng-configuration/1.5.0-SNAPSHOT/flume-ng-configuration-1.5.0-20131109.070955-32.pom
Uploaded: https://repository.apache.org/content/repositories/snapshots/org/apache/flume/flume-ng-configuration/1.5.0-SNAPSHOT/flume-ng-configuration-1.5.0-20131109.070955-32.pom (3 KB at 1.2 KB/sec)
Downloading: https://repository.apache.org/content/repositories/snapshots/org/apache/flume/flume-ng-configuration/maven-metadata.xml
Downloaded: https://repository.apache.org/content/repositories/snapshots/org/apache/flume/flume-ng-configuration/maven-metadata.xml (358 B at 0.1 KB/sec)
Uploading: https://repository.apache.org/content/repositories/snapshots/org/apache/flume/flume-ng-configuration/1.5.0-SNAPSHOT/maven-metadata.xml
Uploaded: https://repository.apache.org/content/repositories/snapshots/org/apache/flume/flume-ng-configuration/1.5.0-SNAPSHOT/maven-metadata.xml (791 B at 0.0 KB/sec)
Uploading: https://repository.apache.org/content/repositories/snapshots/org/apache/flume/flume-ng-configuration/maven-metadata.xml
Uploaded: https://repository.apache.org/content/repositories/snapshots/org/apache/flume/flume-ng-configuration/maven-metadata.xml (358 B at 2.2 KB/sec)
[INFO] Deployment in https://repository.apache.org/content/repositories/snapshots (id=apache.snapshots.https,uniqueVersion=true)
Deploying the main artifact jenkins-4150121412147620247flume-ng-core-1.5.0-SNAPSHOT.jar
Downloading: https://repository.apache.org/content/repositories/snapshots/org/apache/flume/flume-ng-core/1.5.0-SNAPSHOT/maven-metadata.xml
Downloaded: https://repository.apache.org/content/repositories/snapshots/org/apache/flume/flume-ng-core/1.5.0-SNAPSHOT/maven-metadata.xml (782 B at 0.0 KB/sec)
Uploading: https://repository.apache.org/content/repositories/snapshots/org/apache/flume/flume-ng-core/1.5.0-SNAPSHOT/flume-ng-core-1.5.0-20131109.071134-32.jar
Uploaded: https://repository.apache.org/content/repositories/snapshots/org/apache/flume/flume-ng-core/1.5.0-SNAPSHOT/flume-ng-core-1.5.0-20131109.071134-32.jar (339 KB at 51.9 KB/sec)
Uploading: https://repository.apache.org/content/repositories/snapshots/org/apache/flume/flume-ng-core/1.5.0-SNAPSHOT/flume-ng-core-1.5.0-20131109.071134-32.pom
Uploaded: https://repository.apache.org/content/repositories/snapshots/org/apache/flume/flume-ng-core/1.5.0-SNAPSHOT/flume-ng-core-1.5.0-20131109.071134-32.pom (11 KB at 124.1 KB/sec)
Downloading: https://repository.apache.org/content/repositories/snapshots/org/apache/flume/flume-ng-core/maven-metadata.xml
Downloaded: https://repository.apache.org/content/repositories/snapshots/org/apache/flume/flume-ng-core/maven-metadata.xml (349 B at 0.3 KB/sec)
Uploading: https://repository.apache.org/content/repositories/snapshots/org/apache/flume/flume-ng-core/1.5.0-SNAPSHOT/maven-metadata.xml
Uploaded: https://repository.apache.org/content/repositories/snapshots/org/apache/flume/flume-ng-core/1.5.0-SNAPSHOT/maven-metadata.xml (782 B at 0.2 KB/sec)
Uploading: https://repository.apache.org/content/repositories/snapshots/org/apache/flume/flume-ng-core/maven-metadata.xml
Uploaded: https://repository.apache.org/content/repositories/snapshots/org/apache/flume/flume-ng-core/maven-metadata.xml (349 B at 0.1 KB/sec)
[INFO] Deployment in https://repository.apache.org/content/repositories/snapshots (id=apache.snapshots.https,uniqueVersion=true)
Deploying the main artifact jenkins-8108843422307627059flume-ng-dist-1.5.0-SNAPSHOT.pom
Downloading: https://repository.apache.org/content/repositories/snapshots/org/apache/flume/flume-ng-dist/1.5.0-SNAPSHOT/maven-metadata.xml
Downloaded: https://repository.apache.org/content/repositories/snapshots/org/apache/flume/flume-ng-dist/1.5.0-SNAPSHOT/maven-metadata.xml (2 KB at 0.1 KB/sec)
Uploading: https://repository.apache.org/content/repositories/snapshots/org/apache/flume/flume-ng-dist/1.5.0-SNAPSHOT/flume-ng-dist-1.5.0-20131109.071249-32.pom
Uploaded: https://repository.apache.org/content/repositories/snapshots/org/apache/flume/flume-ng-dist/1.5.0-SNAPSHOT/flume-ng-dist-1.5.0-20131109.071249-32.pom (5 KB at 1.7 KB/sec)
Downloading: https://repository.apache.org/content/repositories/snapshots/org/apache/flume/flume-ng-dist/maven-metadata.xml
Downloaded: https://repository.apache.org/content/repositories/snapshots/org/apache/flume/flume-ng-dist/maven-metadata.xml (349 B at 0.0 KB/sec)
Uploading: https://repository.apache.org/content/repositories/snapshots/org/apache/flume/flume-ng-dist/1.5.0-SNAPSHOT/maven-metadata.xml
Uploaded: https://repository.apache.org/content/repositories/snapshots/org/apache/flume/flume-ng-dist/1.5.0-SNAPSHOT/maven-metadata.xml (2 KB at 0.1 KB/sec)
Uploading: https://repository.apache.org/content/repositories/snapshots/org/apache/flume/flume-ng-dist/maven-metadata.xml
Uploaded: https://repository.apache.org/content/repositories/snapshots/org/apache/flume/flume-ng-dist/maven-metadata.xml (349 B at 1.0 KB/sec)
Deploying the main artifact jenkins-3584226320238321079flume-ng-dist-1.5.0-SNAPSHOT-bin.tar.gz
Uploading: https://repository.apache.org/content/repositories/snapshots/org/apache/flume/flume-ng-dist/1.5.0-SNAPSHOT/flume-ng-dist-1.5.0-20131109.071249-32-bin.tar.gz
Uploaded: https://repository.apache.org/content/repositories/snapshots/org/apache/flume/flume-ng-dist/1.5.0-SNAPSHOT/flume-ng-dist-1.5.0-20131109.071249-32-bin.tar.gz (21964 KB at 13642.1 KB/sec)
Uploading: https://repository.apache.org/content/repositories/snapshots/org/apache/flume/flume-ng-dist/1.5.0-SNAPSHOT/maven-metadata.xml
Uploaded: https://repository.apache.org/content/repositories/snapshots/org/apache/flume/flume-ng-dist/1.5.0-SNAPSHOT/maven-metadata.xml (2 KB at 0.3 KB/sec)
Deploying the main artifact jenkins-2078634308752273009flume-ng-dist-1.5.0-SNAPSHOT-src.tar.gz
Uploading: https://repository.apache.org/content/repositories/snapshots/org/apache/flume/flume-ng-dist/1.5.0-SNAPSHOT/flume-ng-dist-1.5.0-20131109.071249-32-src.tar.gz
Uploaded: https://repository.apache.org/content/repositories/snapshots/org/apache/flume/flume-ng-dist/1.5.0-SNAPSHOT/flume-ng-dist-1.5.0-20131109.071249-32-src.tar.gz (2452 KB at 6008.1 KB/sec)
Uploading: https://repository.apache.org/content/repositories/snapshots/org/apache/flume/flume-ng-dist/1.5.0-SNAPSHOT/maven-metadata.xml
Uploaded: https://repository.apache.org/content/repositories/snapshots/org/apache/flume/flume-ng-dist/1.5.0-SNAPSHOT/maven-metadata.xml (2 KB at 13.9 KB/sec)
[INFO] Deployment in https://repository.apache.org/content/repositories/snapshots (id=apache.snapshots.https,uniqueVersion=true)
Deploying the main artifact jenkins-1453051736850823907flume-ng-embedded-agent-1.5.0-SNAPSHOT.jar
Downloading: https://repository.apache.org/content/repositories/snapshots/org/apache/flume/flume-ng-embedded-agent/1.5.0-SNAPSHOT/maven-metadata.xml
Downloaded: https://repository.apache.org/content/repositories/snapshots/org/apache/flume/flume-ng-embedded-agent/1.5.0-SNAPSHOT/maven-metadata.xml (792 B at 0.0 KB/sec)
Uploading: https://repository.apache.org/content/repositories/snapshots/org/apache/flume/flume-ng-embedded-agent/1.5.0-SNAPSHOT/flume-ng-embedded-agent-1.5.0-20131109.071706-32.jar
Uploaded: https://repository.apache.org/content/repositories/snapshots/org/apache/flume/flume-ng-embedded-agent/1.5.0-SNAPSHOT/flume-ng-embedded-agent-1.5.0-20131109.071706-32.jar (20 KB at 19.5 KB/sec)
Uploading: https://repository.apache.org/content/repositories/snapshots/org/apache/flume/flume-ng-embedded-agent/1.5.0-SNAPSHOT/flume-ng-embedded-agent-1.5.0-20131109.071706-32.pom
Uploaded: https://repository.apache.org/content/repositories/snapshots/org/apache/flume/flume-ng-embedded-agent/1.5.0-SNAPSHOT/flume-ng-embedded-agent-1.5.0-20131109.071706-32.pom (3 KB at 20.4 KB/sec)
Downloading: https://repository.apache.org/content/repositories/snapshots/org/apache/flume/flume-ng-embedded-agent/maven-metadata.xml
Downloaded: https://repository.apache.org/content/repositories/snapshots/org/apache/flume/flume-ng-embedded-agent/maven-metadata.xml (359 B at 0.1 KB/sec)
Uploading: https://repository.apache.org/content/repositories/snapshots/org/apache/flume/flume-ng-embedded-agent/1.5.0-SNAPSHOT/maven-metadata.xml
Uploaded: https://repository.apache.org/content/repositories/snapshots/org/apache/flume/flume-ng-embedded-agent/1.5.0-SNAPSHOT/maven-metadata.xml (792 B at 0.8 KB/sec)
Uploading: https://repository.apache.org/content/repositories/snapshots/org/apache/flume/flume-ng-embedded-agent/maven-metadata.xml
Uploaded: https://repository.apache.org/content/repositories/snapshots/org/apache/flume/flume-ng-embedded-agent/maven-metadata.xml (359 B at 0.2 KB/sec)
[INFO] Deployment in https://repository.apache.org/content/repositories/snapshots (id=apache.snapshots.https,uniqueVersion=true)
Deploying the main artifact jenkins-8279333819777263086flume-ng-legacy-sources-1.5.0-SNAPSHOT.pom
Downloading: https://repository.apache.org/content/repositories/snapshots/org/apache/flume/flume-ng-legacy-sources/1.5.0-SNAPSHOT/maven-metadata.xml
Downloaded: https://repository.apache.org/content/repositories/snapshots/org/apache/flume/flume-ng-legacy-sources/1.5.0-SNAPSHOT/maven-metadata.xml (618 B at 0.0 KB/sec)
Uploading: https://repository.apache.org/content/repositories/snapshots/org/apache/flume/flume-ng-legacy-sources/1.5.0-SNAPSHOT/flume-ng-legacy-sources-1.5.0-20131109.071819-32.pom
ERROR: Failed to deploy artifacts: Could not transfer artifact org.apache.flume:flume-ng-legacy-sources:pom:1.5.0-20131109.071819-32 from/to apache.snapshots.https (https://repository.apache.org/content/repositories/snapshots): The target server failed to respond
org.apache.maven.artifact.deployer.ArtifactDeploymentException: Failed to deploy artifacts: Could not transfer artifact org.apache.flume:flume-ng-legacy-sources:pom:1.5.0-20131109.071819-32 from/to apache.snapshots.https (https://repository.apache.org/content/repositories/snapshots): The target server failed to respond
	at org.apache.maven.artifact.deployer.DefaultArtifactDeployer.deploy(DefaultArtifactDeployer.java:143)
	at hudson.maven.reporters.MavenArtifactRecord.deploy(MavenArtifactRecord.java:191)
	at hudson.maven.RedeployPublisher.perform(RedeployPublisher.java:176)
	at hudson.tasks.BuildStepMonitor$1.perform(BuildStepMonitor.java:20)
	at hudson.model.AbstractBuild$AbstractBuildExecution.perform(AbstractBuild.java:781)
	at hudson.model.AbstractBuild$AbstractBuildExecution.performAllBuildSteps(AbstractBuild.java:753)
	at hudson.maven.MavenModuleSetBuild$MavenModuleSetBuildExecution.post2(MavenModuleSetBuild.java:1020)
	at hudson.model.AbstractBuild$AbstractBuildExecution.post(AbstractBuild.java:706)
	at hudson.model.Run.execute(Run.java:1690)
	at hudson.maven.MavenModuleSetBuild.run(MavenModuleSetBuild.java:509)
	at hudson.model.ResourceController.execute(ResourceController.java:88)
	at hudson.model.Executor.run(Executor.java:230)
Caused by: org.eclipse.aether.deployment.DeploymentException: Failed to deploy artifacts: Could not transfer artifact org.apache.flume:flume-ng-legacy-sources:pom:1.5.0-20131109.071819-32 from/to apache.snapshots.https (https://repository.apache.org/content/repositories/snapshots): The target server failed to respond
	at org.eclipse.aether.internal.impl.DefaultDeployer.deploy(DefaultDeployer.java:341)
	at org.eclipse.aether.internal.impl.DefaultDeployer.deploy(DefaultDeployer.java:269)
	at org.eclipse.aether.internal.impl.DefaultRepositorySystem.deploy(DefaultRepositorySystem.java:413)
	at org.apache.maven.artifact.deployer.DefaultArtifactDeployer.deploy(DefaultArtifactDeployer.java:139)
	... 11 more
Caused by: org.eclipse.aether.transfer.ArtifactTransferException: Could not transfer artifact org.apache.flume:flume-ng-legacy-sources:pom:1.5.0-20131109.071819-32 from/to apache.snapshots.https (https://repository.apache.org/content/repositories/snapshots): The target server failed to respond
	at org.eclipse.aether.connector.wagon.WagonRepositoryConnector$6.wrap(WagonRepositoryConnector.java:1016)
	at org.eclipse.aether.connector.wagon.WagonRepositoryConnector$6.wrap(WagonRepositoryConnector.java:1004)
	at org.eclipse.aether.connector.wagon.WagonRepositoryConnector$PutTask.run(WagonRepositoryConnector.java:895)
	at org.eclipse.aether.connector.wagon.WagonRepositoryConnector.put(WagonRepositoryConnector.java:522)
	at org.eclipse.aether.internal.impl.DefaultDeployer.deploy(DefaultDeployer.java:335)
	... 14 more
Caused by: org.apache.maven.wagon.TransferFailedException: The target server failed to respond
	at org.apache.maven.wagon.shared.http4.AbstractHttpClientWagon.put(AbstractHttpClientWagon.java:580)
	at org.apache.maven.wagon.shared.http4.AbstractHttpClientWagon.put(AbstractHttpClientWagon.java:524)
	at org.apache.maven.wagon.shared.http4.AbstractHttpClientWagon.put(AbstractHttpClientWagon.java:505)
	at org.apache.maven.wagon.shared.http4.AbstractHttpClientWagon.put(AbstractHttpClientWagon.java:485)
	at org.eclipse.aether.connector.wagon.WagonRepositoryConnector$PutTask.run(WagonRepositoryConnector.java:871)
	... 16 more
Caused by: org.apache.http.NoHttpResponseException: The target server failed to respond
	at org.apache.http.impl.conn.DefaultHttpResponseParser.parseHead(DefaultHttpResponseParser.java:95)
	at org.apache.http.impl.conn.DefaultHttpResponseParser.parseHead(DefaultHttpResponseParser.java:62)
	at org.apache.http.impl.io.AbstractMessageParser.parse(AbstractMessageParser.java:254)
	at org.apache.http.impl.AbstractHttpClientConnection.receiveResponseHeader(AbstractHttpClientConnection.java:289)
	at org.apache.http.impl.conn.DefaultClientConnection.receiveResponseHeader(DefaultClientConnection.java:252)
	at org.apache.http.impl.conn.ManagedClientConnectionImpl.receiveResponseHeader(ManagedClientConnectionImpl.java:191)
	at org.apache.http.protocol.HttpRequestExecutor.doReceiveResponse(HttpRequestExecutor.java:300)
	at org.apache.http.protocol.HttpRequestExecutor.execute(HttpRequestExecutor.java:127)
	at org.apache.http.impl.client.DefaultRequestDirector.tryExecute(DefaultRequestDirector.java:715)
	at org.apache.http.impl.client.DefaultRequestDirector.execute(DefaultRequestDirector.java:520)
	at org.apache.http.impl.client.AbstractHttpClient.execute(AbstractHttpClient.java:906)
	at org.apache.http.impl.client.AbstractHttpClient.execute(AbstractHttpClient.java:805)
	at org.apache.maven.wagon.shared.http4.AbstractHttpClientWagon.execute(AbstractHttpClientWagon.java:746)
	at org.apache.maven.wagon.shared.http4.AbstractHttpClientWagon.put(AbstractHttpClientWagon.java:574)
	... 20 more
[INFO] Deployment failed after 10 min
Build step 'Deploy artifacts to Maven repository' changed build result to FAILURE
Updating FLUME-2233
Updating FLUME-2231
Updating FLUME-2235

Build failed in Jenkins: flume-trunk #521

Posted by Apache Jenkins Server <je...@builds.apache.org>.
See <https://builds.apache.org/job/flume-trunk/521/changes>

Changes:

[roshan] FLUME-2065. Regex Extractor Interceptor config agent name inconsistent with rest of docs

------------------------------------------
[...truncated 4478 lines...]
Uploading: https://repository.apache.org/content/repositories/snapshots/org/apache/flume/flume-ng-configuration/1.5.0-SNAPSHOT/flume-ng-configuration-1.5.0-20131107.171304-31.jar
Uploaded: https://repository.apache.org/content/repositories/snapshots/org/apache/flume/flume-ng-configuration/1.5.0-SNAPSHOT/flume-ng-configuration-1.5.0-20131107.171304-31.jar (55 KB at 362.0 KB/sec)
Uploading: https://repository.apache.org/content/repositories/snapshots/org/apache/flume/flume-ng-configuration/1.5.0-SNAPSHOT/flume-ng-configuration-1.5.0-20131107.171304-31.pom
Uploaded: https://repository.apache.org/content/repositories/snapshots/org/apache/flume/flume-ng-configuration/1.5.0-SNAPSHOT/flume-ng-configuration-1.5.0-20131107.171304-31.pom (3 KB at 32.9 KB/sec)
Downloading: https://repository.apache.org/content/repositories/snapshots/org/apache/flume/flume-ng-configuration/maven-metadata.xml
Downloaded: https://repository.apache.org/content/repositories/snapshots/org/apache/flume/flume-ng-configuration/maven-metadata.xml (358 B at 0.5 KB/sec)
Uploading: https://repository.apache.org/content/repositories/snapshots/org/apache/flume/flume-ng-configuration/1.5.0-SNAPSHOT/maven-metadata.xml
Uploaded: https://repository.apache.org/content/repositories/snapshots/org/apache/flume/flume-ng-configuration/1.5.0-SNAPSHOT/maven-metadata.xml (791 B at 6.4 KB/sec)
Uploading: https://repository.apache.org/content/repositories/snapshots/org/apache/flume/flume-ng-configuration/maven-metadata.xml
Uploaded: https://repository.apache.org/content/repositories/snapshots/org/apache/flume/flume-ng-configuration/maven-metadata.xml (358 B at 3.8 KB/sec)
[INFO] Deployment in https://repository.apache.org/content/repositories/snapshots (id=apache.snapshots.https,uniqueVersion=true)
Deploying the main artifact jenkins-3444412436568926471flume-ng-core-1.5.0-SNAPSHOT.jar
Downloading: https://repository.apache.org/content/repositories/snapshots/org/apache/flume/flume-ng-core/1.5.0-SNAPSHOT/maven-metadata.xml
Downloaded: https://repository.apache.org/content/repositories/snapshots/org/apache/flume/flume-ng-core/1.5.0-SNAPSHOT/maven-metadata.xml (782 B at 1.3 KB/sec)
Uploading: https://repository.apache.org/content/repositories/snapshots/org/apache/flume/flume-ng-core/1.5.0-SNAPSHOT/flume-ng-core-1.5.0-20131107.171307-31.jar
Uploaded: https://repository.apache.org/content/repositories/snapshots/org/apache/flume/flume-ng-core/1.5.0-SNAPSHOT/flume-ng-core-1.5.0-20131107.171307-31.jar (339 KB at 1223.0 KB/sec)
Uploading: https://repository.apache.org/content/repositories/snapshots/org/apache/flume/flume-ng-core/1.5.0-SNAPSHOT/flume-ng-core-1.5.0-20131107.171307-31.pom
Uploaded: https://repository.apache.org/content/repositories/snapshots/org/apache/flume/flume-ng-core/1.5.0-SNAPSHOT/flume-ng-core-1.5.0-20131107.171307-31.pom (11 KB at 141.8 KB/sec)
Downloading: https://repository.apache.org/content/repositories/snapshots/org/apache/flume/flume-ng-core/maven-metadata.xml
Downloaded: https://repository.apache.org/content/repositories/snapshots/org/apache/flume/flume-ng-core/maven-metadata.xml (349 B at 3.9 KB/sec)
Uploading: https://repository.apache.org/content/repositories/snapshots/org/apache/flume/flume-ng-core/1.5.0-SNAPSHOT/maven-metadata.xml
Uploaded: https://repository.apache.org/content/repositories/snapshots/org/apache/flume/flume-ng-core/1.5.0-SNAPSHOT/maven-metadata.xml (782 B at 0.9 KB/sec)
Uploading: https://repository.apache.org/content/repositories/snapshots/org/apache/flume/flume-ng-core/maven-metadata.xml
Uploaded: https://repository.apache.org/content/repositories/snapshots/org/apache/flume/flume-ng-core/maven-metadata.xml (349 B at 2.3 KB/sec)
[INFO] Deployment in https://repository.apache.org/content/repositories/snapshots (id=apache.snapshots.https,uniqueVersion=true)
Deploying the main artifact jenkins-8157043080939120885flume-ng-dist-1.5.0-SNAPSHOT.pom
Downloading: https://repository.apache.org/content/repositories/snapshots/org/apache/flume/flume-ng-dist/1.5.0-SNAPSHOT/maven-metadata.xml
Downloaded: https://repository.apache.org/content/repositories/snapshots/org/apache/flume/flume-ng-dist/1.5.0-SNAPSHOT/maven-metadata.xml (2 KB at 0.3 KB/sec)
Uploading: https://repository.apache.org/content/repositories/snapshots/org/apache/flume/flume-ng-dist/1.5.0-SNAPSHOT/flume-ng-dist-1.5.0-20131107.171318-31.pom
Uploaded: https://repository.apache.org/content/repositories/snapshots/org/apache/flume/flume-ng-dist/1.5.0-SNAPSHOT/flume-ng-dist-1.5.0-20131107.171318-31.pom (5 KB at 29.4 KB/sec)
Downloading: https://repository.apache.org/content/repositories/snapshots/org/apache/flume/flume-ng-dist/maven-metadata.xml
Downloaded: https://repository.apache.org/content/repositories/snapshots/org/apache/flume/flume-ng-dist/maven-metadata.xml (349 B at 0.2 KB/sec)
Uploading: https://repository.apache.org/content/repositories/snapshots/org/apache/flume/flume-ng-dist/1.5.0-SNAPSHOT/maven-metadata.xml
Uploaded: https://repository.apache.org/content/repositories/snapshots/org/apache/flume/flume-ng-dist/1.5.0-SNAPSHOT/maven-metadata.xml (2 KB at 4.3 KB/sec)
Uploading: https://repository.apache.org/content/repositories/snapshots/org/apache/flume/flume-ng-dist/maven-metadata.xml
Uploaded: https://repository.apache.org/content/repositories/snapshots/org/apache/flume/flume-ng-dist/maven-metadata.xml (349 B at 2.1 KB/sec)
Deploying the main artifact jenkins-828104064250424142flume-ng-dist-1.5.0-SNAPSHOT-bin.tar.gz
Uploading: https://repository.apache.org/content/repositories/snapshots/org/apache/flume/flume-ng-dist/1.5.0-SNAPSHOT/flume-ng-dist-1.5.0-20131107.171318-31-bin.tar.gz
Uploaded: https://repository.apache.org/content/repositories/snapshots/org/apache/flume/flume-ng-dist/1.5.0-SNAPSHOT/flume-ng-dist-1.5.0-20131107.171318-31-bin.tar.gz (21964 KB at 3071.0 KB/sec)
Uploading: https://repository.apache.org/content/repositories/snapshots/org/apache/flume/flume-ng-dist/1.5.0-SNAPSHOT/maven-metadata.xml
Uploaded: https://repository.apache.org/content/repositories/snapshots/org/apache/flume/flume-ng-dist/1.5.0-SNAPSHOT/maven-metadata.xml (2 KB at 16.6 KB/sec)
Deploying the main artifact jenkins-4691162074168336785flume-ng-dist-1.5.0-SNAPSHOT-src.tar.gz
Uploading: https://repository.apache.org/content/repositories/snapshots/org/apache/flume/flume-ng-dist/1.5.0-SNAPSHOT/flume-ng-dist-1.5.0-20131107.171318-31-src.tar.gz
Uploaded: https://repository.apache.org/content/repositories/snapshots/org/apache/flume/flume-ng-dist/1.5.0-SNAPSHOT/flume-ng-dist-1.5.0-20131107.171318-31-src.tar.gz (2452 KB at 8978.5 KB/sec)
Uploading: https://repository.apache.org/content/repositories/snapshots/org/apache/flume/flume-ng-dist/1.5.0-SNAPSHOT/maven-metadata.xml
Uploaded: https://repository.apache.org/content/repositories/snapshots/org/apache/flume/flume-ng-dist/1.5.0-SNAPSHOT/maven-metadata.xml (2 KB at 16.1 KB/sec)
[INFO] Deployment in https://repository.apache.org/content/repositories/snapshots (id=apache.snapshots.https,uniqueVersion=true)
Deploying the main artifact jenkins-6226021414406648136flume-ng-embedded-agent-1.5.0-SNAPSHOT.jar
Downloading: https://repository.apache.org/content/repositories/snapshots/org/apache/flume/flume-ng-embedded-agent/1.5.0-SNAPSHOT/maven-metadata.xml
Downloaded: https://repository.apache.org/content/repositories/snapshots/org/apache/flume/flume-ng-embedded-agent/1.5.0-SNAPSHOT/maven-metadata.xml (792 B at 0.2 KB/sec)
Uploading: https://repository.apache.org/content/repositories/snapshots/org/apache/flume/flume-ng-embedded-agent/1.5.0-SNAPSHOT/flume-ng-embedded-agent-1.5.0-20131107.171344-31.jar
Uploaded: https://repository.apache.org/content/repositories/snapshots/org/apache/flume/flume-ng-embedded-agent/1.5.0-SNAPSHOT/flume-ng-embedded-agent-1.5.0-20131107.171344-31.jar (20 KB at 3.8 KB/sec)
Uploading: https://repository.apache.org/content/repositories/snapshots/org/apache/flume/flume-ng-embedded-agent/1.5.0-SNAPSHOT/flume-ng-embedded-agent-1.5.0-20131107.171344-31.pom
Uploaded: https://repository.apache.org/content/repositories/snapshots/org/apache/flume/flume-ng-embedded-agent/1.5.0-SNAPSHOT/flume-ng-embedded-agent-1.5.0-20131107.171344-31.pom (3 KB at 30.7 KB/sec)
Downloading: https://repository.apache.org/content/repositories/snapshots/org/apache/flume/flume-ng-embedded-agent/maven-metadata.xml
Downloaded: https://repository.apache.org/content/repositories/snapshots/org/apache/flume/flume-ng-embedded-agent/maven-metadata.xml (359 B at 0.2 KB/sec)
Uploading: https://repository.apache.org/content/repositories/snapshots/org/apache/flume/flume-ng-embedded-agent/1.5.0-SNAPSHOT/maven-metadata.xml
Uploaded: https://repository.apache.org/content/repositories/snapshots/org/apache/flume/flume-ng-embedded-agent/1.5.0-SNAPSHOT/maven-metadata.xml (792 B at 4.7 KB/sec)
Uploading: https://repository.apache.org/content/repositories/snapshots/org/apache/flume/flume-ng-embedded-agent/maven-metadata.xml
Uploaded: https://repository.apache.org/content/repositories/snapshots/org/apache/flume/flume-ng-embedded-agent/maven-metadata.xml (359 B at 3.4 KB/sec)
[INFO] Deployment in https://repository.apache.org/content/repositories/snapshots (id=apache.snapshots.https,uniqueVersion=true)
Deploying the main artifact jenkins-3490823792731185299flume-ng-legacy-sources-1.5.0-SNAPSHOT.pom
Downloading: https://repository.apache.org/content/repositories/snapshots/org/apache/flume/flume-ng-legacy-sources/1.5.0-SNAPSHOT/maven-metadata.xml
Downloaded: https://repository.apache.org/content/repositories/snapshots/org/apache/flume/flume-ng-legacy-sources/1.5.0-SNAPSHOT/maven-metadata.xml (618 B at 0.5 KB/sec)
Uploading: https://repository.apache.org/content/repositories/snapshots/org/apache/flume/flume-ng-legacy-sources/1.5.0-SNAPSHOT/flume-ng-legacy-sources-1.5.0-20131107.171401-31.pom
Uploaded: https://repository.apache.org/content/repositories/snapshots/org/apache/flume/flume-ng-legacy-sources/1.5.0-SNAPSHOT/flume-ng-legacy-sources-1.5.0-20131107.171401-31.pom (2 KB at 10.0 KB/sec)
Downloading: https://repository.apache.org/content/repositories/snapshots/org/apache/flume/flume-ng-legacy-sources/maven-metadata.xml
Downloaded: https://repository.apache.org/content/repositories/snapshots/org/apache/flume/flume-ng-legacy-sources/maven-metadata.xml (359 B at 1.4 KB/sec)
Uploading: https://repository.apache.org/content/repositories/snapshots/org/apache/flume/flume-ng-legacy-sources/1.5.0-SNAPSHOT/maven-metadata.xml
Uploaded: https://repository.apache.org/content/repositories/snapshots/org/apache/flume/flume-ng-legacy-sources/1.5.0-SNAPSHOT/maven-metadata.xml (618 B at 1.2 KB/sec)
Uploading: https://repository.apache.org/content/repositories/snapshots/org/apache/flume/flume-ng-legacy-sources/maven-metadata.xml
Uploaded: https://repository.apache.org/content/repositories/snapshots/org/apache/flume/flume-ng-legacy-sources/maven-metadata.xml (359 B at 2.4 KB/sec)
[INFO] Deployment in https://repository.apache.org/content/repositories/snapshots (id=apache.snapshots.https,uniqueVersion=true)
Deploying the main artifact jenkins-657319376508045470flume-ng-node-1.5.0-SNAPSHOT.jar
Downloading: https://repository.apache.org/content/repositories/snapshots/org/apache/flume/flume-ng-node/1.5.0-SNAPSHOT/maven-metadata.xml
Downloaded: https://repository.apache.org/content/repositories/snapshots/org/apache/flume/flume-ng-node/1.5.0-SNAPSHOT/maven-metadata.xml (782 B at 0.6 KB/sec)
Uploading: https://repository.apache.org/content/repositories/snapshots/org/apache/flume/flume-ng-node/1.5.0-SNAPSHOT/flume-ng-node-1.5.0-20131107.171412-31.jar
Uploaded: https://repository.apache.org/content/repositories/snapshots/org/apache/flume/flume-ng-node/1.5.0-SNAPSHOT/flume-ng-node-1.5.0-20131107.171412-31.jar (31 KB at 120.2 KB/sec)
Uploading: https://repository.apache.org/content/repositories/snapshots/org/apache/flume/flume-ng-node/1.5.0-SNAPSHOT/flume-ng-node-1.5.0-20131107.171412-31.pom
Uploaded: https://repository.apache.org/content/repositories/snapshots/org/apache/flume/flume-ng-node/1.5.0-SNAPSHOT/flume-ng-node-1.5.0-20131107.171412-31.pom (5 KB at 31.6 KB/sec)
Downloading: https://repository.apache.org/content/repositories/snapshots/org/apache/flume/flume-ng-node/maven-metadata.xml
Downloaded: https://repository.apache.org/content/repositories/snapshots/org/apache/flume/flume-ng-node/maven-metadata.xml (349 B at 0.2 KB/sec)
Uploading: https://repository.apache.org/content/repositories/snapshots/org/apache/flume/flume-ng-node/1.5.0-SNAPSHOT/maven-metadata.xml
Uploaded: https://repository.apache.org/content/repositories/snapshots/org/apache/flume/flume-ng-node/1.5.0-SNAPSHOT/maven-metadata.xml (782 B at 6.3 KB/sec)
Uploading: https://repository.apache.org/content/repositories/snapshots/org/apache/flume/flume-ng-node/maven-metadata.xml
Uploaded: https://repository.apache.org/content/repositories/snapshots/org/apache/flume/flume-ng-node/maven-metadata.xml (349 B at 2.1 KB/sec)
[INFO] Deployment in https://repository.apache.org/content/repositories/snapshots (id=apache.snapshots.https,uniqueVersion=true)
Deploying the main artifact jenkins-6639627621143110078flume-ng-sdk-1.5.0-SNAPSHOT.jar
Downloading: https://repository.apache.org/content/repositories/snapshots/org/apache/flume/flume-ng-sdk/1.5.0-SNAPSHOT/maven-metadata.xml
Downloaded: https://repository.apache.org/content/repositories/snapshots/org/apache/flume/flume-ng-sdk/1.5.0-SNAPSHOT/maven-metadata.xml (994 B at 1.3 KB/sec)
Uploading: https://repository.apache.org/content/repositories/snapshots/org/apache/flume/flume-ng-sdk/1.5.0-SNAPSHOT/flume-ng-sdk-1.5.0-20131107.171419-31.jar
Uploaded: https://repository.apache.org/content/repositories/snapshots/org/apache/flume/flume-ng-sdk/1.5.0-SNAPSHOT/flume-ng-sdk-1.5.0-20131107.171419-31.jar (114 KB at 789.5 KB/sec)
Uploading: https://repository.apache.org/content/repositories/snapshots/org/apache/flume/flume-ng-sdk/1.5.0-SNAPSHOT/flume-ng-sdk-1.5.0-20131107.171419-31.pom
Uploaded: https://repository.apache.org/content/repositories/snapshots/org/apache/flume/flume-ng-sdk/1.5.0-SNAPSHOT/flume-ng-sdk-1.5.0-20131107.171419-31.pom (8 KB at 56.4 KB/sec)
Downloading: https://repository.apache.org/content/repositories/snapshots/org/apache/flume/flume-ng-sdk/maven-metadata.xml
Downloaded: https://repository.apache.org/content/repositories/snapshots/org/apache/flume/flume-ng-sdk/maven-metadata.xml (348 B at 0.0 KB/sec)
Uploading: https://repository.apache.org/content/repositories/snapshots/org/apache/flume/flume-ng-sdk/1.5.0-SNAPSHOT/maven-metadata.xml
Uploaded: https://repository.apache.org/content/repositories/snapshots/org/apache/flume/flume-ng-sdk/1.5.0-SNAPSHOT/maven-metadata.xml (994 B at 4.8 KB/sec)
Uploading: https://repository.apache.org/content/repositories/snapshots/org/apache/flume/flume-ng-sdk/maven-metadata.xml
Uploaded: https://repository.apache.org/content/repositories/snapshots/org/apache/flume/flume-ng-sdk/maven-metadata.xml (348 B at 0.1 KB/sec)
Deploying the main artifact jenkins-8054263436498370568flume-ng-sdk-1.5.0-SNAPSHOT-tests.jar
Uploading: https://repository.apache.org/content/repositories/snapshots/org/apache/flume/flume-ng-sdk/1.5.0-SNAPSHOT/flume-ng-sdk-1.5.0-20131107.171419-31-tests.jar
Uploaded: https://repository.apache.org/content/repositories/snapshots/org/apache/flume/flume-ng-sdk/1.5.0-SNAPSHOT/flume-ng-sdk-1.5.0-20131107.171419-31-tests.jar (49 KB at 175.3 KB/sec)
Uploading: https://repository.apache.org/content/repositories/snapshots/org/apache/flume/flume-ng-sdk/1.5.0-SNAPSHOT/maven-metadata.xml
Uploaded: https://repository.apache.org/content/repositories/snapshots/org/apache/flume/flume-ng-sdk/1.5.0-SNAPSHOT/maven-metadata.xml (994 B at 16.5 KB/sec)
[INFO] Deployment in https://repository.apache.org/content/repositories/snapshots (id=apache.snapshots.https,uniqueVersion=true)
Deploying the main artifact jenkins-447677446093507726flume-ng-sinks-1.5.0-SNAPSHOT.pom
Downloading: https://repository.apache.org/content/repositories/snapshots/org/apache/flume/flume-ng-sinks/1.5.0-SNAPSHOT/maven-metadata.xml
Downloaded: https://repository.apache.org/content/repositories/snapshots/org/apache/flume/flume-ng-sinks/1.5.0-SNAPSHOT/maven-metadata.xml (609 B at 0.1 KB/sec)
Uploading: https://repository.apache.org/content/repositories/snapshots/org/apache/flume/flume-ng-sinks/1.5.0-SNAPSHOT/flume-ng-sinks-1.5.0-20131107.171457-31.pom
Uploaded: https://repository.apache.org/content/repositories/snapshots/org/apache/flume/flume-ng-sinks/1.5.0-SNAPSHOT/flume-ng-sinks-1.5.0-20131107.171457-31.pom (2 KB at 14.2 KB/sec)
Downloading: https://repository.apache.org/content/repositories/snapshots/org/apache/flume/flume-ng-sinks/maven-metadata.xml
Downloaded: https://repository.apache.org/content/repositories/snapshots/org/apache/flume/flume-ng-sinks/maven-metadata.xml (350 B at 0.1 KB/sec)
Uploading: https://repository.apache.org/content/repositories/snapshots/org/apache/flume/flume-ng-sinks/1.5.0-SNAPSHOT/maven-metadata.xml
Uploaded: https://repository.apache.org/content/repositories/snapshots/org/apache/flume/flume-ng-sinks/1.5.0-SNAPSHOT/maven-metadata.xml (609 B at 5.1 KB/sec)
Uploading: https://repository.apache.org/content/repositories/snapshots/org/apache/flume/flume-ng-sinks/maven-metadata.xml
Uploaded: https://repository.apache.org/content/repositories/snapshots/org/apache/flume/flume-ng-sinks/maven-metadata.xml (350 B at 3.5 KB/sec)
[INFO] Deployment in https://repository.apache.org/content/repositories/snapshots (id=apache.snapshots.https,uniqueVersion=true)
Deploying the main artifact jenkins-2056039123250700084flume-ng-sources-1.5.0-SNAPSHOT.pom
Downloading: https://repository.apache.org/content/repositories/snapshots/org/apache/flume/flume-ng-sources/1.5.0-SNAPSHOT/maven-metadata.xml
Downloaded: https://repository.apache.org/content/repositories/snapshots/org/apache/flume/flume-ng-sources/1.5.0-SNAPSHOT/maven-metadata.xml (611 B at 0.1 KB/sec)
Uploading: https://repository.apache.org/content/repositories/snapshots/org/apache/flume/flume-ng-sources/1.5.0-SNAPSHOT/flume-ng-sources-1.5.0-20131107.171512-31.pom
Uploaded: https://repository.apache.org/content/repositories/snapshots/org/apache/flume/flume-ng-sources/1.5.0-SNAPSHOT/flume-ng-sources-1.5.0-20131107.171512-31.pom (2 KB at 18.7 KB/sec)
Downloading: https://repository.apache.org/content/repositories/snapshots/org/apache/flume/flume-ng-sources/maven-metadata.xml
Downloaded: https://repository.apache.org/content/repositories/snapshots/org/apache/flume/flume-ng-sources/maven-metadata.xml (352 B at 0.1 KB/sec)
Uploading: https://repository.apache.org/content/repositories/snapshots/org/apache/flume/flume-ng-sources/1.5.0-SNAPSHOT/maven-metadata.xml
Uploaded: https://repository.apache.org/content/repositories/snapshots/org/apache/flume/flume-ng-sources/1.5.0-SNAPSHOT/maven-metadata.xml (611 B at 2.5 KB/sec)
Uploading: https://repository.apache.org/content/repositories/snapshots/org/apache/flume/flume-ng-sources/maven-metadata.xml
Uploaded: https://repository.apache.org/content/repositories/snapshots/org/apache/flume/flume-ng-sources/maven-metadata.xml (352 B at 3.4 KB/sec)
[INFO] Deployment in https://repository.apache.org/content/repositories/snapshots (id=apache.snapshots.https,uniqueVersion=true)
Deploying the main artifact jenkins-3039585854042412797flume-ng-tests-1.5.0-SNAPSHOT.jar
Downloading: https://repository.apache.org/content/repositories/snapshots/org/apache/flume/flume-ng-tests/1.5.0-SNAPSHOT/maven-metadata.xml
Downloaded: https://repository.apache.org/content/repositories/snapshots/org/apache/flume/flume-ng-tests/1.5.0-SNAPSHOT/maven-metadata.xml (783 B at 0.9 KB/sec)
Uploading: https://repository.apache.org/content/repositories/snapshots/org/apache/flume/flume-ng-tests/1.5.0-SNAPSHOT/flume-ng-tests-1.5.0-20131107.171517-31.jar
Uploaded: https://repository.apache.org/content/repositories/snapshots/org/apache/flume/flume-ng-tests/1.5.0-SNAPSHOT/flume-ng-tests-1.5.0-20131107.171517-31.jar (10 KB at 103.1 KB/sec)
Uploading: https://repository.apache.org/content/repositories/snapshots/org/apache/flume/flume-ng-tests/1.5.0-SNAPSHOT/flume-ng-tests-1.5.0-20131107.171517-31.pom
Uploaded: https://repository.apache.org/content/repositories/snapshots/org/apache/flume/flume-ng-tests/1.5.0-SNAPSHOT/flume-ng-tests-1.5.0-20131107.171517-31.pom (3 KB at 37.1 KB/sec)
Downloading: https://repository.apache.org/content/repositories/snapshots/org/apache/flume/flume-ng-tests/maven-metadata.xml
Downloaded: https://repository.apache.org/content/repositories/snapshots/org/apache/flume/flume-ng-tests/maven-metadata.xml (350 B at 0.2 KB/sec)
Uploading: https://repository.apache.org/content/repositories/snapshots/org/apache/flume/flume-ng-tests/1.5.0-SNAPSHOT/maven-metadata.xml
Uploaded: https://repository.apache.org/content/repositories/snapshots/org/apache/flume/flume-ng-tests/1.5.0-SNAPSHOT/maven-metadata.xml (783 B at 3.7 KB/sec)
Uploading: https://repository.apache.org/content/repositories/snapshots/org/apache/flume/flume-ng-tests/maven-metadata.xml
Uploaded: https://repository.apache.org/content/repositories/snapshots/org/apache/flume/flume-ng-tests/maven-metadata.xml (350 B at 3.1 KB/sec)
[INFO] Deployment in https://repository.apache.org/content/repositories/snapshots (id=apache.snapshots.https,uniqueVersion=true)
Deploying the main artifact jenkins-5131592020391268531flume-parent-1.5.0-SNAPSHOT.pom
Downloading: https://repository.apache.org/content/repositories/snapshots/org/apache/flume/flume-parent/1.5.0-SNAPSHOT/maven-metadata.xml
Downloaded: https://repository.apache.org/content/repositories/snapshots/org/apache/flume/flume-parent/1.5.0-SNAPSHOT/maven-metadata.xml (607 B at 0.1 KB/sec)
Uploading: https://repository.apache.org/content/repositories/snapshots/org/apache/flume/flume-parent/1.5.0-SNAPSHOT/flume-parent-1.5.0-20131107.171536-31.pom
Uploaded: https://repository.apache.org/content/repositories/snapshots/org/apache/flume/flume-parent/1.5.0-SNAPSHOT/flume-parent-1.5.0-20131107.171536-31.pom (33 KB at 196.7 KB/sec)
Downloading: https://repository.apache.org/content/repositories/snapshots/org/apache/flume/flume-parent/maven-metadata.xml
Downloaded: https://repository.apache.org/content/repositories/snapshots/org/apache/flume/flume-parent/maven-metadata.xml (348 B at 1.2 KB/sec)
Uploading: https://repository.apache.org/content/repositories/snapshots/org/apache/flume/flume-parent/1.5.0-SNAPSHOT/maven-metadata.xml
Uploaded: https://repository.apache.org/content/repositories/snapshots/org/apache/flume/flume-parent/1.5.0-SNAPSHOT/maven-metadata.xml (607 B at 4.0 KB/sec)
Uploading: https://repository.apache.org/content/repositories/snapshots/org/apache/flume/flume-parent/maven-metadata.xml
Uploaded: https://repository.apache.org/content/repositories/snapshots/org/apache/flume/flume-parent/maven-metadata.xml (348 B at 4.1 KB/sec)
[INFO] Deployment in https://repository.apache.org/content/repositories/snapshots (id=apache.snapshots.https,uniqueVersion=true)
Deploying the main artifact jenkins-1071045748798413560flume-tools-1.5.0-SNAPSHOT.jar
Downloading: https://repository.apache.org/content/repositories/snapshots/org/apache/flume/flume-tools/1.5.0-SNAPSHOT/maven-metadata.xml
Downloaded: https://repository.apache.org/content/repositories/snapshots/org/apache/flume/flume-tools/1.5.0-SNAPSHOT/maven-metadata.xml (780 B at 1.0 KB/sec)
Uploading: https://repository.apache.org/content/repositories/snapshots/org/apache/flume/flume-tools/1.5.0-SNAPSHOT/flume-tools-1.5.0-20131107.171546-31.jar
Uploaded: https://repository.apache.org/content/repositories/snapshots/org/apache/flume/flume-tools/1.5.0-SNAPSHOT/flume-tools-1.5.0-20131107.171546-31.jar (16 KB at 143.1 KB/sec)
Uploading: https://repository.apache.org/content/repositories/snapshots/org/apache/flume/flume-tools/1.5.0-SNAPSHOT/flume-tools-1.5.0-20131107.171546-31.pom
Uploaded: https://repository.apache.org/content/repositories/snapshots/org/apache/flume/flume-tools/1.5.0-SNAPSHOT/flume-tools-1.5.0-20131107.171546-31.pom (4 KB at 71.9 KB/sec)
Downloading: https://repository.apache.org/content/repositories/snapshots/org/apache/flume/flume-tools/maven-metadata.xml
Downloaded: https://repository.apache.org/content/repositories/snapshots/org/apache/flume/flume-tools/maven-metadata.xml (347 B at 0.8 KB/sec)
Uploading: https://repository.apache.org/content/repositories/snapshots/org/apache/flume/flume-tools/1.5.0-SNAPSHOT/maven-metadata.xml
Uploaded: https://repository.apache.org/content/repositories/snapshots/org/apache/flume/flume-tools/1.5.0-SNAPSHOT/maven-metadata.xml (780 B at 5.8 KB/sec)
Uploading: https://repository.apache.org/content/repositories/snapshots/org/apache/flume/flume-tools/maven-metadata.xml
Uploaded: https://repository.apache.org/content/repositories/snapshots/org/apache/flume/flume-tools/maven-metadata.xml (347 B at 3.4 KB/sec)
[INFO] Deployment in https://repository.apache.org/content/repositories/snapshots (id=apache.snapshots.https,uniqueVersion=true)
Deploying the main artifact jenkins-7432720059225443673flume-file-channel-1.5.0-SNAPSHOT.jar
Downloading: https://repository.apache.org/content/repositories/snapshots/org/apache/flume/flume-ng-channels/flume-file-channel/1.5.0-SNAPSHOT/maven-metadata.xml
Downloaded: https://repository.apache.org/content/repositories/snapshots/org/apache/flume/flume-ng-channels/flume-file-channel/1.5.0-SNAPSHOT/maven-metadata.xml (805 B at 0.4 KB/sec)
Uploading: https://repository.apache.org/content/repositories/snapshots/org/apache/flume/flume-ng-channels/flume-file-channel/1.5.0-SNAPSHOT/flume-file-channel-1.5.0-20131107.171549-31.jar
Uploaded: https://repository.apache.org/content/repositories/snapshots/org/apache/flume/flume-ng-channels/flume-file-channel/1.5.0-SNAPSHOT/flume-file-channel-1.5.0-20131107.171549-31.jar (281 KB at 1281.2 KB/sec)
Uploading: https://repository.apache.org/content/repositories/snapshots/org/apache/flume/flume-ng-channels/flume-file-channel/1.5.0-SNAPSHOT/flume-file-channel-1.5.0-20131107.171549-31.pom
Uploaded: https://repository.apache.org/content/repositories/snapshots/org/apache/flume/flume-ng-channels/flume-file-channel/1.5.0-SNAPSHOT/flume-file-channel-1.5.0-20131107.171549-31.pom (5 KB at 63.2 KB/sec)
Downloading: https://repository.apache.org/content/repositories/snapshots/org/apache/flume/flume-ng-channels/flume-file-channel/maven-metadata.xml
Downloaded: https://repository.apache.org/content/repositories/snapshots/org/apache/flume/flume-ng-channels/flume-file-channel/maven-metadata.xml (372 B at 0.3 KB/sec)
Uploading: https://repository.apache.org/content/repositories/snapshots/org/apache/flume/flume-ng-channels/flume-file-channel/1.5.0-SNAPSHOT/maven-metadata.xml
Uploaded: https://repository.apache.org/content/repositories/snapshots/org/apache/flume/flume-ng-channels/flume-file-channel/1.5.0-SNAPSHOT/maven-metadata.xml (805 B at 7.0 KB/sec)
Uploading: https://repository.apache.org/content/repositories/snapshots/org/apache/flume/flume-ng-channels/flume-file-channel/maven-metadata.xml
Uploaded: https://repository.apache.org/content/repositories/snapshots/org/apache/flume/flume-ng-channels/flume-file-channel/maven-metadata.xml (372 B at 4.0 KB/sec)
[INFO] Deployment in https://repository.apache.org/content/repositories/snapshots (id=apache.snapshots.https,uniqueVersion=true)
Deploying the main artifact jenkins-24691518903391469flume-jdbc-channel-1.5.0-SNAPSHOT.jar
Downloading: https://repository.apache.org/content/repositories/snapshots/org/apache/flume/flume-ng-channels/flume-jdbc-channel/1.5.0-SNAPSHOT/maven-metadata.xml
Downloaded: https://repository.apache.org/content/repositories/snapshots/org/apache/flume/flume-ng-channels/flume-jdbc-channel/1.5.0-SNAPSHOT/maven-metadata.xml (805 B at 0.1 KB/sec)
Uploading: https://repository.apache.org/content/repositories/snapshots/org/apache/flume/flume-ng-channels/flume-jdbc-channel/1.5.0-SNAPSHOT/flume-jdbc-channel-1.5.0-20131107.171603-31.jar
Uploaded: https://repository.apache.org/content/repositories/snapshots/org/apache/flume/flume-ng-channels/flume-jdbc-channel/1.5.0-SNAPSHOT/flume-jdbc-channel-1.5.0-20131107.171603-31.jar (53 KB at 496.9 KB/sec)
Uploading: https://repository.apache.org/content/repositories/snapshots/org/apache/flume/flume-ng-channels/flume-jdbc-channel/1.5.0-SNAPSHOT/flume-jdbc-channel-1.5.0-20131107.171603-31.pom
Uploaded: https://repository.apache.org/content/repositories/snapshots/org/apache/flume/flume-ng-channels/flume-jdbc-channel/1.5.0-SNAPSHOT/flume-jdbc-channel-1.5.0-20131107.171603-31.pom (3 KB at 39.4 KB/sec)
Downloading: https://repository.apache.org/content/repositories/snapshots/org/apache/flume/flume-ng-channels/flume-jdbc-channel/maven-metadata.xml
Downloaded: https://repository.apache.org/content/repositories/snapshots/org/apache/flume/flume-ng-channels/flume-jdbc-channel/maven-metadata.xml (372 B at 0.0 KB/sec)
Uploading: https://repository.apache.org/content/repositories/snapshots/org/apache/flume/flume-ng-channels/flume-jdbc-channel/1.5.0-SNAPSHOT/maven-metadata.xml
Uploaded: https://repository.apache.org/content/repositories/snapshots/org/apache/flume/flume-ng-channels/flume-jdbc-channel/1.5.0-SNAPSHOT/maven-metadata.xml (805 B at 5.8 KB/sec)
Uploading: https://repository.apache.org/content/repositories/snapshots/org/apache/flume/flume-ng-channels/flume-jdbc-channel/maven-metadata.xml
ERROR: Failed to deploy metadata: Could not transfer metadata org.apache.flume.flume-ng-channels:flume-jdbc-channel/maven-metadata.xml from/to apache.snapshots.https (https://repository.apache.org/content/repositories/snapshots): The target server failed to respond
org.apache.maven.artifact.deployer.ArtifactDeploymentException: Failed to deploy metadata: Could not transfer metadata org.apache.flume.flume-ng-channels:flume-jdbc-channel/maven-metadata.xml from/to apache.snapshots.https (https://repository.apache.org/content/repositories/snapshots): The target server failed to respond
	at org.apache.maven.artifact.deployer.DefaultArtifactDeployer.deploy(DefaultArtifactDeployer.java:143)
	at hudson.maven.reporters.MavenArtifactRecord.deploy(MavenArtifactRecord.java:191)
	at hudson.maven.RedeployPublisher.perform(RedeployPublisher.java:176)
	at hudson.tasks.BuildStepMonitor$1.perform(BuildStepMonitor.java:20)
	at hudson.model.AbstractBuild$AbstractBuildExecution.perform(AbstractBuild.java:781)
	at hudson.model.AbstractBuild$AbstractBuildExecution.performAllBuildSteps(AbstractBuild.java:753)
	at hudson.maven.MavenModuleSetBuild$MavenModuleSetBuildExecution.post2(MavenModuleSetBuild.java:1020)
	at hudson.model.AbstractBuild$AbstractBuildExecution.post(AbstractBuild.java:706)
	at hudson.model.Run.execute(Run.java:1690)
	at hudson.maven.MavenModuleSetBuild.run(MavenModuleSetBuild.java:509)
	at hudson.model.ResourceController.execute(ResourceController.java:88)
	at hudson.model.Executor.run(Executor.java:230)
Caused by: org.eclipse.aether.deployment.DeploymentException: Failed to deploy metadata: Could not transfer metadata org.apache.flume.flume-ng-channels:flume-jdbc-channel/maven-metadata.xml from/to apache.snapshots.https (https://repository.apache.org/content/repositories/snapshots): The target server failed to respond
	at org.eclipse.aether.internal.impl.DefaultDeployer.deploy(DefaultDeployer.java:372)
	at org.eclipse.aether.internal.impl.DefaultDeployer.deploy(DefaultDeployer.java:269)
	at org.eclipse.aether.internal.impl.DefaultRepositorySystem.deploy(DefaultRepositorySystem.java:413)
	at org.apache.maven.artifact.deployer.DefaultArtifactDeployer.deploy(DefaultArtifactDeployer.java:139)
	... 11 more
Caused by: org.eclipse.aether.transfer.MetadataTransferException: Could not transfer metadata org.apache.flume.flume-ng-channels:flume-jdbc-channel/maven-metadata.xml from/to apache.snapshots.https (https://repository.apache.org/content/repositories/snapshots): The target server failed to respond
	at org.eclipse.aether.connector.wagon.WagonRepositoryConnector$5.wrap(WagonRepositoryConnector.java:995)
	at org.eclipse.aether.connector.wagon.WagonRepositoryConnector$5.wrap(WagonRepositoryConnector.java:983)
	at org.eclipse.aether.connector.wagon.WagonRepositoryConnector$PutTask.run(WagonRepositoryConnector.java:895)
	at org.eclipse.aether.connector.wagon.WagonRepositoryConnector.put(WagonRepositoryConnector.java:530)
	at org.eclipse.aether.internal.impl.DefaultDeployer.deploy(DefaultDeployer.java:366)
	... 14 more
Caused by: org.apache.maven.wagon.TransferFailedException: The target server failed to respond
	at org.apache.maven.wagon.shared.http4.AbstractHttpClientWagon.put(AbstractHttpClientWagon.java:580)
	at org.apache.maven.wagon.shared.http4.AbstractHttpClientWagon.put(AbstractHttpClientWagon.java:524)
	at org.apache.maven.wagon.shared.http4.AbstractHttpClientWagon.put(AbstractHttpClientWagon.java:505)
	at org.apache.maven.wagon.shared.http4.AbstractHttpClientWagon.put(AbstractHttpClientWagon.java:485)
	at org.eclipse.aether.connector.wagon.WagonRepositoryConnector$PutTask.run(WagonRepositoryConnector.java:871)
	... 16 more
Caused by: org.apache.http.NoHttpResponseException: The target server failed to respond
	at org.apache.http.impl.conn.DefaultHttpResponseParser.parseHead(DefaultHttpResponseParser.java:95)
	at org.apache.http.impl.conn.DefaultHttpResponseParser.parseHead(DefaultHttpResponseParser.java:62)
	at org.apache.http.impl.io.AbstractMessageParser.parse(AbstractMessageParser.java:254)
	at org.apache.http.impl.AbstractHttpClientConnection.receiveResponseHeader(AbstractHttpClientConnection.java:289)
	at org.apache.http.impl.conn.DefaultClientConnection.receiveResponseHeader(DefaultClientConnection.java:252)
	at org.apache.http.impl.conn.ManagedClientConnectionImpl.receiveResponseHeader(ManagedClientConnectionImpl.java:191)
	at org.apache.http.protocol.HttpRequestExecutor.doReceiveResponse(HttpRequestExecutor.java:300)
	at org.apache.http.protocol.HttpRequestExecutor.execute(HttpRequestExecutor.java:127)
	at org.apache.http.impl.client.DefaultRequestDirector.tryExecute(DefaultRequestDirector.java:715)
	at org.apache.http.impl.client.DefaultRequestDirector.execute(DefaultRequestDirector.java:520)
	at org.apache.http.impl.client.AbstractHttpClient.execute(AbstractHttpClient.java:906)
	at org.apache.http.impl.client.AbstractHttpClient.execute(AbstractHttpClient.java:805)
	at org.apache.maven.wagon.shared.http4.AbstractHttpClientWagon.execute(AbstractHttpClientWagon.java:746)
	at org.apache.maven.wagon.shared.http4.AbstractHttpClientWagon.put(AbstractHttpClientWagon.java:574)
	... 20 more
[INFO] Deployment failed after 3 min 38 sec
Build step 'Deploy artifacts to Maven repository' changed build result to FAILURE
Updating FLUME-2065