You are viewing a plain text version of this content. The canonical link for it is here.
Posted to dev@sling.apache.org by Apache Jenkins Server <je...@builds.apache.org> on 2014/08/08 19:03:50 UTC
Build failed in Jenkins: sling-contrib-1.6 #1202
See <https://builds.apache.org/job/sling-contrib-1.6/1202/changes>
Changes:
[tommaso] SLING-3830 - applied Marius Petria's patch for reenabling multiple endpoints and multiple polling
------------------------------------------
[...truncated 20546 lines...]
[echo] **************** WARNING (SLING-443/SLING-1782) ******************************
[echo] On most platforms, you'll get OutOfMemoryErrors when building unless you set
[echo] on 32bit platforms: MAVEN_OPTS="-Xmx256M -XX:MaxPermSize=256M", see SLING-443
[echo] on 64bit platforms: MAVEN_OPTS="-Xmx512M -XX:MaxPermSize=512M", see SLING-1782
[echo] ******************************************************************************
[INFO] Executed tasks
[INFO]
[INFO] --- maven-compiler-plugin:3.1:compile (default-compile) @ org.apache.sling.launchpad.karaf-launchpad-integration-tests ---
[INFO] No sources to compile
[INFO]
[INFO] --- maven-resources-plugin:2.6:testResources (default-testResources) @ org.apache.sling.launchpad.karaf-launchpad-integration-tests ---
[INFO] Using 'UTF-8' encoding to copy filtered resources.
[INFO] skip non existing resourceDirectory <https://builds.apache.org/job/sling-contrib-1.6/ws/contrib-1.6/launchpad/karaf/org.apache.sling.launchpad.karaf-launchpad-integration-tests/src/test/resources>
[INFO] Copying 3 resources
[INFO]
[INFO] --- maven-compiler-plugin:3.1:testCompile (default-testCompile) @ org.apache.sling.launchpad.karaf-launchpad-integration-tests ---
[INFO] Changes detected - recompiling the module!
[INFO] Compiling 1 source file to <https://builds.apache.org/job/sling-contrib-1.6/ws/contrib-1.6/launchpad/karaf/org.apache.sling.launchpad.karaf-launchpad-integration-tests/target/test-classes>
[INFO]
[INFO] --- maven-surefire-plugin:2.16:test (default-test) @ org.apache.sling.launchpad.karaf-launchpad-integration-tests ---
[JENKINS] Recording test results[INFO]
[INFO] --- animal-sniffer-maven-plugin:1.11:check (default) @ org.apache.sling.launchpad.karaf-launchpad-integration-tests ---
[INFO] Checking unresolved references to org.codehaus.mojo.signature:java15:1.0
[INFO]
[INFO] --- maven-bundle-plugin:2.4.0:bundle (default-bundle) @ org.apache.sling.launchpad.karaf-launchpad-integration-tests ---
[WARNING] Bundle org.apache.sling:org.apache.sling.launchpad.karaf-launchpad-integration-tests:bundle:0.0.1-SNAPSHOT : Unused Private-Package instructions, no such package(s) on the class path: [!*]
[INFO]
[INFO] --- maven-enforcer-plugin:1.3.1:enforce (enforce-java) @ org.apache.sling.launchpad.karaf-launchpad-integration-tests ---
[INFO]
[INFO] --- maven-antrun-plugin:1.7:run (set-bundle-required-execution-environment) @ org.apache.sling.launchpad.karaf-launchpad-integration-tests ---
[INFO] Executing tasks
main:
[INFO] Executed tasks
[WARNING] Failed to getClass for org.apache.maven.plugin.source.SourceJarMojo
[INFO]
[INFO] --- maven-source-plugin:2.2.1:jar (attach-sources) @ org.apache.sling.launchpad.karaf-launchpad-integration-tests ---
[INFO] Building jar: <https://builds.apache.org/job/sling-contrib-1.6/ws/contrib-1.6/launchpad/karaf/org.apache.sling.launchpad.karaf-launchpad-integration-tests/target/org.apache.sling.launchpad.karaf-launchpad-integration-tests-0.0.1-SNAPSHOT-sources.jar>
[INFO]
[INFO] --- maven-site-plugin:3.3:attach-descriptor (attach-descriptor) @ org.apache.sling.launchpad.karaf-launchpad-integration-tests ---
[INFO]
[INFO] --- exam-maven-plugin:3.4.0:start-container (default) @ org.apache.sling.launchpad.karaf-launchpad-integration-tests ---
Downloading: http://repo.maven.apache.org/maven2/org/apache/maven/maven-plugin-api/3.0.5/maven-plugin-api-3.0.5.pom
Downloaded: http://repo.maven.apache.org/maven2/org/apache/maven/maven-plugin-api/3.0.5/maven-plugin-api-3.0.5.pom (0 B at 0.0 KB/sec)
Downloading: http://repo.maven.apache.org/maven2/org/apache/maven/maven-artifact/3.0.5/maven-artifact-3.0.5.pom
Downloaded: http://repo.maven.apache.org/maven2/org/apache/maven/maven-artifact/3.0.5/maven-artifact-3.0.5.pom (0 B at 0.0 KB/sec)
Downloading: http://repo.maven.apache.org/maven2/org/apache/maven/maven-core/3.0.5/maven-core-3.0.5.pom
Downloaded: http://repo.maven.apache.org/maven2/org/apache/maven/maven-core/3.0.5/maven-core-3.0.5.pom (0 B at 0.0 KB/sec)
Downloading: http://repo.maven.apache.org/maven2/org/apache/maven/maven-settings/3.0.5/maven-settings-3.0.5.pom
Downloaded: http://repo.maven.apache.org/maven2/org/apache/maven/maven-settings/3.0.5/maven-settings-3.0.5.pom (0 B at 0.0 KB/sec)
Downloading: http://repo.maven.apache.org/maven2/org/apache/maven/maven-settings-builder/3.0.5/maven-settings-builder-3.0.5.pom
Downloaded: http://repo.maven.apache.org/maven2/org/apache/maven/maven-settings-builder/3.0.5/maven-settings-builder-3.0.5.pom (0 B at 0.0 KB/sec)
Downloading: http://repo.maven.apache.org/maven2/org/apache/maven/maven-repository-metadata/3.0.5/maven-repository-metadata-3.0.5.pom
Downloaded: http://repo.maven.apache.org/maven2/org/apache/maven/maven-repository-metadata/3.0.5/maven-repository-metadata-3.0.5.pom (0 B at 0.0 KB/sec)
Downloading: http://repo.maven.apache.org/maven2/org/apache/maven/maven-model-builder/3.0.5/maven-model-builder-3.0.5.pom
Downloaded: http://repo.maven.apache.org/maven2/org/apache/maven/maven-model-builder/3.0.5/maven-model-builder-3.0.5.pom (0 B at 0.0 KB/sec)
Downloading: http://repo.maven.apache.org/maven2/org/apache/maven/maven-aether-provider/3.0.5/maven-aether-provider-3.0.5.pom
Downloaded: http://repo.maven.apache.org/maven2/org/apache/maven/maven-aether-provider/3.0.5/maven-aether-provider-3.0.5.pom (0 B at 0.0 KB/sec)
Downloading: http://repo.maven.apache.org/maven2/org/apache/xbean/xbean-reflect/3.12/xbean-reflect-3.12.jar
Downloaded: http://repo.maven.apache.org/maven2/org/apache/xbean/xbean-reflect/3.12/xbean-reflect-3.12.jar (0 B at 0.0 KB/sec)
[ERROR]
java.lang.reflect.InvocationTargetException
at sun.reflect.NativeMethodAccessorImpl.invoke0(Native Method)
at sun.reflect.NativeMethodAccessorImpl.invoke(NativeMethodAccessorImpl.java:39)
at sun.reflect.DelegatingMethodAccessorImpl.invoke(DelegatingMethodAccessorImpl.java:25)
at java.lang.reflect.Method.invoke(Method.java:597)
at org.ops4j.pax.exam.maven.StartContainerMojo.getConfigurationOptions(StartContainerMojo.java:158)
at org.ops4j.pax.exam.maven.StartContainerMojo.run(StartContainerMojo.java:142)
at org.ops4j.pax.exam.maven.StartContainerMojo.execute(StartContainerMojo.java:108)
at org.apache.maven.plugin.DefaultBuildPluginManager.executeMojo(DefaultBuildPluginManager.java:101)
at org.apache.maven.lifecycle.internal.MojoExecutor.execute(MojoExecutor.java:209)
at org.apache.maven.lifecycle.internal.MojoExecutor.execute(MojoExecutor.java:153)
at org.apache.maven.lifecycle.internal.MojoExecutor.execute(MojoExecutor.java:145)
at org.apache.maven.lifecycle.internal.LifecycleModuleBuilder.buildProject(LifecycleModuleBuilder.java:84)
at org.apache.maven.lifecycle.internal.LifecycleModuleBuilder.buildProject(LifecycleModuleBuilder.java:59)
at org.apache.maven.lifecycle.internal.LifecycleStarter.singleThreadedBuild(LifecycleStarter.java:183)
at org.apache.maven.lifecycle.internal.LifecycleStarter.execute(LifecycleStarter.java:161)
at org.apache.maven.DefaultMaven.doExecute(DefaultMaven.java:320)
at org.apache.maven.DefaultMaven.execute(DefaultMaven.java:156)
at org.jvnet.hudson.maven3.launcher.Maven3Launcher.main(Maven3Launcher.java:117)
at sun.reflect.NativeMethodAccessorImpl.invoke0(Native Method)
at sun.reflect.NativeMethodAccessorImpl.invoke(NativeMethodAccessorImpl.java:39)
at sun.reflect.DelegatingMethodAccessorImpl.invoke(DelegatingMethodAccessorImpl.java:25)
at java.lang.reflect.Method.invoke(Method.java:597)
at org.codehaus.plexus.classworlds.launcher.Launcher.launchStandard(Launcher.java:329)
at org.codehaus.plexus.classworlds.launcher.Launcher.launch(Launcher.java:239)
at org.jvnet.hudson.maven3.agent.Maven3Main.launch(Maven3Main.java:178)
at sun.reflect.NativeMethodAccessorImpl.invoke0(Native Method)
at sun.reflect.NativeMethodAccessorImpl.invoke(NativeMethodAccessorImpl.java:39)
at sun.reflect.DelegatingMethodAccessorImpl.invoke(DelegatingMethodAccessorImpl.java:25)
at java.lang.reflect.Method.invoke(Method.java:597)
at hudson.maven.Maven3Builder.call(Maven3Builder.java:134)
at hudson.maven.Maven3Builder.call(Maven3Builder.java:69)
at hudson.remoting.UserRequest.perform(UserRequest.java:118)
at hudson.remoting.UserRequest.perform(UserRequest.java:48)
at hudson.remoting.Request$2.run(Request.java:328)
at hudson.remoting.InterceptingExecutorService$1.call(InterceptingExecutorService.java:72)
at java.util.concurrent.FutureTask$Sync.innerRun(FutureTask.java:303)
at java.util.concurrent.FutureTask.run(FutureTask.java:138)
at java.util.concurrent.ThreadPoolExecutor$Worker.runTask(ThreadPoolExecutor.java:895)
at java.util.concurrent.ThreadPoolExecutor$Worker.run(ThreadPoolExecutor.java:918)
at java.lang.Thread.run(Thread.java:662)
Caused by: java.lang.UnsupportedClassVersionError: org/ops4j/pax/exam/karaf/options/KarafDistributionOption : Unsupported major.minor version 51.0
at java.lang.ClassLoader.defineClass1(Native Method)
at java.lang.ClassLoader.defineClassCond(ClassLoader.java:631)
at java.lang.ClassLoader.defineClass(ClassLoader.java:615)
at java.security.SecureClassLoader.defineClass(SecureClassLoader.java:141)
at java.net.URLClassLoader.defineClass(URLClassLoader.java:283)
at java.net.URLClassLoader.access$000(URLClassLoader.java:58)
at java.net.URLClassLoader$1.run(URLClassLoader.java:197)
at java.security.AccessController.doPrivileged(Native Method)
at java.net.URLClassLoader.findClass(URLClassLoader.java:190)
at java.lang.ClassLoader.loadClass(ClassLoader.java:306)
at java.lang.ClassLoader.loadClass(ClassLoader.java:247)
at org.apache.sling.launchpad.karaf.tests.configuration.SlingLaunchpadConfiguration.configuration(SlingLaunchpadConfiguration.java:85)
... 40 more
[JENKINS] Archiving disabled
[INFO] ------------------------------------------------------------------------
[INFO] Reactor Summary:
[INFO]
[INFO] Apache Sling Authentication XING API .............. SUCCESS [41.982s]
[INFO] Apache Sling Authentication XING Login ............ SUCCESS [11.762s]
[INFO] Apache Sling Authentication XING OAuth ............ SUCCESS [11.894s]
[INFO] Apache Sling Commons FileSystem ClassLoader ....... SUCCESS [8.671s]
[INFO] Apache Sling Commons HTML Utilities ............... SUCCESS [5.919s]
[INFO] Apache Sling APT parser ........................... SUCCESS [12.102s]
[INFO] Apache Sling APT servlet .......................... SUCCESS [8.836s]
[INFO] Apache Sling Resource Collection API .............. SUCCESS [11.982s]
[INFO] Apache Sling ClassLoader Leak Detector ............ SUCCESS [3.692s]
[INFO] Apache Sling SLF4J MDC Filter ..................... SUCCESS [24.683s]
[INFO] Apache Sling DataSource Provider .................. SUCCESS [18.278s]
[INFO] Apache Sling Dojo JavaScript Library .............. SUCCESS [11.634s]
[INFO] Apache Sling Dojo Data Extension .................. SUCCESS [6.083s]
[INFO] Apache Sling FTP Server ........................... SUCCESS [11.629s]
[INFO] Apache Sling Google Web Toolkit Servlet Library ... SUCCESS [11.652s]
[INFO] Apache Sling Google Web Toolkit Sample ............ SUCCESS [42.137s]
[INFO] Apache Sling Internationalization Support ......... SUCCESS [26.500s]
[INFO] Apache Sling JMX Resource Provider ................ SUCCESS [5.873s]
[INFO] Apache Sling MongoDB Resource Provider ............ SUCCESS [5.847s]
[INFO] Apache Sling OSGi Bundle Repository ............... SUCCESS [12.116s]
[INFO] Apache Sling Request Processing Analyzer .......... SUCCESS [9.106s]
[INFO] Apache Sling Resource Merger ...................... SUCCESS [4.097s]
[INFO] Apache Sling Rewriter ............................. SUCCESS [8.845s]
[INFO] Apache Sling Tenant ............................... SUCCESS [6.335s]
[INFO] Apache Sling Replication .......................... SUCCESS [20.891s]
[INFO] Apache Sling Replication Integration Tests ........ SUCCESS [2:39.603s]
[INFO] sling-query ....................................... SUCCESS [11.957s]
[INFO] Apache Sling JCR Java Compiler .................... SUCCESS [5.908s]
[INFO] Apache Sling Repository Accessor .................. SUCCESS [6.054s]
[INFO] Apache Sling Object Content Mapping ............... SUCCESS [12.224s]
[INFO] Apache Sling JCR Prefs ............................ SUCCESS [11.089s]
[INFO] Apache Sling JCR Resource Security ................ SUCCESS [3.620s]
[INFO] Apache Sling Launchpad Karaf ...................... SUCCESS [5.884s]
[INFO] Apache Sling Launchpad Karaf - Features ........... SUCCESS [9.024s]
[INFO] Apache Sling Launchpad Karaf - Integration Tests .. SUCCESS [21:44.791s]
[INFO] Apache Sling Launchpad Karaf - Launchpad Integration Tests FAILURE [14.961s]
[INFO] Apache Sling Launchpad Karaf Builder .............. SKIPPED
[INFO] Apache Sling Launchpad Contrib Testing ............ SKIPPED
[INFO] Apache Sling Script Console ....................... SKIPPED
[INFO] Apache Sling Atom Tag Library ..................... SKIPPED
[INFO] Apache Sling Scripting Freemarker Support ......... SKIPPED
[INFO] Apache Sling Scripting Java Support ............... SKIPPED
[INFO] Apache Sling Scripting JST Support ................ SKIPPED
[INFO] Apache Sling Scripting Python Support ............. SKIPPED
[INFO] Apache Sling Scripting Ruby Support ............... SKIPPED
[INFO] Apache Sling Scripting Velocity Support ........... SKIPPED
[INFO] Apache Sling Scripting W3C XML Processing Support . SKIPPED
[INFO] Scala Script Engine ............................... SKIPPED
[INFO] Apache Sling Scala Scripting Configuration ........ SKIPPED
[INFO] Scala for Sling Demo Application - Hello World .... SKIPPED
[INFO] Scala for Sling Demo Application - Forum .......... SKIPPED
[INFO] Apache Sling Contrib (Builder) .................... SKIPPED
[INFO] ------------------------------------------------------------------------
[INFO] BUILD FAILURE
[INFO] ------------------------------------------------------------------------
[INFO] Total time: 32:16.306s
[INFO] Finished at: Fri Aug 08 17:04:10 UTC 2014
[INFO] Final Memory: 96M/195M
[INFO] ------------------------------------------------------------------------
[JENKINS] Archiving disabled
[JENKINS] Archiving disabled
[JENKINS] Archiving disabled
[JENKINS] Archiving disabled
[JENKINS] Archiving disabled
[JENKINS] Archiving disabled
[JENKINS] Archiving disabled
[JENKINS] Archiving disabled
[JENKINS] Archiving disabled
[JENKINS] Archiving disabled
[JENKINS] Archiving disabled
[JENKINS] Archiving disabled
[JENKINS] Archiving disabled
[JENKINS] Archiving disabled
[JENKINS] Archiving disabled
[JENKINS] Archiving disabled
[JENKINS] Archiving disabled
[JENKINS] Archiving disabled
[JENKINS] Archiving disabled
[JENKINS] Archiving disabled
[JENKINS] Archiving disabled
[JENKINS] Archiving disabled
[JENKINS] Archiving disabled
[JENKINS] Archiving disabled
[JENKINS] Archiving disabled
[JENKINS] Archiving disabled
[JENKINS] Archiving disabled
[JENKINS] Archiving disabled
[JENKINS] Archiving disabled
[JENKINS] Archiving disabled
[JENKINS] Archiving disabled
[JENKINS] Archiving disabled
[JENKINS] Archiving disabled
[JENKINS] Archiving disabled
[JENKINS] Archiving disabled
[JENKINS] Archiving disabled
[JENKINS] Archiving disabled
[JENKINS] Archiving disabled
[JENKINS] Archiving disabled
[JENKINS] Archiving disabled
[JENKINS] Archiving disabled
[JENKINS] Archiving disabled
[JENKINS] Archiving disabled
[JENKINS] Archiving disabled
[JENKINS] Archiving disabled
[JENKINS] Archiving disabled
[JENKINS] Archiving disabled
[JENKINS] Archiving disabled
[JENKINS] Archiving disabled
[JENKINS] Archiving disabled
[JENKINS] Archiving disabled
[JENKINS] Archiving disabled[WARNING] The requested profile "jcrinstall-tests" could not be activated because it does not exist.
Waiting for Jenkins to finish collecting data
[ERROR] Failed to execute goal org.ops4j.pax.exam:exam-maven-plugin:3.4.0:start-container (default) on project org.apache.sling.launchpad.karaf-launchpad-integration-tests: Failed to start Pax Exam server for org.apache.sling.launchpad.karaf.tests.configuration.SlingLaunchpadConfiguration: InvocationTargetException: org/ops4j/pax/exam/karaf/options/KarafDistributionOption : Unsupported major.minor version 51.0 -> [Help 1]
[ERROR]
[ERROR] To see the full stack trace of the errors, re-run Maven with the -e switch.
[ERROR] Re-run Maven using the -X switch to enable full debug logging.
[ERROR]
[ERROR] For more information about the errors and possible solutions, please read the following articles:
[ERROR] [Help 1] http://cwiki.apache.org/confluence/display/MAVEN/MojoExecutionException
[ERROR]
[ERROR] After correcting the problems, you can resume the build with the command
[ERROR] mvn <goals> -rf :org.apache.sling.launchpad.karaf-launchpad-integration-tests
Sending e-mails to: dev@sling.apache.org
Sending e-mails to: dev@sling.apache.org
channel stopped
[locks-and-latches] Releasing all the locks
[locks-and-latches] All the locks released
Build failed in Jenkins: sling-contrib-1.6 #1206
Posted by Apache Jenkins Server <je...@builds.apache.org>.
See <https://builds.apache.org/job/sling-contrib-1.6/1206/changes>
Changes:
[bdelacretaz] exit.iftrue command added for warmup runs
[olli] SLING-3017 update Pax Exam to 4.1.0, add profile for integration tests (>= JDK 1.7), update Maven Failsafe Plugin to 2.17
[olli] SLING-3821 enable more tests
[olli] SLING-3027 use latest releases (Sling Auth Core, Sling Auth Form, Sling Auth OpenID, Sling Auth Selector, Sling Commons MIME, Sling Commons OSGi, Sling Discovery Impl, Sling Event)
[olli] SLING-3027 SLING-3017 Sling Event: service classes not testable (cleanup)
------------------------------------------
[...truncated 4234 lines...]
[INFO]
[INFO] --- maven-antrun-plugin:1.7:run (set-bundle-required-execution-environment) @ org.apache.sling.launchpad.karaf-launchpad-integration-tests ---
[INFO] Executing tasks
main:
[INFO] Executed tasks
[INFO]
[INFO] --- maven-remote-resources-plugin:1.5:process (default) @ org.apache.sling.launchpad.karaf-launchpad-integration-tests ---
[INFO]
[INFO] --- maven-resources-plugin:2.6:resources (default-resources) @ org.apache.sling.launchpad.karaf-launchpad-integration-tests ---
[INFO] Using 'UTF-8' encoding to copy filtered resources.
[INFO] skip non existing resourceDirectory <https://builds.apache.org/job/sling-contrib-1.6/ws/contrib-1.6/launchpad/karaf/org.apache.sling.launchpad.karaf-launchpad-integration-tests/src/main/resources>
[INFO] Copying 3 resources
[INFO]
[INFO] --- maven-antrun-plugin:1.7:run (check-memory-task) @ org.apache.sling.launchpad.karaf-launchpad-integration-tests ---
[INFO] Executing tasks
main:
[echo] **************** WARNING (SLING-443/SLING-1782) ******************************
[echo] On most platforms, you'll get OutOfMemoryErrors when building unless you set
[echo] on 32bit platforms: MAVEN_OPTS="-Xmx256M -XX:MaxPermSize=256M", see SLING-443
[echo] on 64bit platforms: MAVEN_OPTS="-Xmx512M -XX:MaxPermSize=512M", see SLING-1782
[echo] ******************************************************************************
[INFO] Executed tasks
[INFO]
[INFO] --- maven-compiler-plugin:3.1:compile (default-compile) @ org.apache.sling.launchpad.karaf-launchpad-integration-tests ---
[INFO] No sources to compile
[INFO]
[INFO] --- maven-resources-plugin:2.6:testResources (default-testResources) @ org.apache.sling.launchpad.karaf-launchpad-integration-tests ---
[INFO] Using 'UTF-8' encoding to copy filtered resources.
[INFO] skip non existing resourceDirectory <https://builds.apache.org/job/sling-contrib-1.6/ws/contrib-1.6/launchpad/karaf/org.apache.sling.launchpad.karaf-launchpad-integration-tests/src/test/resources>
[INFO] Copying 3 resources
[INFO]
[INFO] --- maven-compiler-plugin:3.1:testCompile (default-testCompile) @ org.apache.sling.launchpad.karaf-launchpad-integration-tests ---
[INFO] Changes detected - recompiling the module!
[INFO] Compiling 1 source file to <https://builds.apache.org/job/sling-contrib-1.6/ws/contrib-1.6/launchpad/karaf/org.apache.sling.launchpad.karaf-launchpad-integration-tests/target/test-classes>
[INFO]
[INFO] --- maven-surefire-plugin:2.16:test (default-test) @ org.apache.sling.launchpad.karaf-launchpad-integration-tests ---
[JENKINS] Recording test results[INFO]
[INFO] --- animal-sniffer-maven-plugin:1.11:check (default) @ org.apache.sling.launchpad.karaf-launchpad-integration-tests ---
[INFO] Checking unresolved references to org.codehaus.mojo.signature:java15:1.0
[INFO]
[INFO] --- maven-bundle-plugin:2.4.0:bundle (default-bundle) @ org.apache.sling.launchpad.karaf-launchpad-integration-tests ---
[WARNING] Bundle org.apache.sling:org.apache.sling.launchpad.karaf-launchpad-integration-tests:bundle:0.0.1-SNAPSHOT : Unused Private-Package instructions, no such package(s) on the class path: [!*]
[INFO]
[INFO] --- maven-enforcer-plugin:1.3.1:enforce (enforce-java) @ org.apache.sling.launchpad.karaf-launchpad-integration-tests ---
[INFO]
[INFO] --- maven-antrun-plugin:1.7:run (set-bundle-required-execution-environment) @ org.apache.sling.launchpad.karaf-launchpad-integration-tests ---
[INFO] Executing tasks
main:
[INFO] Executed tasks
[WARNING] Failed to getClass for org.apache.maven.plugin.source.SourceJarMojo
[INFO]
[INFO] --- maven-source-plugin:2.2.1:jar (attach-sources) @ org.apache.sling.launchpad.karaf-launchpad-integration-tests ---
[INFO] Building jar: <https://builds.apache.org/job/sling-contrib-1.6/ws/contrib-1.6/launchpad/karaf/org.apache.sling.launchpad.karaf-launchpad-integration-tests/target/org.apache.sling.launchpad.karaf-launchpad-integration-tests-0.0.1-SNAPSHOT-sources.jar>
[INFO]
[INFO] --- maven-site-plugin:3.3:attach-descriptor (attach-descriptor) @ org.apache.sling.launchpad.karaf-launchpad-integration-tests ---
[INFO]
[INFO] --- exam-maven-plugin:3.4.0:start-container (default) @ org.apache.sling.launchpad.karaf-launchpad-integration-tests ---
[ERROR]
java.lang.reflect.InvocationTargetException
at sun.reflect.NativeMethodAccessorImpl.invoke0(Native Method)
at sun.reflect.NativeMethodAccessorImpl.invoke(NativeMethodAccessorImpl.java:39)
at sun.reflect.DelegatingMethodAccessorImpl.invoke(DelegatingMethodAccessorImpl.java:25)
at java.lang.reflect.Method.invoke(Method.java:597)
at org.ops4j.pax.exam.maven.StartContainerMojo.getConfigurationOptions(StartContainerMojo.java:158)
at org.ops4j.pax.exam.maven.StartContainerMojo.run(StartContainerMojo.java:142)
at org.ops4j.pax.exam.maven.StartContainerMojo.execute(StartContainerMojo.java:108)
at org.apache.maven.plugin.DefaultBuildPluginManager.executeMojo(DefaultBuildPluginManager.java:101)
at org.apache.maven.lifecycle.internal.MojoExecutor.execute(MojoExecutor.java:209)
at org.apache.maven.lifecycle.internal.MojoExecutor.execute(MojoExecutor.java:153)
at org.apache.maven.lifecycle.internal.MojoExecutor.execute(MojoExecutor.java:145)
at org.apache.maven.lifecycle.internal.LifecycleModuleBuilder.buildProject(LifecycleModuleBuilder.java:84)
at org.apache.maven.lifecycle.internal.LifecycleModuleBuilder.buildProject(LifecycleModuleBuilder.java:59)
at org.apache.maven.lifecycle.internal.LifecycleStarter.singleThreadedBuild(LifecycleStarter.java:183)
at org.apache.maven.lifecycle.internal.LifecycleStarter.execute(LifecycleStarter.java:161)
at org.apache.maven.DefaultMaven.doExecute(DefaultMaven.java:320)
at org.apache.maven.DefaultMaven.execute(DefaultMaven.java:156)
at org.jvnet.hudson.maven3.launcher.Maven3Launcher.main(Maven3Launcher.java:117)
at sun.reflect.NativeMethodAccessorImpl.invoke0(Native Method)
at sun.reflect.NativeMethodAccessorImpl.invoke(NativeMethodAccessorImpl.java:39)
at sun.reflect.DelegatingMethodAccessorImpl.invoke(DelegatingMethodAccessorImpl.java:25)
at java.lang.reflect.Method.invoke(Method.java:597)
at org.codehaus.plexus.classworlds.launcher.Launcher.launchStandard(Launcher.java:329)
at org.codehaus.plexus.classworlds.launcher.Launcher.launch(Launcher.java:239)
at org.jvnet.hudson.maven3.agent.Maven3Main.launch(Maven3Main.java:178)
at sun.reflect.NativeMethodAccessorImpl.invoke0(Native Method)
at sun.reflect.NativeMethodAccessorImpl.invoke(NativeMethodAccessorImpl.java:39)
at sun.reflect.DelegatingMethodAccessorImpl.invoke(DelegatingMethodAccessorImpl.java:25)
at java.lang.reflect.Method.invoke(Method.java:597)
at hudson.maven.Maven3Builder.call(Maven3Builder.java:134)
at hudson.maven.Maven3Builder.call(Maven3Builder.java:69)
at hudson.remoting.UserRequest.perform(UserRequest.java:118)
at hudson.remoting.UserRequest.perform(UserRequest.java:48)
at hudson.remoting.Request$2.run(Request.java:328)
at hudson.remoting.InterceptingExecutorService$1.call(InterceptingExecutorService.java:72)
at java.util.concurrent.FutureTask$Sync.innerRun(FutureTask.java:303)
at java.util.concurrent.FutureTask.run(FutureTask.java:138)
at java.util.concurrent.ThreadPoolExecutor$Worker.runTask(ThreadPoolExecutor.java:895)
at java.util.concurrent.ThreadPoolExecutor$Worker.run(ThreadPoolExecutor.java:918)
at java.lang.Thread.run(Thread.java:662)
Caused by: java.lang.UnsupportedClassVersionError: org/ops4j/pax/exam/karaf/options/KarafDistributionOption : Unsupported major.minor version 51.0
at java.lang.ClassLoader.defineClass1(Native Method)
at java.lang.ClassLoader.defineClassCond(ClassLoader.java:631)
at java.lang.ClassLoader.defineClass(ClassLoader.java:615)
at java.security.SecureClassLoader.defineClass(SecureClassLoader.java:141)
at java.net.URLClassLoader.defineClass(URLClassLoader.java:283)
at java.net.URLClassLoader.access$000(URLClassLoader.java:58)
at java.net.URLClassLoader$1.run(URLClassLoader.java:197)
at java.security.AccessController.doPrivileged(Native Method)
at java.net.URLClassLoader.findClass(URLClassLoader.java:190)
at java.lang.ClassLoader.loadClass(ClassLoader.java:306)
at java.lang.ClassLoader.loadClass(ClassLoader.java:247)
at org.apache.sling.launchpad.karaf.tests.configuration.SlingLaunchpadConfiguration.configuration(SlingLaunchpadConfiguration.java:85)
... 40 more
[JENKINS] Archiving disabled
[INFO] ------------------------------------------------------------------------
[INFO] Reactor Summary:
[INFO]
[INFO] Apache Sling Authentication XING API .............. SUCCESS [47.780s]
[INFO] Apache Sling Authentication XING Login ............ SUCCESS [15.369s]
[INFO] Apache Sling Authentication XING OAuth ............ SUCCESS [11.732s]
[INFO] Apache Sling Commons FileSystem ClassLoader ....... SUCCESS [8.422s]
[INFO] Apache Sling Commons HTML Utilities ............... SUCCESS [7.956s]
[INFO] Apache Sling APT parser ........................... SUCCESS [14.923s]
[INFO] Apache Sling APT servlet .......................... SUCCESS [7.861s]
[INFO] Apache Sling Resource Collection API .............. SUCCESS [10.016s]
[INFO] Apache Sling ClassLoader Leak Detector ............ SUCCESS [6.668s]
[INFO] Apache Sling SLF4J MDC Filter ..................... SUCCESS [30.173s]
[INFO] Apache Sling DataSource Provider .................. SUCCESS [23.529s]
[INFO] Apache Sling Dojo JavaScript Library .............. SUCCESS [15.087s]
[INFO] Apache Sling Dojo Data Extension .................. SUCCESS [8.377s]
[INFO] Apache Sling FTP Server ........................... SUCCESS [11.720s]
[INFO] Apache Sling Google Web Toolkit Servlet Library ... SUCCESS [18.328s]
[INFO] Apache Sling Google Web Toolkit Sample ............ SUCCESS [1:39.376s]
[INFO] Apache Sling Internationalization Support ......... SUCCESS [41.459s]
[INFO] Apache Sling JMX Resource Provider ................ SUCCESS [8.132s]
[INFO] Apache Sling MongoDB Resource Provider ............ SUCCESS [8.222s]
[INFO] Apache Sling OSGi Bundle Repository ............... SUCCESS [14.750s]
[INFO] Apache Sling Request Processing Analyzer .......... SUCCESS [9.244s]
[INFO] Apache Sling Resource Merger ...................... SUCCESS [9.153s]
[INFO] Apache Sling Rewriter ............................. SUCCESS [11.603s]
[INFO] Apache Sling Tenant ............................... SUCCESS [11.391s]
[INFO] Apache Sling Replication .......................... SUCCESS [23.654s]
[INFO] Apache Sling Replication Integration Tests ........ SUCCESS [3:11.719s]
[INFO] sling-query ....................................... SUCCESS [16.956s]
[INFO] Apache Sling JCR Java Compiler .................... SUCCESS [14.212s]
[INFO] Apache Sling Repository Accessor .................. SUCCESS [8.512s]
[INFO] Apache Sling Object Content Mapping ............... SUCCESS [12.774s]
[INFO] Apache Sling JCR Prefs ............................ SUCCESS [6.907s]
[INFO] Apache Sling JCR Resource Security ................ SUCCESS [8.723s]
[INFO] Apache Sling Launchpad Karaf ...................... SUCCESS [8.623s]
[INFO] Apache Sling Launchpad Karaf - Features ........... SUCCESS [9.380s]
[INFO] Apache Sling Launchpad Karaf - Integration Tests .. SUCCESS [30.271s]
[INFO] Apache Sling Launchpad Karaf - Launchpad Integration Tests FAILURE [12.533s]
[INFO] Apache Sling Launchpad Karaf Builder .............. SKIPPED
[INFO] Apache Sling Launchpad Contrib Testing ............ SKIPPED
[INFO] Apache Sling Script Console ....................... SKIPPED
[INFO] Apache Sling Atom Tag Library ..................... SKIPPED
[INFO] Apache Sling Scripting Freemarker Support ......... SKIPPED
[INFO] Apache Sling Scripting Java Support ............... SKIPPED
[INFO] Apache Sling Scripting JST Support ................ SKIPPED
[INFO] Apache Sling Scripting Python Support ............. SKIPPED
[INFO] Apache Sling Scripting Ruby Support ............... SKIPPED
[INFO] Apache Sling Scripting Velocity Support ........... SKIPPED
[INFO] Apache Sling Scripting W3C XML Processing Support . SKIPPED
[INFO] Scala Script Engine ............................... SKIPPED
[INFO] Apache Sling Scala Scripting Configuration ........ SKIPPED
[INFO] Scala for Sling Demo Application - Hello World .... SKIPPED
[INFO] Scala for Sling Demo Application - Forum .......... SKIPPED
[INFO] Apache Sling Contrib (Builder) .................... SKIPPED
[INFO] ------------------------------------------------------------------------
[INFO] BUILD FAILURE
[INFO] ------------------------------------------------------------------------
[INFO] Total time: 13:59.961s
[INFO] Finished at: Wed Aug 20 18:05:39 UTC 2014
[INFO] Final Memory: 91M/190M
[INFO] ------------------------------------------------------------------------
[JENKINS] Archiving disabled
[JENKINS] Archiving disabled
[JENKINS] Archiving disabled
[JENKINS] Archiving disabled
[JENKINS] Archiving disabled
[JENKINS] Archiving disabled
[JENKINS] Archiving disabled
[JENKINS] Archiving disabled
[JENKINS] Archiving disabled
[JENKINS] Archiving disabled
[JENKINS] Archiving disabled
[JENKINS] Archiving disabled
[JENKINS] Archiving disabled
[JENKINS] Archiving disabled
[JENKINS] Archiving disabled
[JENKINS] Archiving disabled
[JENKINS] Archiving disabled
[JENKINS] Archiving disabled
[JENKINS] Archiving disabled
[JENKINS] Archiving disabled
[JENKINS] Archiving disabled
[JENKINS] Archiving disabled
[JENKINS] Archiving disabled
[JENKINS] Archiving disabled
[JENKINS] Archiving disabled
[JENKINS] Archiving disabled
[JENKINS] Archiving disabled
[JENKINS] Archiving disabled
[JENKINS] Archiving disabled
[JENKINS] Archiving disabled
[JENKINS] Archiving disabled
[JENKINS] Archiving disabled
[JENKINS] Archiving disabled
[JENKINS] Archiving disabled
[JENKINS] Archiving disabled
[JENKINS] Archiving disabled
[JENKINS] Archiving disabled
[JENKINS] Archiving disabled
[JENKINS] Archiving disabled
[JENKINS] Archiving disabled
[JENKINS] Archiving disabled
[JENKINS] Archiving disabled
[JENKINS] Archiving disabled
[JENKINS] Archiving disabled
[JENKINS] Archiving disabled
[JENKINS] Archiving disabled
[JENKINS] Archiving disabled
[JENKINS] Archiving disabled
[JENKINS] Archiving disabled
[JENKINS] Archiving disabled
[JENKINS] Archiving disabled
[JENKINS] Archiving disabled[WARNING] The requested profile "jcrinstall-tests" could not be activated because it does not exist.
[ERROR] Failed to execute goal org.ops4j.pax.exam:exam-maven-plugin:3.4.0:start-container (default) on project org.apache.sling.launchpad.karaf-launchpad-integration-tests: Failed to start Pax Exam server for org.apache.sling.launchpad.karaf.tests.configuration.SlingLaunchpadConfiguration: InvocationTargetException: org/ops4j/pax/exam/karaf/options/KarafDistributionOption : Unsupported major.minor version 51.0 -> [Help 1]
Waiting for Jenkins to finish collecting data[ERROR]
[ERROR] To see the full stack trace of the errors, re-run Maven with the -e switch.
[ERROR] Re-run Maven using the -X switch to enable full debug logging.
[ERROR]
[ERROR] For more information about the errors and possible solutions, please read the following articles:
[ERROR] [Help 1] http://cwiki.apache.org/confluence/display/MAVEN/MojoExecutionException
[ERROR]
[ERROR] After correcting the problems, you can resume the build with the command
[ERROR] mvn <goals> -rf :org.apache.sling.launchpad.karaf-launchpad-integration-tests
Sending e-mails to: dev@sling.apache.org
Sending e-mails to: dev@sling.apache.org
channel stopped
[locks-and-latches] Releasing all the locks
[locks-and-latches] All the locks released
Build failed in Jenkins: sling-contrib-1.6 #1205
Posted by Apache Jenkins Server <je...@builds.apache.org>.
See <https://builds.apache.org/job/sling-contrib-1.6/1205/>
------------------------------------------
[...truncated 227 lines...]
at org.tmatesoft.svn.core.internal.util.SVNSocketFactory.createPlainSocket(SVNSocketFactory.java:73)
at org.tmatesoft.svn.core.internal.io.dav.http.HTTPConnection.connect(HTTPConnection.java:280)
at org.tmatesoft.svn.core.internal.io.dav.http.HTTPConnection._request(HTTPConnection.java:451)
... 35 more
ERROR: Subversion update failed
java.io.IOException: remote file operation failed: <https://builds.apache.org/job/sling-contrib-1.6/ws/> at hudson.remoting.Channel@6f0a1dfe:ubuntu-5
at hudson.FilePath.act(FilePath.java:910)
at hudson.FilePath.act(FilePath.java:887)
at hudson.scm.SubversionSCM.checkout(SubversionSCM.java:936)
at hudson.scm.SubversionSCM.checkout(SubversionSCM.java:871)
at hudson.model.AbstractProject.checkout(AbstractProject.java:1414)
at hudson.model.AbstractBuild$AbstractBuildExecution.defaultCheckout(AbstractBuild.java:671)
at jenkins.scm.SCMCheckoutStrategy.checkout(SCMCheckoutStrategy.java:88)
at hudson.model.AbstractBuild$AbstractBuildExecution.run(AbstractBuild.java:580)
at hudson.model.Run.execute(Run.java:1676)
at hudson.maven.MavenModuleSetBuild.run(MavenModuleSetBuild.java:529)
at hudson.model.ResourceController.execute(ResourceController.java:88)
at hudson.model.Executor.run(Executor.java:231)
Caused by: java.io.IOException
at hudson.scm.subversion.UpdateUpdater$TaskImpl.perform(UpdateUpdater.java:211)
at hudson.scm.subversion.WorkspaceUpdater$UpdateTask.delegateTo(WorkspaceUpdater.java:161)
at hudson.scm.SubversionSCM$CheckOutTask.perform(SubversionSCM.java:1030)
at hudson.scm.SubversionSCM$CheckOutTask.invoke(SubversionSCM.java:1011)
at hudson.scm.SubversionSCM$CheckOutTask.invoke(SubversionSCM.java:987)
at hudson.FilePath$FileCallableWrapper.call(FilePath.java:2462)
at hudson.remoting.UserRequest.perform(UserRequest.java:118)
at hudson.remoting.UserRequest.perform(UserRequest.java:48)
at hudson.remoting.Request$2.run(Request.java:328)
at hudson.remoting.InterceptingExecutorService$1.call(InterceptingExecutorService.java:72)
at java.util.concurrent.FutureTask.run(FutureTask.java:262)
at java.util.concurrent.ThreadPoolExecutor.runWorker(ThreadPoolExecutor.java:1145)
at java.util.concurrent.ThreadPoolExecutor$Worker.run(ThreadPoolExecutor.java:615)
at java.lang.Thread.run(Thread.java:745)
Caused by: hudson.scm.subversion.UpdaterException: failed to perform svn update
... 14 more
Caused by: org.tmatesoft.svn.core.SVNException: svn: E175002: OPTIONS /repos/asf/sling/trunk/contrib failed
at org.tmatesoft.svn.core.internal.io.dav.http.HTTPConnection.request(HTTPConnection.java:388)
at org.tmatesoft.svn.core.internal.io.dav.http.HTTPConnection.request(HTTPConnection.java:373)
at org.tmatesoft.svn.core.internal.io.dav.http.HTTPConnection.request(HTTPConnection.java:361)
at org.tmatesoft.svn.core.internal.io.dav.DAVConnection.performHttpRequest(DAVConnection.java:707)
at org.tmatesoft.svn.core.internal.io.dav.DAVConnection.exchangeCapabilities(DAVConnection.java:627)
at org.tmatesoft.svn.core.internal.io.dav.DAVConnection.open(DAVConnection.java:102)
at org.tmatesoft.svn.core.internal.io.dav.DAVRepository.openConnection(DAVRepository.java:1020)
at org.tmatesoft.svn.core.internal.io.dav.DAVRepository.getRepositoryUUID(DAVRepository.java:148)
at org.tmatesoft.svn.core.internal.wc16.SVNBasicDelegate.createRepository(SVNBasicDelegate.java:339)
at org.tmatesoft.svn.core.internal.wc16.SVNBasicDelegate.createRepository(SVNBasicDelegate.java:328)
at org.tmatesoft.svn.core.internal.wc16.SVNUpdateClient16.update(SVNUpdateClient16.java:482)
at org.tmatesoft.svn.core.internal.wc16.SVNUpdateClient16.doUpdate(SVNUpdateClient16.java:364)
at org.tmatesoft.svn.core.internal.wc16.SVNUpdateClient16.doUpdate(SVNUpdateClient16.java:274)
at org.tmatesoft.svn.core.internal.wc2.old.SvnOldUpdate.run(SvnOldUpdate.java:27)
at org.tmatesoft.svn.core.internal.wc2.old.SvnOldUpdate.run(SvnOldUpdate.java:11)
at org.tmatesoft.svn.core.internal.wc2.SvnOperationRunner.run(SvnOperationRunner.java:20)
at org.tmatesoft.svn.core.wc2.SvnOperationFactory.run(SvnOperationFactory.java:1238)
at org.tmatesoft.svn.core.wc2.SvnOperation.run(SvnOperation.java:294)
at org.tmatesoft.svn.core.wc.SVNUpdateClient.doUpdate(SVNUpdateClient.java:311)
at org.tmatesoft.svn.core.wc.SVNUpdateClient.doUpdate(SVNUpdateClient.java:291)
at org.tmatesoft.svn.core.wc.SVNUpdateClient.doUpdate(SVNUpdateClient.java:387)
at hudson.scm.subversion.UpdateUpdater$TaskImpl.perform(UpdateUpdater.java:157)
... 13 more
Caused by: svn: E175002: OPTIONS /repos/asf/sling/trunk/contrib failed
at org.tmatesoft.svn.core.SVNErrorMessage.create(SVNErrorMessage.java:208)
at org.tmatesoft.svn.core.SVNErrorMessage.create(SVNErrorMessage.java:154)
at org.tmatesoft.svn.core.SVNErrorMessage.create(SVNErrorMessage.java:97)
... 35 more
Caused by: org.tmatesoft.svn.core.SVNException: svn: E175002: OPTIONS request failed on '/repos/asf/sling/trunk/contrib'
svn: E175002: timed out waiting for server
at org.tmatesoft.svn.core.internal.wc.SVNErrorManager.error(SVNErrorManager.java:64)
at org.tmatesoft.svn.core.internal.wc.SVNErrorManager.error(SVNErrorManager.java:51)
at org.tmatesoft.svn.core.internal.io.dav.http.HTTPConnection._request(HTTPConnection.java:777)
at org.tmatesoft.svn.core.internal.io.dav.http.HTTPConnection.request(HTTPConnection.java:382)
... 34 more
Caused by: svn: E175002: OPTIONS request failed on '/repos/asf/sling/trunk/contrib'
at org.tmatesoft.svn.core.SVNErrorMessage.create(SVNErrorMessage.java:208)
at org.tmatesoft.svn.core.internal.io.dav.http.HTTPConnection._request(HTTPConnection.java:775)
... 35 more
Caused by: svn: E175002: timed out waiting for server
at org.tmatesoft.svn.core.SVNErrorMessage.create(SVNErrorMessage.java:208)
at org.tmatesoft.svn.core.internal.io.dav.http.HTTPConnection._request(HTTPConnection.java:514)
... 35 more
Caused by: java.net.SocketTimeoutException: connect timed out
at java.net.PlainSocketImpl.socketConnect(Native Method)
at java.net.AbstractPlainSocketImpl.doConnect(AbstractPlainSocketImpl.java:339)
at java.net.AbstractPlainSocketImpl.connectToAddress(AbstractPlainSocketImpl.java:200)
at java.net.AbstractPlainSocketImpl.connect(AbstractPlainSocketImpl.java:182)
at java.net.SocksSocketImpl.connect(SocksSocketImpl.java:392)
at java.net.Socket.connect(Socket.java:579)
at org.tmatesoft.svn.core.internal.util.SVNSocketFactory.connect(SVNSocketFactory.java:146)
at org.tmatesoft.svn.core.internal.util.SVNSocketFactory.createPlainSocket(SVNSocketFactory.java:73)
at org.tmatesoft.svn.core.internal.io.dav.http.HTTPConnection.connect(HTTPConnection.java:280)
at org.tmatesoft.svn.core.internal.io.dav.http.HTTPConnection._request(HTTPConnection.java:451)
... 35 more
Retrying after 10 seconds
Updating http://svn.apache.org/repos/asf/sling/trunk/contrib at revision '2014-08-19T23:29:12.191 +0000'
ERROR: Failed to update http://svn.apache.org/repos/asf/sling/trunk/contrib
org.tmatesoft.svn.core.SVNException: svn: E175002: OPTIONS /repos/asf/sling/trunk/contrib failed
at org.tmatesoft.svn.core.internal.io.dav.http.HTTPConnection.request(HTTPConnection.java:388)
at org.tmatesoft.svn.core.internal.io.dav.http.HTTPConnection.request(HTTPConnection.java:373)
at org.tmatesoft.svn.core.internal.io.dav.http.HTTPConnection.request(HTTPConnection.java:361)
at org.tmatesoft.svn.core.internal.io.dav.DAVConnection.performHttpRequest(DAVConnection.java:707)
at org.tmatesoft.svn.core.internal.io.dav.DAVConnection.exchangeCapabilities(DAVConnection.java:627)
at org.tmatesoft.svn.core.internal.io.dav.DAVConnection.open(DAVConnection.java:102)
at org.tmatesoft.svn.core.internal.io.dav.DAVRepository.openConnection(DAVRepository.java:1020)
at org.tmatesoft.svn.core.internal.io.dav.DAVRepository.getRepositoryUUID(DAVRepository.java:148)
at org.tmatesoft.svn.core.internal.wc16.SVNBasicDelegate.createRepository(SVNBasicDelegate.java:339)
at org.tmatesoft.svn.core.internal.wc16.SVNBasicDelegate.createRepository(SVNBasicDelegate.java:328)
at org.tmatesoft.svn.core.internal.wc16.SVNUpdateClient16.update(SVNUpdateClient16.java:482)
at org.tmatesoft.svn.core.internal.wc16.SVNUpdateClient16.doUpdate(SVNUpdateClient16.java:364)
at org.tmatesoft.svn.core.internal.wc16.SVNUpdateClient16.doUpdate(SVNUpdateClient16.java:274)
at org.tmatesoft.svn.core.internal.wc2.old.SvnOldUpdate.run(SvnOldUpdate.java:27)
at org.tmatesoft.svn.core.internal.wc2.old.SvnOldUpdate.run(SvnOldUpdate.java:11)
at org.tmatesoft.svn.core.internal.wc2.SvnOperationRunner.run(SvnOperationRunner.java:20)
at org.tmatesoft.svn.core.wc2.SvnOperationFactory.run(SvnOperationFactory.java:1238)
at org.tmatesoft.svn.core.wc2.SvnOperation.run(SvnOperation.java:294)
at org.tmatesoft.svn.core.wc.SVNUpdateClient.doUpdate(SVNUpdateClient.java:311)
at org.tmatesoft.svn.core.wc.SVNUpdateClient.doUpdate(SVNUpdateClient.java:291)
at org.tmatesoft.svn.core.wc.SVNUpdateClient.doUpdate(SVNUpdateClient.java:387)
at hudson.scm.subversion.UpdateUpdater$TaskImpl.perform(UpdateUpdater.java:157)
at hudson.scm.subversion.WorkspaceUpdater$UpdateTask.delegateTo(WorkspaceUpdater.java:161)
at hudson.scm.SubversionSCM$CheckOutTask.perform(SubversionSCM.java:1030)
at hudson.scm.SubversionSCM$CheckOutTask.invoke(SubversionSCM.java:1011)
at hudson.scm.SubversionSCM$CheckOutTask.invoke(SubversionSCM.java:987)
at hudson.FilePath$FileCallableWrapper.call(FilePath.java:2462)
at hudson.remoting.UserRequest.perform(UserRequest.java:118)
at hudson.remoting.UserRequest.perform(UserRequest.java:48)
at hudson.remoting.Request$2.run(Request.java:328)
at hudson.remoting.InterceptingExecutorService$1.call(InterceptingExecutorService.java:72)
at java.util.concurrent.FutureTask.run(FutureTask.java:262)
at java.util.concurrent.ThreadPoolExecutor.runWorker(ThreadPoolExecutor.java:1145)
at java.util.concurrent.ThreadPoolExecutor$Worker.run(ThreadPoolExecutor.java:615)
at java.lang.Thread.run(Thread.java:745)
Caused by: svn: E175002: OPTIONS /repos/asf/sling/trunk/contrib failed
at org.tmatesoft.svn.core.SVNErrorMessage.create(SVNErrorMessage.java:208)
at org.tmatesoft.svn.core.SVNErrorMessage.create(SVNErrorMessage.java:154)
at org.tmatesoft.svn.core.SVNErrorMessage.create(SVNErrorMessage.java:97)
... 35 more
Caused by: org.tmatesoft.svn.core.SVNException: svn: E175002: OPTIONS request failed on '/repos/asf/sling/trunk/contrib'
svn: E175002: timed out waiting for server
at org.tmatesoft.svn.core.internal.wc.SVNErrorManager.error(SVNErrorManager.java:64)
at org.tmatesoft.svn.core.internal.wc.SVNErrorManager.error(SVNErrorManager.java:51)
at org.tmatesoft.svn.core.internal.io.dav.http.HTTPConnection._request(HTTPConnection.java:777)
at org.tmatesoft.svn.core.internal.io.dav.http.HTTPConnection.request(HTTPConnection.java:382)
... 34 more
Caused by: svn: E175002: OPTIONS request failed on '/repos/asf/sling/trunk/contrib'
at org.tmatesoft.svn.core.SVNErrorMessage.create(SVNErrorMessage.java:208)
at org.tmatesoft.svn.core.internal.io.dav.http.HTTPConnection._request(HTTPConnection.java:775)
... 35 more
Caused by: svn: E175002: timed out waiting for server
at org.tmatesoft.svn.core.SVNErrorMessage.create(SVNErrorMessage.java:208)
at org.tmatesoft.svn.core.internal.io.dav.http.HTTPConnection._request(HTTPConnection.java:514)
... 35 more
Caused by: java.net.SocketTimeoutException: connect timed out
at java.net.PlainSocketImpl.socketConnect(Native Method)
at java.net.AbstractPlainSocketImpl.doConnect(AbstractPlainSocketImpl.java:339)
at java.net.AbstractPlainSocketImpl.connectToAddress(AbstractPlainSocketImpl.java:200)
at java.net.AbstractPlainSocketImpl.connect(AbstractPlainSocketImpl.java:182)
at java.net.SocksSocketImpl.connect(SocksSocketImpl.java:392)
at java.net.Socket.connect(Socket.java:579)
at org.tmatesoft.svn.core.internal.util.SVNSocketFactory.connect(SVNSocketFactory.java:146)
at org.tmatesoft.svn.core.internal.util.SVNSocketFactory.createPlainSocket(SVNSocketFactory.java:73)
at org.tmatesoft.svn.core.internal.io.dav.http.HTTPConnection.connect(HTTPConnection.java:280)
at org.tmatesoft.svn.core.internal.io.dav.http.HTTPConnection._request(HTTPConnection.java:451)
... 35 more
ERROR: Subversion update failed
java.io.IOException: remote file operation failed: <https://builds.apache.org/job/sling-contrib-1.6/ws/> at hudson.remoting.Channel@6f0a1dfe:ubuntu-5
at hudson.FilePath.act(FilePath.java:910)
at hudson.FilePath.act(FilePath.java:887)
at hudson.scm.SubversionSCM.checkout(SubversionSCM.java:936)
at hudson.scm.SubversionSCM.checkout(SubversionSCM.java:871)
at hudson.model.AbstractProject.checkout(AbstractProject.java:1414)
at hudson.model.AbstractBuild$AbstractBuildExecution.defaultCheckout(AbstractBuild.java:671)
at jenkins.scm.SCMCheckoutStrategy.checkout(SCMCheckoutStrategy.java:88)
at hudson.model.AbstractBuild$AbstractBuildExecution.run(AbstractBuild.java:580)
at hudson.model.Run.execute(Run.java:1676)
at hudson.maven.MavenModuleSetBuild.run(MavenModuleSetBuild.java:529)
at hudson.model.ResourceController.execute(ResourceController.java:88)
at hudson.model.Executor.run(Executor.java:231)
Caused by: java.io.IOException
at hudson.scm.subversion.UpdateUpdater$TaskImpl.perform(UpdateUpdater.java:211)
at hudson.scm.subversion.WorkspaceUpdater$UpdateTask.delegateTo(WorkspaceUpdater.java:161)
at hudson.scm.SubversionSCM$CheckOutTask.perform(SubversionSCM.java:1030)
at hudson.scm.SubversionSCM$CheckOutTask.invoke(SubversionSCM.java:1011)
at hudson.scm.SubversionSCM$CheckOutTask.invoke(SubversionSCM.java:987)
at hudson.FilePath$FileCallableWrapper.call(FilePath.java:2462)
at hudson.remoting.UserRequest.perform(UserRequest.java:118)
at hudson.remoting.UserRequest.perform(UserRequest.java:48)
at hudson.remoting.Request$2.run(Request.java:328)
at hudson.remoting.InterceptingExecutorService$1.call(InterceptingExecutorService.java:72)
at java.util.concurrent.FutureTask.run(FutureTask.java:262)
at java.util.concurrent.ThreadPoolExecutor.runWorker(ThreadPoolExecutor.java:1145)
at java.util.concurrent.ThreadPoolExecutor$Worker.run(ThreadPoolExecutor.java:615)
at java.lang.Thread.run(Thread.java:745)
Caused by: hudson.scm.subversion.UpdaterException: failed to perform svn update
... 14 more
Caused by: org.tmatesoft.svn.core.SVNException: svn: E175002: OPTIONS /repos/asf/sling/trunk/contrib failed
at org.tmatesoft.svn.core.internal.io.dav.http.HTTPConnection.request(HTTPConnection.java:388)
at org.tmatesoft.svn.core.internal.io.dav.http.HTTPConnection.request(HTTPConnection.java:373)
at org.tmatesoft.svn.core.internal.io.dav.http.HTTPConnection.request(HTTPConnection.java:361)
at org.tmatesoft.svn.core.internal.io.dav.DAVConnection.performHttpRequest(DAVConnection.java:707)
at org.tmatesoft.svn.core.internal.io.dav.DAVConnection.exchangeCapabilities(DAVConnection.java:627)
at org.tmatesoft.svn.core.internal.io.dav.DAVConnection.open(DAVConnection.java:102)
at org.tmatesoft.svn.core.internal.io.dav.DAVRepository.openConnection(DAVRepository.java:1020)
at org.tmatesoft.svn.core.internal.io.dav.DAVRepository.getRepositoryUUID(DAVRepository.java:148)
at org.tmatesoft.svn.core.internal.wc16.SVNBasicDelegate.createRepository(SVNBasicDelegate.java:339)
at org.tmatesoft.svn.core.internal.wc16.SVNBasicDelegate.createRepository(SVNBasicDelegate.java:328)
at org.tmatesoft.svn.core.internal.wc16.SVNUpdateClient16.update(SVNUpdateClient16.java:482)
at org.tmatesoft.svn.core.internal.wc16.SVNUpdateClient16.doUpdate(SVNUpdateClient16.java:364)
at org.tmatesoft.svn.core.internal.wc16.SVNUpdateClient16.doUpdate(SVNUpdateClient16.java:274)
at org.tmatesoft.svn.core.internal.wc2.old.SvnOldUpdate.run(SvnOldUpdate.java:27)
at org.tmatesoft.svn.core.internal.wc2.old.SvnOldUpdate.run(SvnOldUpdate.java:11)
at org.tmatesoft.svn.core.internal.wc2.SvnOperationRunner.run(SvnOperationRunner.java:20)
at org.tmatesoft.svn.core.wc2.SvnOperationFactory.run(SvnOperationFactory.java:1238)
at org.tmatesoft.svn.core.wc2.SvnOperation.run(SvnOperation.java:294)
at org.tmatesoft.svn.core.wc.SVNUpdateClient.doUpdate(SVNUpdateClient.java:311)
at org.tmatesoft.svn.core.wc.SVNUpdateClient.doUpdate(SVNUpdateClient.java:291)
at org.tmatesoft.svn.core.wc.SVNUpdateClient.doUpdate(SVNUpdateClient.java:387)
at hudson.scm.subversion.UpdateUpdater$TaskImpl.perform(UpdateUpdater.java:157)
... 13 more
Caused by: svn: E175002: OPTIONS /repos/asf/sling/trunk/contrib failed
at org.tmatesoft.svn.core.SVNErrorMessage.create(SVNErrorMessage.java:208)
at org.tmatesoft.svn.core.SVNErrorMessage.create(SVNErrorMessage.java:154)
at org.tmatesoft.svn.core.SVNErrorMessage.create(SVNErrorMessage.java:97)
... 35 more
Caused by: org.tmatesoft.svn.core.SVNException: svn: E175002: OPTIONS request failed on '/repos/asf/sling/trunk/contrib'
svn: E175002: timed out waiting for server
at org.tmatesoft.svn.core.internal.wc.SVNErrorManager.error(SVNErrorManager.java:64)
at org.tmatesoft.svn.core.internal.wc.SVNErrorManager.error(SVNErrorManager.java:51)
at org.tmatesoft.svn.core.internal.io.dav.http.HTTPConnection._request(HTTPConnection.java:777)
at org.tmatesoft.svn.core.internal.io.dav.http.HTTPConnection.request(HTTPConnection.java:382)
... 34 more
Caused by: svn: E175002: OPTIONS request failed on '/repos/asf/sling/trunk/contrib'
at org.tmatesoft.svn.core.SVNErrorMessage.create(SVNErrorMessage.java:208)
at org.tmatesoft.svn.core.internal.io.dav.http.HTTPConnection._request(HTTPConnection.java:775)
... 35 more
Caused by: svn: E175002: timed out waiting for server
at org.tmatesoft.svn.core.SVNErrorMessage.create(SVNErrorMessage.java:208)
at org.tmatesoft.svn.core.internal.io.dav.http.HTTPConnection._request(HTTPConnection.java:514)
... 35 more
Caused by: java.net.SocketTimeoutException: connect timed out
at java.net.PlainSocketImpl.socketConnect(Native Method)
at java.net.AbstractPlainSocketImpl.doConnect(AbstractPlainSocketImpl.java:339)
at java.net.AbstractPlainSocketImpl.connectToAddress(AbstractPlainSocketImpl.java:200)
at java.net.AbstractPlainSocketImpl.connect(AbstractPlainSocketImpl.java:182)
at java.net.SocksSocketImpl.connect(SocksSocketImpl.java:392)
at java.net.Socket.connect(Socket.java:579)
at org.tmatesoft.svn.core.internal.util.SVNSocketFactory.connect(SVNSocketFactory.java:146)
at org.tmatesoft.svn.core.internal.util.SVNSocketFactory.createPlainSocket(SVNSocketFactory.java:73)
at org.tmatesoft.svn.core.internal.io.dav.http.HTTPConnection.connect(HTTPConnection.java:280)
at org.tmatesoft.svn.core.internal.io.dav.http.HTTPConnection._request(HTTPConnection.java:451)
... 35 more
Build failed in Jenkins: sling-contrib-1.6 #1204
Posted by Apache Jenkins Server <je...@builds.apache.org>.
See <https://builds.apache.org/job/sling-contrib-1.6/1204/changes>
Changes:
[tommaso] SLING-3816 - fixed some javadoc issues
[tommaso] SLING-3816 - fixed some javadoc issues
------------------------------------------
[...truncated 20672 lines...]
[INFO]
[INFO] --- maven-antrun-plugin:1.7:run (set-bundle-required-execution-environment) @ org.apache.sling.launchpad.karaf-launchpad-integration-tests ---
[INFO] Executing tasks
main:
[INFO] Executed tasks
[INFO]
[INFO] --- maven-remote-resources-plugin:1.5:process (default) @ org.apache.sling.launchpad.karaf-launchpad-integration-tests ---
[INFO]
[INFO] --- maven-resources-plugin:2.6:resources (default-resources) @ org.apache.sling.launchpad.karaf-launchpad-integration-tests ---
[INFO] Using 'UTF-8' encoding to copy filtered resources.
[INFO] skip non existing resourceDirectory <https://builds.apache.org/job/sling-contrib-1.6/ws/contrib-1.6/launchpad/karaf/org.apache.sling.launchpad.karaf-launchpad-integration-tests/src/main/resources>
[INFO] Copying 3 resources
[INFO]
[INFO] --- maven-antrun-plugin:1.7:run (check-memory-task) @ org.apache.sling.launchpad.karaf-launchpad-integration-tests ---
[INFO] Executing tasks
main:
[echo] **************** WARNING (SLING-443/SLING-1782) ******************************
[echo] On most platforms, you'll get OutOfMemoryErrors when building unless you set
[echo] on 32bit platforms: MAVEN_OPTS="-Xmx256M -XX:MaxPermSize=256M", see SLING-443
[echo] on 64bit platforms: MAVEN_OPTS="-Xmx512M -XX:MaxPermSize=512M", see SLING-1782
[echo] ******************************************************************************
[INFO] Executed tasks
[INFO]
[INFO] --- maven-compiler-plugin:3.1:compile (default-compile) @ org.apache.sling.launchpad.karaf-launchpad-integration-tests ---
[INFO] No sources to compile
[INFO]
[INFO] --- maven-resources-plugin:2.6:testResources (default-testResources) @ org.apache.sling.launchpad.karaf-launchpad-integration-tests ---
[INFO] Using 'UTF-8' encoding to copy filtered resources.
[INFO] skip non existing resourceDirectory <https://builds.apache.org/job/sling-contrib-1.6/ws/contrib-1.6/launchpad/karaf/org.apache.sling.launchpad.karaf-launchpad-integration-tests/src/test/resources>
[INFO] Copying 3 resources
[INFO]
[INFO] --- maven-compiler-plugin:3.1:testCompile (default-testCompile) @ org.apache.sling.launchpad.karaf-launchpad-integration-tests ---
[INFO] Changes detected - recompiling the module!
[INFO] Compiling 1 source file to <https://builds.apache.org/job/sling-contrib-1.6/ws/contrib-1.6/launchpad/karaf/org.apache.sling.launchpad.karaf-launchpad-integration-tests/target/test-classes>
[INFO]
[INFO] --- maven-surefire-plugin:2.16:test (default-test) @ org.apache.sling.launchpad.karaf-launchpad-integration-tests ---
[JENKINS] Recording test results[INFO]
[INFO] --- animal-sniffer-maven-plugin:1.11:check (default) @ org.apache.sling.launchpad.karaf-launchpad-integration-tests ---
[INFO] Checking unresolved references to org.codehaus.mojo.signature:java15:1.0
[INFO]
[INFO] --- maven-bundle-plugin:2.4.0:bundle (default-bundle) @ org.apache.sling.launchpad.karaf-launchpad-integration-tests ---
[WARNING] Bundle org.apache.sling:org.apache.sling.launchpad.karaf-launchpad-integration-tests:bundle:0.0.1-SNAPSHOT : Unused Private-Package instructions, no such package(s) on the class path: [!*]
[INFO]
[INFO] --- maven-enforcer-plugin:1.3.1:enforce (enforce-java) @ org.apache.sling.launchpad.karaf-launchpad-integration-tests ---
[INFO]
[INFO] --- maven-antrun-plugin:1.7:run (set-bundle-required-execution-environment) @ org.apache.sling.launchpad.karaf-launchpad-integration-tests ---
[INFO] Executing tasks
main:
[INFO] Executed tasks
[WARNING] Failed to getClass for org.apache.maven.plugin.source.SourceJarMojo
[INFO]
[INFO] --- maven-source-plugin:2.2.1:jar (attach-sources) @ org.apache.sling.launchpad.karaf-launchpad-integration-tests ---
[INFO] Building jar: <https://builds.apache.org/job/sling-contrib-1.6/ws/contrib-1.6/launchpad/karaf/org.apache.sling.launchpad.karaf-launchpad-integration-tests/target/org.apache.sling.launchpad.karaf-launchpad-integration-tests-0.0.1-SNAPSHOT-sources.jar>
[INFO]
[INFO] --- maven-site-plugin:3.3:attach-descriptor (attach-descriptor) @ org.apache.sling.launchpad.karaf-launchpad-integration-tests ---
[INFO]
[INFO] --- exam-maven-plugin:3.4.0:start-container (default) @ org.apache.sling.launchpad.karaf-launchpad-integration-tests ---
[ERROR]
java.lang.reflect.InvocationTargetException
at sun.reflect.NativeMethodAccessorImpl.invoke0(Native Method)
at sun.reflect.NativeMethodAccessorImpl.invoke(NativeMethodAccessorImpl.java:39)
at sun.reflect.DelegatingMethodAccessorImpl.invoke(DelegatingMethodAccessorImpl.java:25)
at java.lang.reflect.Method.invoke(Method.java:597)
at org.ops4j.pax.exam.maven.StartContainerMojo.getConfigurationOptions(StartContainerMojo.java:158)
at org.ops4j.pax.exam.maven.StartContainerMojo.run(StartContainerMojo.java:142)
at org.ops4j.pax.exam.maven.StartContainerMojo.execute(StartContainerMojo.java:108)
at org.apache.maven.plugin.DefaultBuildPluginManager.executeMojo(DefaultBuildPluginManager.java:101)
at org.apache.maven.lifecycle.internal.MojoExecutor.execute(MojoExecutor.java:209)
at org.apache.maven.lifecycle.internal.MojoExecutor.execute(MojoExecutor.java:153)
at org.apache.maven.lifecycle.internal.MojoExecutor.execute(MojoExecutor.java:145)
at org.apache.maven.lifecycle.internal.LifecycleModuleBuilder.buildProject(LifecycleModuleBuilder.java:84)
at org.apache.maven.lifecycle.internal.LifecycleModuleBuilder.buildProject(LifecycleModuleBuilder.java:59)
at org.apache.maven.lifecycle.internal.LifecycleStarter.singleThreadedBuild(LifecycleStarter.java:183)
at org.apache.maven.lifecycle.internal.LifecycleStarter.execute(LifecycleStarter.java:161)
at org.apache.maven.DefaultMaven.doExecute(DefaultMaven.java:320)
at org.apache.maven.DefaultMaven.execute(DefaultMaven.java:156)
at org.jvnet.hudson.maven3.launcher.Maven3Launcher.main(Maven3Launcher.java:117)
at sun.reflect.NativeMethodAccessorImpl.invoke0(Native Method)
at sun.reflect.NativeMethodAccessorImpl.invoke(NativeMethodAccessorImpl.java:39)
at sun.reflect.DelegatingMethodAccessorImpl.invoke(DelegatingMethodAccessorImpl.java:25)
at java.lang.reflect.Method.invoke(Method.java:597)
at org.codehaus.plexus.classworlds.launcher.Launcher.launchStandard(Launcher.java:329)
at org.codehaus.plexus.classworlds.launcher.Launcher.launch(Launcher.java:239)
at org.jvnet.hudson.maven3.agent.Maven3Main.launch(Maven3Main.java:178)
at sun.reflect.NativeMethodAccessorImpl.invoke0(Native Method)
at sun.reflect.NativeMethodAccessorImpl.invoke(NativeMethodAccessorImpl.java:39)
at sun.reflect.DelegatingMethodAccessorImpl.invoke(DelegatingMethodAccessorImpl.java:25)
at java.lang.reflect.Method.invoke(Method.java:597)
at hudson.maven.Maven3Builder.call(Maven3Builder.java:134)
at hudson.maven.Maven3Builder.call(Maven3Builder.java:69)
at hudson.remoting.UserRequest.perform(UserRequest.java:118)
at hudson.remoting.UserRequest.perform(UserRequest.java:48)
at hudson.remoting.Request$2.run(Request.java:328)
at hudson.remoting.InterceptingExecutorService$1.call(InterceptingExecutorService.java:72)
at java.util.concurrent.FutureTask$Sync.innerRun(FutureTask.java:303)
at java.util.concurrent.FutureTask.run(FutureTask.java:138)
at java.util.concurrent.ThreadPoolExecutor$Worker.runTask(ThreadPoolExecutor.java:895)
at java.util.concurrent.ThreadPoolExecutor$Worker.run(ThreadPoolExecutor.java:918)
at java.lang.Thread.run(Thread.java:662)
Caused by: java.lang.UnsupportedClassVersionError: org/ops4j/pax/exam/karaf/options/KarafDistributionOption : Unsupported major.minor version 51.0
at java.lang.ClassLoader.defineClass1(Native Method)
at java.lang.ClassLoader.defineClassCond(ClassLoader.java:631)
at java.lang.ClassLoader.defineClass(ClassLoader.java:615)
at java.security.SecureClassLoader.defineClass(SecureClassLoader.java:141)
at java.net.URLClassLoader.defineClass(URLClassLoader.java:283)
at java.net.URLClassLoader.access$000(URLClassLoader.java:58)
at java.net.URLClassLoader$1.run(URLClassLoader.java:197)
at java.security.AccessController.doPrivileged(Native Method)
at java.net.URLClassLoader.findClass(URLClassLoader.java:190)
at java.lang.ClassLoader.loadClass(ClassLoader.java:306)
at java.lang.ClassLoader.loadClass(ClassLoader.java:247)
at org.apache.sling.launchpad.karaf.tests.configuration.SlingLaunchpadConfiguration.configuration(SlingLaunchpadConfiguration.java:85)
... 40 more
[JENKINS] Archiving disabled
[INFO] ------------------------------------------------------------------------
[INFO] Reactor Summary:
[INFO]
[INFO] Apache Sling Authentication XING API .............. SUCCESS [45.620s]
[INFO] Apache Sling Authentication XING Login ............ SUCCESS [14.351s]
[INFO] Apache Sling Authentication XING OAuth ............ SUCCESS [8.717s]
[INFO] Apache Sling Commons FileSystem ClassLoader ....... SUCCESS [5.935s]
[INFO] Apache Sling Commons HTML Utilities ............... SUCCESS [4.071s]
[INFO] Apache Sling APT parser ........................... SUCCESS [14.732s]
[INFO] Apache Sling APT servlet .......................... SUCCESS [6.694s]
[INFO] Apache Sling Resource Collection API .............. SUCCESS [8.660s]
[INFO] Apache Sling ClassLoader Leak Detector ............ SUCCESS [6.088s]
[INFO] Apache Sling SLF4J MDC Filter ..................... SUCCESS [27.731s]
[INFO] Apache Sling DataSource Provider .................. SUCCESS [17.665s]
[INFO] Apache Sling Dojo JavaScript Library .............. SUCCESS [13.092s]
[INFO] Apache Sling Dojo Data Extension .................. SUCCESS [3.939s]
[INFO] Apache Sling FTP Server ........................... SUCCESS [11.720s]
[INFO] Apache Sling Google Web Toolkit Servlet Library ... SUCCESS [11.957s]
[INFO] Apache Sling Google Web Toolkit Sample ............ SUCCESS [57.559s]
[INFO] Apache Sling Internationalization Support ......... SUCCESS [41.634s]
[INFO] Apache Sling JMX Resource Provider ................ SUCCESS [6.014s]
[INFO] Apache Sling MongoDB Resource Provider ............ SUCCESS [5.658s]
[INFO] Apache Sling OSGi Bundle Repository ............... SUCCESS [9.458s]
[INFO] Apache Sling Request Processing Analyzer .......... SUCCESS [6.041s]
[INFO] Apache Sling Resource Merger ...................... SUCCESS [6.194s]
[INFO] Apache Sling Rewriter ............................. SUCCESS [9.576s]
[INFO] Apache Sling Tenant ............................... SUCCESS [10.594s]
[INFO] Apache Sling Replication .......................... SUCCESS [17.958s]
[INFO] Apache Sling Replication Integration Tests ........ SUCCESS [2:32.571s]
[INFO] sling-query ....................................... SUCCESS [13.909s]
[INFO] Apache Sling JCR Java Compiler .................... SUCCESS [11.722s]
[INFO] Apache Sling Repository Accessor .................. SUCCESS [5.749s]
[INFO] Apache Sling Object Content Mapping ............... SUCCESS [9.088s]
[INFO] Apache Sling JCR Prefs ............................ SUCCESS [5.498s]
[INFO] Apache Sling JCR Resource Security ................ SUCCESS [6.556s]
[INFO] Apache Sling Launchpad Karaf ...................... SUCCESS [5.070s]
[INFO] Apache Sling Launchpad Karaf - Features ........... SUCCESS [8.315s]
[INFO] Apache Sling Launchpad Karaf - Integration Tests .. SUCCESS [25:33.108s]
[INFO] Apache Sling Launchpad Karaf - Launchpad Integration Tests FAILURE [16.300s]
[INFO] Apache Sling Launchpad Karaf Builder .............. SKIPPED
[INFO] Apache Sling Launchpad Contrib Testing ............ SKIPPED
[INFO] Apache Sling Script Console ....................... SKIPPED
[INFO] Apache Sling Atom Tag Library ..................... SKIPPED
[INFO] Apache Sling Scripting Freemarker Support ......... SKIPPED
[INFO] Apache Sling Scripting Java Support ............... SKIPPED
[INFO] Apache Sling Scripting JST Support ................ SKIPPED
[INFO] Apache Sling Scripting Python Support ............. SKIPPED
[INFO] Apache Sling Scripting Ruby Support ............... SKIPPED
[INFO] Apache Sling Scripting Velocity Support ........... SKIPPED
[INFO] Apache Sling Scripting W3C XML Processing Support . SKIPPED
[INFO] Scala Script Engine ............................... SKIPPED
[INFO] Apache Sling Scala Scripting Configuration ........ SKIPPED
[INFO] Scala for Sling Demo Application - Hello World .... SKIPPED
[INFO] Scala for Sling Demo Application - Forum .......... SKIPPED
[INFO] Apache Sling Contrib (Builder) .................... SKIPPED
[INFO] ------------------------------------------------------------------------
[INFO] BUILD FAILURE
[INFO] ------------------------------------------------------------------------
[INFO] Total time: 36:27.610s
[INFO] Finished at: Fri Aug 15 10:31:56 UTC 2014
[INFO] Final Memory: 89M/198M
[INFO] ------------------------------------------------------------------------
[JENKINS] Archiving disabled
[JENKINS] Archiving disabled
[JENKINS] Archiving disabled
[JENKINS] Archiving disabled
[JENKINS] Archiving disabled
[JENKINS] Archiving disabled
[JENKINS] Archiving disabled
[JENKINS] Archiving disabled
[JENKINS] Archiving disabled
[JENKINS] Archiving disabled
[JENKINS] Archiving disabled
[JENKINS] Archiving disabled
[JENKINS] Archiving disabled
[JENKINS] Archiving disabled
[JENKINS] Archiving disabled
[JENKINS] Archiving disabled
[JENKINS] Archiving disabled
[JENKINS] Archiving disabled
[JENKINS] Archiving disabled
[JENKINS] Archiving disabled
[JENKINS] Archiving disabled
[JENKINS] Archiving disabled
[JENKINS] Archiving disabled
[JENKINS] Archiving disabled
[JENKINS] Archiving disabled
[JENKINS] Archiving disabled
[JENKINS] Archiving disabled
[JENKINS] Archiving disabled
[JENKINS] Archiving disabled
[JENKINS] Archiving disabled
[JENKINS] Archiving disabled
[JENKINS] Archiving disabled
[JENKINS] Archiving disabled
[JENKINS] Archiving disabled
[JENKINS] Archiving disabled
[JENKINS] Archiving disabled
[JENKINS] Archiving disabled
[JENKINS] Archiving disabled
[JENKINS] Archiving disabled
[JENKINS] Archiving disabled
[JENKINS] Archiving disabled
[JENKINS] Archiving disabled
[JENKINS] Archiving disabled
[JENKINS] Archiving disabled
[JENKINS] Archiving disabled
[JENKINS] Archiving disabled
[JENKINS] Archiving disabled
[JENKINS] Archiving disabled
[JENKINS] Archiving disabled
[JENKINS] Archiving disabled
[JENKINS] Archiving disabled
[JENKINS] Archiving disabled
[WARNING] The requested profile "jcrinstall-tests" could not be activated because it does not exist.
Waiting for Jenkins to finish collecting data[ERROR] Failed to execute goal org.ops4j.pax.exam:exam-maven-plugin:3.4.0:start-container (default) on project org.apache.sling.launchpad.karaf-launchpad-integration-tests: Failed to start Pax Exam server for org.apache.sling.launchpad.karaf.tests.configuration.SlingLaunchpadConfiguration: InvocationTargetException: org/ops4j/pax/exam/karaf/options/KarafDistributionOption : Unsupported major.minor version 51.0 -> [Help 1]
[ERROR]
[ERROR] To see the full stack trace of the errors, re-run Maven with the -e switch.
[ERROR] Re-run Maven using the -X switch to enable full debug logging.
[ERROR]
[ERROR] For more information about the errors and possible solutions, please read the following articles:
[ERROR] [Help 1] http://cwiki.apache.org/confluence/display/MAVEN/MojoExecutionException
[ERROR]
[ERROR] After correcting the problems, you can resume the build with the command
[ERROR] mvn <goals> -rf :org.apache.sling.launchpad.karaf-launchpad-integration-tests
Sending e-mails to: dev@sling.apache.org
Sending e-mails to: dev@sling.apache.org
channel stopped
[locks-and-latches] Releasing all the locks
[locks-and-latches] All the locks released
Build failed in Jenkins: sling-contrib-1.6 #1203
Posted by Apache Jenkins Server <je...@builds.apache.org>.
See <https://builds.apache.org/job/sling-contrib-1.6/1203/changes>
Changes:
[amitgupt] SLING-3661 - ftp server should support resumable file uploads
Commiting patch from Felix.
thanks
[tommaso] SLING-3842 - applied Marius Petria's patch for testing of importers/exporters
[tommaso] SLING-3839 - applied Marius Petria's patch, refactoring packaging APIs in own package
[cziegeler] [maven-release-plugin] prepare for next development iteration
[cziegeler] [maven-release-plugin] prepare release org.apache.sling.tenant-1.0.2
[tommaso] SLING-3838 - cleaned up unneeded log.isLevelEnabled statements
[tommaso] SLING-3833 - fixed agent exporter offering null package, minor fixes
[tommaso] SLING-3833 - fixed javadoc
[tommaso] SLING-3833 - applied Marius Petria's patch for cleaning up ReplicationAgent interface
[tommaso] SLING-3833 - applied Marius Petria's patch for cleaning up ReplicationAgent interface
------------------------------------------
[...truncated 20723 lines...]
[INFO]
[INFO] --- maven-antrun-plugin:1.7:run (set-bundle-required-execution-environment) @ org.apache.sling.launchpad.karaf-launchpad-integration-tests ---
[INFO] Executing tasks
main:
[INFO] Executed tasks
[INFO]
[INFO] --- maven-remote-resources-plugin:1.5:process (default) @ org.apache.sling.launchpad.karaf-launchpad-integration-tests ---
[INFO]
[INFO] --- maven-resources-plugin:2.6:resources (default-resources) @ org.apache.sling.launchpad.karaf-launchpad-integration-tests ---
[INFO] Using 'UTF-8' encoding to copy filtered resources.
[INFO] skip non existing resourceDirectory <https://builds.apache.org/job/sling-contrib-1.6/ws/contrib-1.6/launchpad/karaf/org.apache.sling.launchpad.karaf-launchpad-integration-tests/src/main/resources>
[INFO] Copying 3 resources
[INFO]
[INFO] --- maven-antrun-plugin:1.7:run (check-memory-task) @ org.apache.sling.launchpad.karaf-launchpad-integration-tests ---
[INFO] Executing tasks
main:
[echo] **************** WARNING (SLING-443/SLING-1782) ******************************
[echo] On most platforms, you'll get OutOfMemoryErrors when building unless you set
[echo] on 32bit platforms: MAVEN_OPTS="-Xmx256M -XX:MaxPermSize=256M", see SLING-443
[echo] on 64bit platforms: MAVEN_OPTS="-Xmx512M -XX:MaxPermSize=512M", see SLING-1782
[echo] ******************************************************************************
[INFO] Executed tasks
[INFO]
[INFO] --- maven-compiler-plugin:3.1:compile (default-compile) @ org.apache.sling.launchpad.karaf-launchpad-integration-tests ---
[INFO] No sources to compile
[INFO]
[INFO] --- maven-resources-plugin:2.6:testResources (default-testResources) @ org.apache.sling.launchpad.karaf-launchpad-integration-tests ---
[INFO] Using 'UTF-8' encoding to copy filtered resources.
[INFO] skip non existing resourceDirectory <https://builds.apache.org/job/sling-contrib-1.6/ws/contrib-1.6/launchpad/karaf/org.apache.sling.launchpad.karaf-launchpad-integration-tests/src/test/resources>
[INFO] Copying 3 resources
[INFO]
[INFO] --- maven-compiler-plugin:3.1:testCompile (default-testCompile) @ org.apache.sling.launchpad.karaf-launchpad-integration-tests ---
[INFO] Changes detected - recompiling the module!
[INFO] Compiling 1 source file to <https://builds.apache.org/job/sling-contrib-1.6/ws/contrib-1.6/launchpad/karaf/org.apache.sling.launchpad.karaf-launchpad-integration-tests/target/test-classes>
[INFO]
[INFO] --- maven-surefire-plugin:2.16:test (default-test) @ org.apache.sling.launchpad.karaf-launchpad-integration-tests ---
[JENKINS] Recording test results[INFO]
[INFO] --- animal-sniffer-maven-plugin:1.11:check (default) @ org.apache.sling.launchpad.karaf-launchpad-integration-tests ---
[INFO] Checking unresolved references to org.codehaus.mojo.signature:java15:1.0
[INFO]
[INFO] --- maven-bundle-plugin:2.4.0:bundle (default-bundle) @ org.apache.sling.launchpad.karaf-launchpad-integration-tests ---
[WARNING] Bundle org.apache.sling:org.apache.sling.launchpad.karaf-launchpad-integration-tests:bundle:0.0.1-SNAPSHOT : Unused Private-Package instructions, no such package(s) on the class path: [!*]
[INFO]
[INFO] --- maven-enforcer-plugin:1.3.1:enforce (enforce-java) @ org.apache.sling.launchpad.karaf-launchpad-integration-tests ---
[INFO]
[INFO] --- maven-antrun-plugin:1.7:run (set-bundle-required-execution-environment) @ org.apache.sling.launchpad.karaf-launchpad-integration-tests ---
[INFO] Executing tasks
main:
[INFO] Executed tasks
[WARNING] Failed to getClass for org.apache.maven.plugin.source.SourceJarMojo
[INFO]
[INFO] --- maven-source-plugin:2.2.1:jar (attach-sources) @ org.apache.sling.launchpad.karaf-launchpad-integration-tests ---
[INFO] Building jar: <https://builds.apache.org/job/sling-contrib-1.6/ws/contrib-1.6/launchpad/karaf/org.apache.sling.launchpad.karaf-launchpad-integration-tests/target/org.apache.sling.launchpad.karaf-launchpad-integration-tests-0.0.1-SNAPSHOT-sources.jar>
[INFO]
[INFO] --- maven-site-plugin:3.3:attach-descriptor (attach-descriptor) @ org.apache.sling.launchpad.karaf-launchpad-integration-tests ---
[INFO]
[INFO] --- exam-maven-plugin:3.4.0:start-container (default) @ org.apache.sling.launchpad.karaf-launchpad-integration-tests ---
[ERROR]
java.lang.reflect.InvocationTargetException
at sun.reflect.NativeMethodAccessorImpl.invoke0(Native Method)
at sun.reflect.NativeMethodAccessorImpl.invoke(NativeMethodAccessorImpl.java:39)
at sun.reflect.DelegatingMethodAccessorImpl.invoke(DelegatingMethodAccessorImpl.java:25)
at java.lang.reflect.Method.invoke(Method.java:597)
at org.ops4j.pax.exam.maven.StartContainerMojo.getConfigurationOptions(StartContainerMojo.java:158)
at org.ops4j.pax.exam.maven.StartContainerMojo.run(StartContainerMojo.java:142)
at org.ops4j.pax.exam.maven.StartContainerMojo.execute(StartContainerMojo.java:108)
at org.apache.maven.plugin.DefaultBuildPluginManager.executeMojo(DefaultBuildPluginManager.java:101)
at org.apache.maven.lifecycle.internal.MojoExecutor.execute(MojoExecutor.java:209)
at org.apache.maven.lifecycle.internal.MojoExecutor.execute(MojoExecutor.java:153)
at org.apache.maven.lifecycle.internal.MojoExecutor.execute(MojoExecutor.java:145)
at org.apache.maven.lifecycle.internal.LifecycleModuleBuilder.buildProject(LifecycleModuleBuilder.java:84)
at org.apache.maven.lifecycle.internal.LifecycleModuleBuilder.buildProject(LifecycleModuleBuilder.java:59)
at org.apache.maven.lifecycle.internal.LifecycleStarter.singleThreadedBuild(LifecycleStarter.java:183)
at org.apache.maven.lifecycle.internal.LifecycleStarter.execute(LifecycleStarter.java:161)
at org.apache.maven.DefaultMaven.doExecute(DefaultMaven.java:320)
at org.apache.maven.DefaultMaven.execute(DefaultMaven.java:156)
at org.jvnet.hudson.maven3.launcher.Maven3Launcher.main(Maven3Launcher.java:117)
at sun.reflect.NativeMethodAccessorImpl.invoke0(Native Method)
at sun.reflect.NativeMethodAccessorImpl.invoke(NativeMethodAccessorImpl.java:39)
at sun.reflect.DelegatingMethodAccessorImpl.invoke(DelegatingMethodAccessorImpl.java:25)
at java.lang.reflect.Method.invoke(Method.java:597)
at org.codehaus.plexus.classworlds.launcher.Launcher.launchStandard(Launcher.java:329)
at org.codehaus.plexus.classworlds.launcher.Launcher.launch(Launcher.java:239)
at org.jvnet.hudson.maven3.agent.Maven3Main.launch(Maven3Main.java:178)
at sun.reflect.NativeMethodAccessorImpl.invoke0(Native Method)
at sun.reflect.NativeMethodAccessorImpl.invoke(NativeMethodAccessorImpl.java:39)
at sun.reflect.DelegatingMethodAccessorImpl.invoke(DelegatingMethodAccessorImpl.java:25)
at java.lang.reflect.Method.invoke(Method.java:597)
at hudson.maven.Maven3Builder.call(Maven3Builder.java:134)
at hudson.maven.Maven3Builder.call(Maven3Builder.java:69)
at hudson.remoting.UserRequest.perform(UserRequest.java:118)
at hudson.remoting.UserRequest.perform(UserRequest.java:48)
at hudson.remoting.Request$2.run(Request.java:328)
at hudson.remoting.InterceptingExecutorService$1.call(InterceptingExecutorService.java:72)
at java.util.concurrent.FutureTask$Sync.innerRun(FutureTask.java:303)
at java.util.concurrent.FutureTask.run(FutureTask.java:138)
at java.util.concurrent.ThreadPoolExecutor$Worker.runTask(ThreadPoolExecutor.java:895)
at java.util.concurrent.ThreadPoolExecutor$Worker.run(ThreadPoolExecutor.java:918)
at java.lang.Thread.run(Thread.java:662)
Caused by: java.lang.UnsupportedClassVersionError: org/ops4j/pax/exam/karaf/options/KarafDistributionOption : Unsupported major.minor version 51.0
at java.lang.ClassLoader.defineClass1(Native Method)
at java.lang.ClassLoader.defineClassCond(ClassLoader.java:631)
at java.lang.ClassLoader.defineClass(ClassLoader.java:615)
at java.security.SecureClassLoader.defineClass(SecureClassLoader.java:141)
at java.net.URLClassLoader.defineClass(URLClassLoader.java:283)
at java.net.URLClassLoader.access$000(URLClassLoader.java:58)
at java.net.URLClassLoader$1.run(URLClassLoader.java:197)
at java.security.AccessController.doPrivileged(Native Method)
at java.net.URLClassLoader.findClass(URLClassLoader.java:190)
at java.lang.ClassLoader.loadClass(ClassLoader.java:306)
at java.lang.ClassLoader.loadClass(ClassLoader.java:247)
at org.apache.sling.launchpad.karaf.tests.configuration.SlingLaunchpadConfiguration.configuration(SlingLaunchpadConfiguration.java:85)
... 40 more
[JENKINS] Archiving disabled
[INFO] ------------------------------------------------------------------------
[INFO] Reactor Summary:
[INFO]
[INFO] Apache Sling Authentication XING API .............. SUCCESS [27.663s]
[INFO] Apache Sling Authentication XING Login ............ SUCCESS [12.332s]
[INFO] Apache Sling Authentication XING OAuth ............ SUCCESS [8.409s]
[INFO] Apache Sling Commons FileSystem ClassLoader ....... SUCCESS [6.107s]
[INFO] Apache Sling Commons HTML Utilities ............... SUCCESS [5.224s]
[INFO] Apache Sling APT parser ........................... SUCCESS [11.810s]
[INFO] Apache Sling APT servlet .......................... SUCCESS [5.885s]
[INFO] Apache Sling Resource Collection API .............. SUCCESS [6.022s]
[INFO] Apache Sling ClassLoader Leak Detector ............ SUCCESS [5.015s]
[INFO] Apache Sling SLF4J MDC Filter ..................... SUCCESS [21.473s]
[INFO] Apache Sling DataSource Provider .................. SUCCESS [14.902s]
[INFO] Apache Sling Dojo JavaScript Library .............. SUCCESS [11.839s]
[INFO] Apache Sling Dojo Data Extension .................. SUCCESS [3.907s]
[INFO] Apache Sling FTP Server ........................... SUCCESS [8.747s]
[INFO] Apache Sling Google Web Toolkit Servlet Library ... SUCCESS [11.353s]
[INFO] Apache Sling Google Web Toolkit Sample ............ SUCCESS [1:02.085s]
[INFO] Apache Sling Internationalization Support ......... SUCCESS [27.153s]
[INFO] Apache Sling JMX Resource Provider ................ SUCCESS [5.420s]
[INFO] Apache Sling MongoDB Resource Provider ............ SUCCESS [5.892s]
[INFO] Apache Sling OSGi Bundle Repository ............... SUCCESS [8.477s]
[INFO] Apache Sling Request Processing Analyzer .......... SUCCESS [5.941s]
[INFO] Apache Sling Resource Merger ...................... SUCCESS [8.206s]
[INFO] Apache Sling Rewriter ............................. SUCCESS [5.595s]
[INFO] Apache Sling Tenant ............................... SUCCESS [6.223s]
[INFO] Apache Sling Replication .......................... SUCCESS [14.210s]
[INFO] Apache Sling Replication Integration Tests ........ SUCCESS [8:15.822s]
[INFO] sling-query ....................................... SUCCESS [13.774s]
[INFO] Apache Sling JCR Java Compiler .................... SUCCESS [10.058s]
[INFO] Apache Sling Repository Accessor .................. SUCCESS [4.044s]
[INFO] Apache Sling Object Content Mapping ............... SUCCESS [9.374s]
[INFO] Apache Sling JCR Prefs ............................ SUCCESS [6.209s]
[INFO] Apache Sling JCR Resource Security ................ SUCCESS [5.010s]
[INFO] Apache Sling Launchpad Karaf ...................... SUCCESS [3.871s]
[INFO] Apache Sling Launchpad Karaf - Features ........... SUCCESS [6.301s]
[INFO] Apache Sling Launchpad Karaf - Integration Tests .. SUCCESS [25:20.959s]
[INFO] Apache Sling Launchpad Karaf - Launchpad Integration Tests FAILURE [20.742s]
[INFO] Apache Sling Launchpad Karaf Builder .............. SKIPPED
[INFO] Apache Sling Launchpad Contrib Testing ............ SKIPPED
[INFO] Apache Sling Script Console ....................... SKIPPED
[INFO] Apache Sling Atom Tag Library ..................... SKIPPED
[INFO] Apache Sling Scripting Freemarker Support ......... SKIPPED
[INFO] Apache Sling Scripting Java Support ............... SKIPPED
[INFO] Apache Sling Scripting JST Support ................ SKIPPED
[INFO] Apache Sling Scripting Python Support ............. SKIPPED
[INFO] Apache Sling Scripting Ruby Support ............... SKIPPED
[INFO] Apache Sling Scripting Velocity Support ........... SKIPPED
[INFO] Apache Sling Scripting W3C XML Processing Support . SKIPPED
[INFO] Scala Script Engine ............................... SKIPPED
[INFO] Apache Sling Scala Scripting Configuration ........ SKIPPED
[INFO] Scala for Sling Demo Application - Hello World .... SKIPPED
[INFO] Scala for Sling Demo Application - Forum .......... SKIPPED
[INFO] Apache Sling Contrib (Builder) .................... SKIPPED
[INFO] ------------------------------------------------------------------------
[INFO] BUILD FAILURE
[INFO] ------------------------------------------------------------------------
[INFO] Total time: 40:31.697s
[INFO] Finished at: Thu Aug 14 23:02:51 UTC 2014
[INFO] Final Memory: 96M/183M
[INFO] ------------------------------------------------------------------------
[JENKINS] Archiving disabled
[JENKINS] Archiving disabled
[JENKINS] Archiving disabled
[JENKINS] Archiving disabled
[JENKINS] Archiving disabled
[JENKINS] Archiving disabled
[JENKINS] Archiving disabled
[JENKINS] Archiving disabled
[JENKINS] Archiving disabled
[JENKINS] Archiving disabled
[JENKINS] Archiving disabled
[JENKINS] Archiving disabled
[JENKINS] Archiving disabled
[JENKINS] Archiving disabled
[JENKINS] Archiving disabled
[JENKINS] Archiving disabled
[JENKINS] Archiving disabled
[JENKINS] Archiving disabled
[JENKINS] Archiving disabled
[JENKINS] Archiving disabled
[JENKINS] Archiving disabled
[JENKINS] Archiving disabled
[JENKINS] Archiving disabled
[JENKINS] Archiving disabled
[JENKINS] Archiving disabled
[JENKINS] Archiving disabled
[JENKINS] Archiving disabled
[JENKINS] Archiving disabled
[JENKINS] Archiving disabled
[JENKINS] Archiving disabled
[JENKINS] Archiving disabled
[JENKINS] Archiving disabled
[JENKINS] Archiving disabled
[JENKINS] Archiving disabled
[JENKINS] Archiving disabled
[JENKINS] Archiving disabled
[JENKINS] Archiving disabled
[JENKINS] Archiving disabled
[JENKINS] Archiving disabled
[JENKINS] Archiving disabled
[JENKINS] Archiving disabled
[JENKINS] Archiving disabled
[JENKINS] Archiving disabled
[JENKINS] Archiving disabled
[JENKINS] Archiving disabled
[JENKINS] Archiving disabled
[JENKINS] Archiving disabled
[JENKINS] Archiving disabled
[JENKINS] Archiving disabled
[JENKINS] Archiving disabled
[JENKINS] Archiving disabled
[JENKINS] Archiving disabled[WARNING] The requested profile "jcrinstall-tests" could not be activated because it does not exist.
Waiting for Jenkins to finish collecting data
[ERROR] Failed to execute goal org.ops4j.pax.exam:exam-maven-plugin:3.4.0:start-container (default) on project org.apache.sling.launchpad.karaf-launchpad-integration-tests: Failed to start Pax Exam server for org.apache.sling.launchpad.karaf.tests.configuration.SlingLaunchpadConfiguration: InvocationTargetException: org/ops4j/pax/exam/karaf/options/KarafDistributionOption : Unsupported major.minor version 51.0 -> [Help 1]
[ERROR]
[ERROR] To see the full stack trace of the errors, re-run Maven with the -e switch.
[ERROR] Re-run Maven using the -X switch to enable full debug logging.
[ERROR]
[ERROR] For more information about the errors and possible solutions, please read the following articles:
[ERROR] [Help 1] http://cwiki.apache.org/confluence/display/MAVEN/MojoExecutionException
[ERROR]
[ERROR] After correcting the problems, you can resume the build with the command
[ERROR] mvn <goals> -rf :org.apache.sling.launchpad.karaf-launchpad-integration-tests
Sending e-mails to: dev@sling.apache.org
Sending e-mails to: dev@sling.apache.org
channel stopped
[locks-and-latches] Releasing all the locks
[locks-and-latches] All the locks released