You are viewing a plain text version of this content. The canonical link for it is here.
Posted to notifications@jclouds.apache.org by je...@cloudbees.com on 2014/08/10 08:42:53 UTC
Build failed in Jenkins: jclouds-karaf #659
See <https://jclouds.ci.cloudbees.com/job/jclouds-karaf/659/>
------------------------------------------
[...truncated 2723 lines...]
Downloading: https://repository.apache.org/content/repositories/snapshots/org/apache/jclouds/provider/glesys/2.0.0-SNAPSHOT/maven-metadata.xml
Downloading: https://repository-jclouds.forge.cloudbees.com/snapshot/org/apache/jclouds/provider/glesys/2.0.0-SNAPSHOT/maven-metadata.xml
Downloading: https://oss.sonatype.org/content/repositories/releases/org/apache/jclouds/provider/glesys/2.0.0-SNAPSHOT/maven-metadata.xml
Downloading: http://download.java.net/maven/2/org/apache/jclouds/provider/glesys/2.0.0-SNAPSHOT/maven-metadata.xml
Downloading: http://repository.apache.org/snapshots/org/apache/jclouds/provider/glesys/2.0.0-SNAPSHOT/maven-metadata.xml
Downloaded: http://repository.apache.org/snapshots/org/apache/jclouds/provider/glesys/2.0.0-SNAPSHOT/maven-metadata.xml (2 KB at 6.8 KB/sec)
Downloaded: https://repository.apache.org/content/repositories/snapshots/org/apache/jclouds/provider/glesys/2.0.0-SNAPSHOT/maven-metadata.xml (2 KB at 6.5 KB/sec)
[WARNING] Could not transfer metadata org.apache.jclouds.provider:glesys:2.0.0-SNAPSHOT/maven-metadata.xml from/to cloudbees-private-snapshot-repository (https://repository-jclouds.forge.cloudbees.com/snapshot): Access denied to: https://repository-jclouds.forge.cloudbees.com/snapshot/org/apache/jclouds/provider/glesys/2.0.0-SNAPSHOT/maven-metadata.xml
Downloading: https://repository.apache.org/content/repositories/snapshots/org/apache/jclouds/provider/glesys/2.0.0-SNAPSHOT/glesys-2.0.0-20140809.194321-6.jar
Downloaded: https://repository.apache.org/content/repositories/snapshots/org/apache/jclouds/provider/glesys/2.0.0-SNAPSHOT/glesys-2.0.0-20140809.194321-6.jar (183 KB at 465.2 KB/sec)
[INFO] Copying bundle: org.apache.jclouds:jclouds-compute:jar:2.0.0-SNAPSHOT
[INFO] Copying bundle: org.apache.jclouds.driver:jclouds-enterprise:jar:2.0.0-SNAPSHOT
Downloading: https://repository.apache.org/content/repositories/snapshots/org/apache/jclouds/driver/jclouds-enterprise/2.0.0-SNAPSHOT/maven-metadata.xml
Downloading: https://oss.sonatype.org/content/repositories/releases/org/apache/jclouds/driver/jclouds-enterprise/2.0.0-SNAPSHOT/maven-metadata.xml
Downloading: https://repository-jclouds.forge.cloudbees.com/snapshot/org/apache/jclouds/driver/jclouds-enterprise/2.0.0-SNAPSHOT/maven-metadata.xml
Downloading: http://download.java.net/maven/2/org/apache/jclouds/driver/jclouds-enterprise/2.0.0-SNAPSHOT/maven-metadata.xml
Downloading: http://repository.apache.org/snapshots/org/apache/jclouds/driver/jclouds-enterprise/2.0.0-SNAPSHOT/maven-metadata.xml
Downloaded: https://repository.apache.org/content/repositories/snapshots/org/apache/jclouds/driver/jclouds-enterprise/2.0.0-SNAPSHOT/maven-metadata.xml (2 KB at 5.9 KB/sec)
Downloaded: http://repository.apache.org/snapshots/org/apache/jclouds/driver/jclouds-enterprise/2.0.0-SNAPSHOT/maven-metadata.xml (2 KB at 5.7 KB/sec)
[WARNING] Could not transfer metadata org.apache.jclouds.driver:jclouds-enterprise:2.0.0-SNAPSHOT/maven-metadata.xml from/to cloudbees-private-snapshot-repository (https://repository-jclouds.forge.cloudbees.com/snapshot): Access denied to: https://repository-jclouds.forge.cloudbees.com/snapshot/org/apache/jclouds/driver/jclouds-enterprise/2.0.0-SNAPSHOT/maven-metadata.xml
Downloading: https://repository.apache.org/content/repositories/snapshots/org/apache/jclouds/driver/jclouds-enterprise/2.0.0-SNAPSHOT/jclouds-enterprise-2.0.0-20140809.192141-6.jar
Downloaded: https://repository.apache.org/content/repositories/snapshots/org/apache/jclouds/driver/jclouds-enterprise/2.0.0-SNAPSHOT/jclouds-enterprise-2.0.0-20140809.192141-6.jar (10 KB at 42.3 KB/sec)
[INFO] Copying bundle: org.apache.jclouds.api:openstack-keystone:jar:2.0.0-SNAPSHOT
Downloading: https://repository-jclouds.forge.cloudbees.com/snapshot/org/apache/jclouds/api/openstack-keystone/2.0.0-SNAPSHOT/maven-metadata.xml
Downloading: https://repository.apache.org/content/repositories/snapshots/org/apache/jclouds/api/openstack-keystone/2.0.0-SNAPSHOT/maven-metadata.xml
Downloading: https://oss.sonatype.org/content/repositories/releases/org/apache/jclouds/api/openstack-keystone/2.0.0-SNAPSHOT/maven-metadata.xml
Downloading: http://download.java.net/maven/2/org/apache/jclouds/api/openstack-keystone/2.0.0-SNAPSHOT/maven-metadata.xml
Downloading: http://repository.apache.org/snapshots/org/apache/jclouds/api/openstack-keystone/2.0.0-SNAPSHOT/maven-metadata.xml
Downloaded: http://repository.apache.org/snapshots/org/apache/jclouds/api/openstack-keystone/2.0.0-SNAPSHOT/maven-metadata.xml (2 KB at 4.2 KB/sec)
Downloaded: https://repository.apache.org/content/repositories/snapshots/org/apache/jclouds/api/openstack-keystone/2.0.0-SNAPSHOT/maven-metadata.xml (2 KB at 2.5 KB/sec)
[WARNING] Could not transfer metadata org.apache.jclouds.api:openstack-keystone:2.0.0-SNAPSHOT/maven-metadata.xml from/to cloudbees-private-snapshot-repository (https://repository-jclouds.forge.cloudbees.com/snapshot): Access denied to: https://repository-jclouds.forge.cloudbees.com/snapshot/org/apache/jclouds/api/openstack-keystone/2.0.0-SNAPSHOT/maven-metadata.xml
Downloading: https://repository.apache.org/content/repositories/snapshots/org/apache/jclouds/api/openstack-keystone/2.0.0-SNAPSHOT/openstack-keystone-2.0.0-20140809.185945-6.jar
Downloaded: https://repository.apache.org/content/repositories/snapshots/org/apache/jclouds/api/openstack-keystone/2.0.0-SNAPSHOT/openstack-keystone-2.0.0-20140809.185945-6.jar (198 KB at 295.3 KB/sec)
[INFO] Copying bundle: org.apache.servicemix.bundles:org.apache.servicemix.bundles.jersey-core:jar:1.11_1
[INFO]
[INFO] --- maven-bundle-plugin:2.1.0:manifest (bundle-manifest) @ jclouds-karaf ---
[WARNING] Ignoring project type pom - supportedProjectTypes = [jar, war, bundle]
[INFO]
[INFO] --- maven-site-plugin:3.3:attach-descriptor (attach-descriptor) @ jclouds-karaf ---
[INFO]
[INFO] --- apache-rat-plugin:0.10:check (default) @ jclouds-karaf ---
[INFO] 51 implicit excludes (use -debug for more details).
[INFO] Exclude: **/LICENSE.txt
[INFO] Exclude: **/header.txt
[INFO] Exclude: **/NOTICE.txt
[INFO] Exclude: **/DISCLAIMER
[INFO] Exclude: **/BUILD.txt
[INFO] Exclude: **/CHANGES.txt
[INFO] Exclude: **/README.md
[INFO] Exclude: **/README.txt
[INFO] Exclude: **/DEPENDENCIES
[INFO] Exclude: **/CONTRIBUTING.md
[INFO] Exclude: .git/**
[INFO] Exclude: **/.gitignore
[INFO] Exclude: **/*.json
[INFO] Exclude: **/*.log*
[INFO] Exclude: **/TODO
[INFO] Exclude: .mailmap
[INFO] Exclude: .idea/**
[INFO] Exclude: **/*.iml
[INFO] Exclude: **/.project
[INFO] Exclude: **/.classpath
[INFO] Exclude: **/.settings/**
[INFO] Exclude: **/.checkstyle
[INFO] Exclude: **/target/**
[INFO] Exclude: .repository/**
[INFO] Exclude: **/src/main/resources/**/*.txt
[INFO] 4 resources included (use -debug for more details)
Warning: org.apache.xerces.jaxp.SAXParserImpl$JAXPSAXParser: Property 'http://www.oracle.com/xml/jaxp/properties/entityExpansionLimit' is not recognized.
Compiler warnings:
WARNING: 'org.apache.xerces.jaxp.SAXParserImpl: Property 'http://javax.xml.XMLConstants/property/accessExternalDTD' is not recognized.'
Warning: org.apache.xerces.parsers.SAXParser: Feature 'http://javax.xml.XMLConstants/feature/secure-processing' is not recognized.
Warning: org.apache.xerces.parsers.SAXParser: Property 'http://javax.xml.XMLConstants/property/accessExternalDTD' is not recognized.
Warning: org.apache.xerces.parsers.SAXParser: Property 'http://www.oracle.com/xml/jaxp/properties/entityExpansionLimit' is not recognized.
[INFO] Rat check: Summary of files. Unapproved: 0 unknown: 0 generated: 0 approved: 4 licence.
[INFO]
[INFO] --- maven-install-plugin:2.5.1:install (default-install) @ jclouds-karaf ---
[INFO] Installing <https://jclouds.ci.cloudbees.com/job/jclouds-karaf/ws/feature/pom.xml> to /home/jenkins/.m2/repository/org/apache/jclouds/karaf/jclouds-karaf/2.0.0-SNAPSHOT/jclouds-karaf-2.0.0-SNAPSHOT.pom
[INFO] Installing <https://jclouds.ci.cloudbees.com/job/jclouds-karaf/ws/feature/target/feature.xml> to /home/jenkins/.m2/repository/org/apache/jclouds/karaf/jclouds-karaf/2.0.0-SNAPSHOT/jclouds-karaf-2.0.0-SNAPSHOT-features.xml
[INFO] Installing <https://jclouds.ci.cloudbees.com/job/jclouds-karaf/ws/feature/target/credentials.cfg> to /home/jenkins/.m2/repository/org/apache/jclouds/karaf/jclouds-karaf/2.0.0-SNAPSHOT/jclouds-karaf-2.0.0-SNAPSHOT-credentials.cfg
[INFO] Installing <https://jclouds.ci.cloudbees.com/job/jclouds-karaf/ws/feature/target/shell.cfg> to /home/jenkins/.m2/repository/org/apache/jclouds/karaf/jclouds-karaf/2.0.0-SNAPSHOT/jclouds-karaf-2.0.0-SNAPSHOT-shell.cfg
[INFO]
[INFO] --- maven-deploy-plugin:2.8.1:deploy (default-deploy) @ jclouds-karaf ---
Downloading: https://repository.apache.org/content/repositories/snapshots/org/apache/jclouds/karaf/jclouds-karaf/2.0.0-SNAPSHOT/maven-metadata.xml
Downloaded: https://repository.apache.org/content/repositories/snapshots/org/apache/jclouds/karaf/jclouds-karaf/2.0.0-SNAPSHOT/maven-metadata.xml (2 KB at 2.6 KB/sec)
Uploading: https://repository.apache.org/content/repositories/snapshots/org/apache/jclouds/karaf/jclouds-karaf/2.0.0-SNAPSHOT/jclouds-karaf-2.0.0-20140810.064138-9.pom
Uploaded: https://repository.apache.org/content/repositories/snapshots/org/apache/jclouds/karaf/jclouds-karaf/2.0.0-SNAPSHOT/jclouds-karaf-2.0.0-20140810.064138-9.pom (8 KB at 26.1 KB/sec)
Downloading: https://repository.apache.org/content/repositories/snapshots/org/apache/jclouds/karaf/jclouds-karaf/maven-metadata.xml
Downloaded: https://repository.apache.org/content/repositories/snapshots/org/apache/jclouds/karaf/jclouds-karaf/maven-metadata.xml (619 B at 0.5 KB/sec)
Uploading: https://repository.apache.org/content/repositories/snapshots/org/apache/jclouds/karaf/jclouds-karaf/2.0.0-SNAPSHOT/maven-metadata.xml
Uploaded: https://repository.apache.org/content/repositories/snapshots/org/apache/jclouds/karaf/jclouds-karaf/2.0.0-SNAPSHOT/maven-metadata.xml (2 KB at 4.1 KB/sec)
Uploading: https://repository.apache.org/content/repositories/snapshots/org/apache/jclouds/karaf/jclouds-karaf/maven-metadata.xml
Uploaded: https://repository.apache.org/content/repositories/snapshots/org/apache/jclouds/karaf/jclouds-karaf/maven-metadata.xml (598 B at 1.1 KB/sec)
Uploading: https://repository.apache.org/content/repositories/snapshots/org/apache/jclouds/karaf/jclouds-karaf/2.0.0-SNAPSHOT/jclouds-karaf-2.0.0-20140810.064138-9-features.xml
Uploaded: https://repository.apache.org/content/repositories/snapshots/org/apache/jclouds/karaf/jclouds-karaf/2.0.0-SNAPSHOT/jclouds-karaf-2.0.0-20140810.064138-9-features.xml (32 KB at 72.0 KB/sec)
Uploading: https://repository.apache.org/content/repositories/snapshots/org/apache/jclouds/karaf/jclouds-karaf/2.0.0-SNAPSHOT/maven-metadata.xml
Uploaded: https://repository.apache.org/content/repositories/snapshots/org/apache/jclouds/karaf/jclouds-karaf/2.0.0-SNAPSHOT/maven-metadata.xml (2 KB at 4.5 KB/sec)
Uploading: https://repository.apache.org/content/repositories/snapshots/org/apache/jclouds/karaf/jclouds-karaf/2.0.0-SNAPSHOT/jclouds-karaf-2.0.0-20140810.064138-9-credentials.cfg
Uploaded: https://repository.apache.org/content/repositories/snapshots/org/apache/jclouds/karaf/jclouds-karaf/2.0.0-SNAPSHOT/jclouds-karaf-2.0.0-20140810.064138-9-credentials.cfg (823 B at 2.9 KB/sec)
Uploading: https://repository.apache.org/content/repositories/snapshots/org/apache/jclouds/karaf/jclouds-karaf/2.0.0-SNAPSHOT/maven-metadata.xml
Uploaded: https://repository.apache.org/content/repositories/snapshots/org/apache/jclouds/karaf/jclouds-karaf/2.0.0-SNAPSHOT/maven-metadata.xml (2 KB at 4.5 KB/sec)
Uploading: https://repository.apache.org/content/repositories/snapshots/org/apache/jclouds/karaf/jclouds-karaf/2.0.0-SNAPSHOT/jclouds-karaf-2.0.0-20140810.064138-9-shell.cfg
Uploaded: https://repository.apache.org/content/repositories/snapshots/org/apache/jclouds/karaf/jclouds-karaf/2.0.0-SNAPSHOT/jclouds-karaf-2.0.0-20140810.064138-9-shell.cfg (3 KB at 7.9 KB/sec)
Uploading: https://repository.apache.org/content/repositories/snapshots/org/apache/jclouds/karaf/jclouds-karaf/2.0.0-SNAPSHOT/maven-metadata.xml
Uploaded: https://repository.apache.org/content/repositories/snapshots/org/apache/jclouds/karaf/jclouds-karaf/2.0.0-SNAPSHOT/maven-metadata.xml (2 KB at 4.5 KB/sec)
[INFO]
[INFO] ------------------------------------------------------------------------
[INFO] Building jclouds :: Karaf :: Integration Tests 2.0.0-SNAPSHOT
[INFO] ------------------------------------------------------------------------
[INFO]
[INFO] --- maven-clean-plugin:2.5:clean (default-clean) @ itests ---
[INFO] Deleting <https://jclouds.ci.cloudbees.com/job/jclouds-karaf/ws/itests/target>
[INFO]
[INFO] --- maven-remote-resources-plugin:1.5:process (default) @ itests ---
Downloading: http://repo.cloudbees.com/content/repositories/central/org/eclipse/osgi/3.8.0.v20120529-1548/osgi-3.8.0.v20120529-1548.pom
Downloading: https://repository-jclouds.forge.cloudbees.com/release/org/eclipse/osgi/3.8.0.v20120529-1548/osgi-3.8.0.v20120529-1548.pom
Downloading: https://oss.sonatype.org/content/repositories/releases/org/eclipse/osgi/3.8.0.v20120529-1548/osgi-3.8.0.v20120529-1548.pom
Downloading: http://download.java.net/maven/2/org/eclipse/osgi/3.8.0.v20120529-1548/osgi-3.8.0.v20120529-1548.pom
[INFO] ------------------------------------------------------------------------
[INFO] Reactor Summary:
[INFO]
[INFO] Apache jclouds :: Karaf ........................... SUCCESS [2:18.081s]
[INFO] jclouds :: Karaf :: Core .......................... SUCCESS [23.794s]
[INFO] jclouds :: Karaf :: Utils ......................... SUCCESS [9.887s]
[INFO] jclouds :: Karaf :: Recipe ........................ SUCCESS [8.899s]
[INFO] jclouds :: Karaf :: Cache ......................... SUCCESS [11.006s]
[INFO] jclouds :: Karaf :: Services ...................... SUCCESS [39.186s]
[INFO] jclouds :: Karaf :: Commands ...................... SUCCESS [40.211s]
[INFO] jclouds :: Karaf :: URL Handler ................... SUCCESS [8.181s]
[INFO] jclouds :: Karaf :: Chef .......................... SUCCESS [2.898s]
[INFO] jclouds :: Karaf :: Chef :: Core .................. SUCCESS [10.814s]
[INFO] jclouds :: Karaf :: Chef :: Services .............. SUCCESS [11.871s]
[INFO] jclouds :: Karaf :: Chef :: Commands .............. SUCCESS [12.555s]
[INFO] jclouds :: Karaf :: Chef :: Cache ................. SUCCESS [6.411s]
[INFO] jclouds :: Karaf :: Feature ....................... SUCCESS [1:08.390s]
[INFO] jclouds :: Karaf :: Integration Tests ............. FAILURE [1:01.818s]
[INFO] ------------------------------------------------------------------------
[INFO] BUILD FAILURE
[INFO] ------------------------------------------------------------------------
[INFO] Total time: 8:17.505s
[INFO] Finished at: Sun Aug 10 02:42:45 EDT 2014
[INFO] Final Memory: 92M/239M
[INFO] ------------------------------------------------------------------------
Waiting for Jenkins to finish collecting data
[ERROR] Failed to execute goal org.apache.maven.plugins:maven-remote-resources-plugin:1.5:process (default) on project itests: Error resolving project artifact: Could not transfer artifact org.eclipse:osgi:pom:3.8.0.v20120529-1548 from/to cloudbees-private-release-repository (https://repository-jclouds.forge.cloudbees.com/release): Access denied to: https://repository-jclouds.forge.cloudbees.com/release/org/eclipse/osgi/3.8.0.v20120529-1548/osgi-3.8.0.v20120529-1548.pom for project org.eclipse:osgi:jar:3.8.0.v20120529-1548 -> [Help 1]
org.apache.maven.lifecycle.LifecycleExecutionException: Failed to execute goal org.apache.maven.plugins:maven-remote-resources-plugin:1.5:process (default) on project itests: Error resolving project artifact: Could not transfer artifact org.eclipse:osgi:pom:3.8.0.v20120529-1548 from/to cloudbees-private-release-repository (https://repository-jclouds.forge.cloudbees.com/release): Access denied to: https://repository-jclouds.forge.cloudbees.com/release/org/eclipse/osgi/3.8.0.v20120529-1548/osgi-3.8.0.v20120529-1548.pom for project org.eclipse:osgi:jar:3.8.0.v20120529-1548
at org.apache.maven.lifecycle.internal.MojoExecutor.execute(MojoExecutor.java:217)
at org.apache.maven.lifecycle.internal.MojoExecutor.execute(MojoExecutor.java:153)
at org.apache.maven.lifecycle.internal.MojoExecutor.execute(MojoExecutor.java:145)
at org.apache.maven.lifecycle.internal.LifecycleModuleBuilder.buildProject(LifecycleModuleBuilder.java:84)
at org.apache.maven.lifecycle.internal.LifecycleModuleBuilder.buildProject(LifecycleModuleBuilder.java:59)
at org.apache.maven.lifecycle.internal.LifecycleStarter.singleThreadedBuild(LifecycleStarter.java:183)
at org.apache.maven.lifecycle.internal.LifecycleStarter.execute(LifecycleStarter.java:161)
at org.apache.maven.DefaultMaven.doExecute(DefaultMaven.java:319)
at org.apache.maven.DefaultMaven.execute(DefaultMaven.java:156)
at org.jvnet.hudson.maven3.launcher.Maven3Launcher.main(Maven3Launcher.java:117)
at sun.reflect.NativeMethodAccessorImpl.invoke0(Native Method)
at sun.reflect.NativeMethodAccessorImpl.invoke(NativeMethodAccessorImpl.java:57)
at sun.reflect.DelegatingMethodAccessorImpl.invoke(DelegatingMethodAccessorImpl.java:43)
at java.lang.reflect.Method.invoke(Method.java:606)
at org.codehaus.plexus.classworlds.launcher.Launcher.launchStandard(Launcher.java:329)
at org.codehaus.plexus.classworlds.launcher.Launcher.launch(Launcher.java:239)
at org.jvnet.hudson.maven3.agent.Maven3Main.launch(Maven3Main.java:178)
at sun.reflect.NativeMethodAccessorImpl.invoke0(Native Method)
at sun.reflect.NativeMethodAccessorImpl.invoke(NativeMethodAccessorImpl.java:57)
at sun.reflect.DelegatingMethodAccessorImpl.invoke(DelegatingMethodAccessorImpl.java:43)
at java.lang.reflect.Method.invoke(Method.java:606)
at hudson.maven.Maven3Builder.call(Maven3Builder.java:134)
at hudson.maven.Maven3Builder.call(Maven3Builder.java:69)
at hudson.remoting.UserRequest.perform(UserRequest.java:118)
at hudson.remoting.UserRequest.perform(UserRequest.java:48)
at hudson.remoting.Request$2.run(Request.java:328)
at hudson.remoting.InterceptingExecutorService$1.call(InterceptingExecutorService.java:72)
at java.util.concurrent.FutureTask.run(FutureTask.java:262)
at java.util.concurrent.ThreadPoolExecutor.runWorker(ThreadPoolExecutor.java:1145)
at java.util.concurrent.ThreadPoolExecutor$Worker.run(ThreadPoolExecutor.java:615)
at java.lang.Thread.run(Thread.java:744)
Caused by: org.apache.maven.plugin.MojoExecutionException: Error resolving project artifact: Could not transfer artifact org.eclipse:osgi:pom:3.8.0.v20120529-1548 from/to cloudbees-private-release-repository (https://repository-jclouds.forge.cloudbees.com/release): Access denied to: https://repository-jclouds.forge.cloudbees.com/release/org/eclipse/osgi/3.8.0.v20120529-1548/osgi-3.8.0.v20120529-1548.pom for project org.eclipse:osgi:jar:3.8.0.v20120529-1548
at org.apache.maven.plugin.resources.remote.ProcessRemoteResourcesMojo.getProjects(ProcessRemoteResourcesMojo.java:701)
at org.apache.maven.plugin.resources.remote.ProcessRemoteResourcesMojo.configureVelocityContext(ProcessRemoteResourcesMojo.java:1009)
at org.apache.maven.plugin.resources.remote.ProcessRemoteResourcesMojo.execute(ProcessRemoteResourcesMojo.java:513)
at org.apache.maven.plugin.DefaultBuildPluginManager.executeMojo(DefaultBuildPluginManager.java:101)
at org.apache.maven.lifecycle.internal.MojoExecutor.execute(MojoExecutor.java:209)
... 30 more
Caused by: org.apache.maven.project.ProjectBuildingException: Error resolving project artifact: Could not transfer artifact org.eclipse:osgi:pom:3.8.0.v20120529-1548 from/to cloudbees-private-release-repository (https://repository-jclouds.forge.cloudbees.com/release): Access denied to: https://repository-jclouds.forge.cloudbees.com/release/org/eclipse/osgi/3.8.0.v20120529-1548/osgi-3.8.0.v20120529-1548.pom for project org.eclipse:osgi:jar:3.8.0.v20120529-1548
at org.apache.maven.project.DefaultProjectBuilder.build(DefaultProjectBuilder.java:272)
at org.apache.maven.project.DefaultMavenProjectBuilder.buildFromRepository(DefaultMavenProjectBuilder.java:237)
at org.apache.maven.project.DefaultMavenProjectBuilder.buildFromRepository(DefaultMavenProjectBuilder.java:252)
at org.apache.maven.project.DefaultMavenProjectBuilder.buildFromRepository(DefaultMavenProjectBuilder.java:259)
at org.apache.maven.plugin.resources.remote.ProcessRemoteResourcesMojo.getProjects(ProcessRemoteResourcesMojo.java:671)
... 34 more
Caused by: org.sonatype.aether.resolution.ArtifactResolutionException: Could not transfer artifact org.eclipse:osgi:pom:3.8.0.v20120529-1548 from/to cloudbees-private-release-repository (https://repository-jclouds.forge.cloudbees.com/release): Access denied to: https://repository-jclouds.forge.cloudbees.com/release/org/eclipse/osgi/3.8.0.v20120529-1548/osgi-3.8.0.v20120529-1548.pom
at org.sonatype.aether.impl.internal.DefaultArtifactResolver.resolve(DefaultArtifactResolver.java:541)
at org.sonatype.aether.impl.internal.DefaultArtifactResolver.resolveArtifacts(DefaultArtifactResolver.java:220)
at org.sonatype.aether.impl.internal.DefaultArtifactResolver.resolveArtifact(DefaultArtifactResolver.java:197)
at org.sonatype.aether.impl.internal.DefaultRepositorySystem.resolveArtifact(DefaultRepositorySystem.java:323)
at org.apache.maven.project.DefaultProjectBuilder.build(DefaultProjectBuilder.java:261)
... 38 more
Caused by: org.sonatype.aether.transfer.ArtifactTransferException: Could not transfer artifact org.eclipse:osgi:pom:3.8.0.v20120529-1548 from/to cloudbees-private-release-repository (https://repository-jclouds.forge.cloudbees.com/release): Access denied to: https://repository-jclouds.forge.cloudbees.com/release/org/eclipse/osgi/3.8.0.v20120529-1548/osgi-3.8.0.v20120529-1548.pom
at org.sonatype.aether.connector.wagon.WagonRepositoryConnector$4.wrap(WagonRepositoryConnector.java:949)
at org.sonatype.aether.connector.wagon.WagonRepositoryConnector$4.wrap(WagonRepositoryConnector.java:940)
at org.sonatype.aether.connector.wagon.WagonRepositoryConnector$GetTask.flush(WagonRepositoryConnector.java:695)
at org.sonatype.aether.connector.wagon.WagonRepositoryConnector$GetTask.flush(WagonRepositoryConnector.java:689)
at org.sonatype.aether.connector.wagon.WagonRepositoryConnector.get(WagonRepositoryConnector.java:445)
at org.sonatype.aether.impl.internal.DefaultArtifactResolver.resolve(DefaultArtifactResolver.java:460)
... 42 more
Caused by: org.apache.maven.wagon.authorization.AuthorizationException: Access denied to: https://repository-jclouds.forge.cloudbees.com/release/org/eclipse/osgi/3.8.0.v20120529-1548/osgi-3.8.0.v20120529-1548.pom
at org.apache.maven.wagon.providers.http.LightweightHttpWagon.resourceExists(LightweightHttpWagon.java:348)
at org.sonatype.aether.connector.wagon.WagonRepositoryConnector$GetTask.run(WagonRepositoryConnector.java:584)
at org.sonatype.aether.util.concurrency.RunnableErrorForwarder$1.run(RunnableErrorForwarder.java:64)
... 3 more
[ERROR]
[ERROR] Re-run Maven using the -X switch to enable full debug logging.
[ERROR]
[ERROR] For more information about the errors and possible solutions, please read the following articles:
[ERROR] [Help 1] http://cwiki.apache.org/confluence/display/MAVEN/MojoExecutionException
[ERROR]
[ERROR] After correcting the problems, you can resume the build with the command
[ERROR] mvn <goals> -rf :itests
[JENKINS] Archiving <https://jclouds.ci.cloudbees.com/job/jclouds-karaf/ws/chef/commands/pom.xml> to org.apache.jclouds.karaf.chef/commands/2.0.0-SNAPSHOT/commands-2.0.0-SNAPSHOT.pom
[JENKINS] Archiving <https://jclouds.ci.cloudbees.com/job/jclouds-karaf/ws/chef/commands/target/commands-2.0.0-SNAPSHOT.jar> to org.apache.jclouds.karaf.chef/commands/2.0.0-20140810.064025-9/commands-2.0.0-20140810.064025-9.jar
[JENKINS] Archiving <https://jclouds.ci.cloudbees.com/job/jclouds-karaf/ws/chef/cache/pom.xml> to org.apache.jclouds.karaf.chef/cache/2.0.0-SNAPSHOT/cache-2.0.0-SNAPSHOT.pom
[JENKINS] Archiving <https://jclouds.ci.cloudbees.com/job/jclouds-karaf/ws/chef/cache/target/cache-2.0.0-SNAPSHOT.jar> to org.apache.jclouds.karaf.chef/cache/2.0.0-20140810.064032-9/cache-2.0.0-20140810.064032-9.jar
[JENKINS] Archiving <https://jclouds.ci.cloudbees.com/job/jclouds-karaf/ws/commands/pom.xml> to org.apache.jclouds.karaf/commands/2.0.0-SNAPSHOT/commands-2.0.0-SNAPSHOT.pom
[JENKINS] Archiving <https://jclouds.ci.cloudbees.com/job/jclouds-karaf/ws/commands/target/commands-2.0.0-SNAPSHOT.jar> to org.apache.jclouds.karaf/commands/2.0.0-20140810.063936-9/commands-2.0.0-20140810.063936-9.jar
[JENKINS] Archiving <https://jclouds.ci.cloudbees.com/job/jclouds-karaf/ws/utils/pom.xml> to org.apache.jclouds.karaf/utils/2.0.0-SNAPSHOT/utils-2.0.0-SNAPSHOT.pom
[JENKINS] Archiving <https://jclouds.ci.cloudbees.com/job/jclouds-karaf/ws/utils/target/utils-2.0.0-SNAPSHOT.jar> to org.apache.jclouds.karaf/utils/2.0.0-20140810.063756-10/utils-2.0.0-20140810.063756-10.jar
[JENKINS] Archiving <https://jclouds.ci.cloudbees.com/job/jclouds-karaf/ws/feature/pom.xml> to org.apache.jclouds.karaf/jclouds-karaf/2.0.0-SNAPSHOT/jclouds-karaf-2.0.0-SNAPSHOT.pom
[JENKINS] Archiving <https://jclouds.ci.cloudbees.com/job/jclouds-karaf/ws/feature/target/feature.xml> to org.apache.jclouds.karaf/jclouds-karaf/2.0.0-20140810.064138-9/jclouds-karaf-2.0.0-20140810.064138-9-features.xml
[JENKINS] Archiving <https://jclouds.ci.cloudbees.com/job/jclouds-karaf/ws/feature/target/credentials.cfg> to org.apache.jclouds.karaf/jclouds-karaf/2.0.0-20140810.064138-9/jclouds-karaf-2.0.0-20140810.064138-9-credentials.cfg
[JENKINS] Archiving <https://jclouds.ci.cloudbees.com/job/jclouds-karaf/ws/feature/target/shell.cfg> to org.apache.jclouds.karaf/jclouds-karaf/2.0.0-20140810.064138-9/jclouds-karaf-2.0.0-20140810.064138-9-shell.cfg
[JENKINS] Archiving <https://jclouds.ci.cloudbees.com/job/jclouds-karaf/ws/itests/pom.xml> to org.apache.jclouds.karaf/itests/2.0.0-SNAPSHOT/itests-2.0.0-SNAPSHOT.pom
[JENKINS] Archiving <https://jclouds.ci.cloudbees.com/job/jclouds-karaf/ws/chef/core/pom.xml> to org.apache.jclouds.karaf.chef/core/2.0.0-SNAPSHOT/core-2.0.0-SNAPSHOT.pom
[JENKINS] Archiving <https://jclouds.ci.cloudbees.com/job/jclouds-karaf/ws/chef/core/target/core-2.0.0-SNAPSHOT.jar> to org.apache.jclouds.karaf.chef/core/2.0.0-20140810.064000-9/core-2.0.0-20140810.064000-9.jar
[JENKINS] Archiving <https://jclouds.ci.cloudbees.com/job/jclouds-karaf/ws/urlhandler/pom.xml> to org.apache.jclouds.karaf/urlhandler/2.0.0-SNAPSHOT/urlhandler-2.0.0-SNAPSHOT.pom
[JENKINS] Archiving <https://jclouds.ci.cloudbees.com/job/jclouds-karaf/ws/urlhandler/target/urlhandler-2.0.0-SNAPSHOT.jar> to org.apache.jclouds.karaf/urlhandler/2.0.0-20140810.063945-9/urlhandler-2.0.0-20140810.063945-9.jar
[JENKINS] Archiving <https://jclouds.ci.cloudbees.com/job/jclouds-karaf/ws/services/pom.xml> to org.apache.jclouds.karaf/services/2.0.0-SNAPSHOT/services-2.0.0-SNAPSHOT.pom
[JENKINS] Archiving <https://jclouds.ci.cloudbees.com/job/jclouds-karaf/ws/services/target/services-2.0.0-SNAPSHOT.jar> to org.apache.jclouds.karaf/services/2.0.0-20140810.063856-9/services-2.0.0-20140810.063856-9.jar
[JENKINS] Archiving <https://jclouds.ci.cloudbees.com/job/jclouds-karaf/ws/core/pom.xml> to org.apache.jclouds.karaf/core/2.0.0-SNAPSHOT/core-2.0.0-SNAPSHOT.pom
[JENKINS] Archiving <https://jclouds.ci.cloudbees.com/job/jclouds-karaf/ws/core/target/core-2.0.0-SNAPSHOT.jar> to org.apache.jclouds.karaf/core/2.0.0-20140810.063746-10/core-2.0.0-20140810.063746-10.jar
[JENKINS] Archiving <https://jclouds.ci.cloudbees.com/job/jclouds-karaf/ws/recipe/pom.xml> to org.apache.jclouds.karaf/recipe/2.0.0-SNAPSHOT/recipe-2.0.0-SNAPSHOT.pom
[JENKINS] Archiving <https://jclouds.ci.cloudbees.com/job/jclouds-karaf/ws/recipe/target/recipe-2.0.0-SNAPSHOT.jar> to org.apache.jclouds.karaf/recipe/2.0.0-20140810.063805-10/recipe-2.0.0-20140810.063805-10.jar
[JENKINS] Archiving <https://jclouds.ci.cloudbees.com/job/jclouds-karaf/ws/chef/services/pom.xml> to org.apache.jclouds.karaf.chef/services/2.0.0-SNAPSHOT/services-2.0.0-SNAPSHOT.pom
[JENKINS] Archiving <https://jclouds.ci.cloudbees.com/job/jclouds-karaf/ws/chef/services/target/services-2.0.0-SNAPSHOT.jar> to org.apache.jclouds.karaf.chef/services/2.0.0-20140810.064012-9/services-2.0.0-20140810.064012-9.jar
[JENKINS] Archiving <https://jclouds.ci.cloudbees.com/job/jclouds-karaf/ws/chef/pom.xml> to org.apache.jclouds.karaf/chef/2.0.0-SNAPSHOT/chef-2.0.0-SNAPSHOT.pom
[JENKINS] Archiving <https://jclouds.ci.cloudbees.com/job/jclouds-karaf/ws/cache/pom.xml> to org.apache.jclouds.karaf/cache/2.0.0-SNAPSHOT/cache-2.0.0-SNAPSHOT.pom
[JENKINS] Archiving <https://jclouds.ci.cloudbees.com/job/jclouds-karaf/ws/cache/target/cache-2.0.0-SNAPSHOT.jar> to org.apache.jclouds.karaf/cache/2.0.0-20140810.063817-10/cache-2.0.0-20140810.063817-10.jar
[JENKINS] Archiving <https://jclouds.ci.cloudbees.com/job/jclouds-karaf/ws/pom.xml> to org.apache.jclouds/jclouds-karaf/2.0.0-SNAPSHOT/jclouds-karaf-2.0.0-SNAPSHOT.pom
channel stopped
Build failed in Jenkins: jclouds-karaf #660
Posted by je...@cloudbees.com.
See <https://jclouds.ci.cloudbees.com/job/jclouds-karaf/660/>
------------------------------------------
[...truncated 2581 lines...]
Downloading: https://repository-jclouds.forge.cloudbees.com/snapshot/org/apache/jclouds/provider/rackspace-cloudloadbalancers-uk/2.0.0-SNAPSHOT/maven-metadata.xml
Downloading: http://download.java.net/maven/2/org/apache/jclouds/provider/rackspace-cloudloadbalancers-uk/2.0.0-SNAPSHOT/maven-metadata.xml
Downloading: http://repository.apache.org/snapshots/org/apache/jclouds/provider/rackspace-cloudloadbalancers-uk/2.0.0-SNAPSHOT/maven-metadata.xml
Downloaded: http://repository.apache.org/snapshots/org/apache/jclouds/provider/rackspace-cloudloadbalancers-uk/2.0.0-SNAPSHOT/maven-metadata.xml (2 KB at 3.4 KB/sec)
Downloaded: https://repository.apache.org/content/repositories/snapshots/org/apache/jclouds/provider/rackspace-cloudloadbalancers-uk/2.0.0-SNAPSHOT/maven-metadata.xml (2 KB at 3.0 KB/sec)
[WARNING] Could not transfer metadata org.apache.jclouds.provider:rackspace-cloudloadbalancers-uk:2.0.0-SNAPSHOT/maven-metadata.xml from/to cloudbees-private-snapshot-repository (https://repository-jclouds.forge.cloudbees.com/snapshot): Access denied to: https://repository-jclouds.forge.cloudbees.com/snapshot/org/apache/jclouds/provider/rackspace-cloudloadbalancers-uk/2.0.0-SNAPSHOT/maven-metadata.xml
[INFO] Copying bundle: org.apache.jclouds.provider:glesys:jar:2.0.0-SNAPSHOT
Downloading: https://repository-jclouds.forge.cloudbees.com/snapshot/org/apache/jclouds/provider/glesys/2.0.0-SNAPSHOT/maven-metadata.xml
Downloading: https://repository.apache.org/content/repositories/snapshots/org/apache/jclouds/provider/glesys/2.0.0-SNAPSHOT/maven-metadata.xml
Downloading: http://download.java.net/maven/2/org/apache/jclouds/provider/glesys/2.0.0-SNAPSHOT/maven-metadata.xml
Downloading: https://oss.sonatype.org/content/repositories/releases/org/apache/jclouds/provider/glesys/2.0.0-SNAPSHOT/maven-metadata.xml
Downloading: http://repository.apache.org/snapshots/org/apache/jclouds/provider/glesys/2.0.0-SNAPSHOT/maven-metadata.xml
Downloaded: https://repository.apache.org/content/repositories/snapshots/org/apache/jclouds/provider/glesys/2.0.0-SNAPSHOT/maven-metadata.xml (2 KB at 5.2 KB/sec)
Downloaded: http://repository.apache.org/snapshots/org/apache/jclouds/provider/glesys/2.0.0-SNAPSHOT/maven-metadata.xml (2 KB at 4.5 KB/sec)
[WARNING] Could not transfer metadata org.apache.jclouds.provider:glesys:2.0.0-SNAPSHOT/maven-metadata.xml from/to cloudbees-private-snapshot-repository (https://repository-jclouds.forge.cloudbees.com/snapshot): Access denied to: https://repository-jclouds.forge.cloudbees.com/snapshot/org/apache/jclouds/provider/glesys/2.0.0-SNAPSHOT/maven-metadata.xml
[INFO] Copying bundle: org.apache.jclouds:jclouds-compute:jar:2.0.0-SNAPSHOT
[INFO] Copying bundle: org.apache.jclouds.driver:jclouds-enterprise:jar:2.0.0-SNAPSHOT
Downloading: https://repository-jclouds.forge.cloudbees.com/snapshot/org/apache/jclouds/driver/jclouds-enterprise/2.0.0-SNAPSHOT/maven-metadata.xml
Downloading: https://repository.apache.org/content/repositories/snapshots/org/apache/jclouds/driver/jclouds-enterprise/2.0.0-SNAPSHOT/maven-metadata.xml
Downloading: http://download.java.net/maven/2/org/apache/jclouds/driver/jclouds-enterprise/2.0.0-SNAPSHOT/maven-metadata.xml
Downloading: https://oss.sonatype.org/content/repositories/releases/org/apache/jclouds/driver/jclouds-enterprise/2.0.0-SNAPSHOT/maven-metadata.xml
Downloading: http://repository.apache.org/snapshots/org/apache/jclouds/driver/jclouds-enterprise/2.0.0-SNAPSHOT/maven-metadata.xml
Downloaded: https://repository.apache.org/content/repositories/snapshots/org/apache/jclouds/driver/jclouds-enterprise/2.0.0-SNAPSHOT/maven-metadata.xml (2 KB at 5.4 KB/sec)
Downloaded: http://repository.apache.org/snapshots/org/apache/jclouds/driver/jclouds-enterprise/2.0.0-SNAPSHOT/maven-metadata.xml (2 KB at 3.5 KB/sec)
[WARNING] Could not transfer metadata org.apache.jclouds.driver:jclouds-enterprise:2.0.0-SNAPSHOT/maven-metadata.xml from/to cloudbees-private-snapshot-repository (https://repository-jclouds.forge.cloudbees.com/snapshot): Access denied to: https://repository-jclouds.forge.cloudbees.com/snapshot/org/apache/jclouds/driver/jclouds-enterprise/2.0.0-SNAPSHOT/maven-metadata.xml
[INFO] Copying bundle: org.apache.jclouds.api:openstack-keystone:jar:2.0.0-SNAPSHOT
Downloading: https://repository-jclouds.forge.cloudbees.com/snapshot/org/apache/jclouds/api/openstack-keystone/2.0.0-SNAPSHOT/maven-metadata.xml
Downloading: https://repository.apache.org/content/repositories/snapshots/org/apache/jclouds/api/openstack-keystone/2.0.0-SNAPSHOT/maven-metadata.xml
Downloading: http://download.java.net/maven/2/org/apache/jclouds/api/openstack-keystone/2.0.0-SNAPSHOT/maven-metadata.xml
Downloading: https://oss.sonatype.org/content/repositories/releases/org/apache/jclouds/api/openstack-keystone/2.0.0-SNAPSHOT/maven-metadata.xml
Downloading: http://repository.apache.org/snapshots/org/apache/jclouds/api/openstack-keystone/2.0.0-SNAPSHOT/maven-metadata.xml
Downloaded: https://repository.apache.org/content/repositories/snapshots/org/apache/jclouds/api/openstack-keystone/2.0.0-SNAPSHOT/maven-metadata.xml (2 KB at 7.8 KB/sec)
Downloaded: http://repository.apache.org/snapshots/org/apache/jclouds/api/openstack-keystone/2.0.0-SNAPSHOT/maven-metadata.xml (2 KB at 7.1 KB/sec)
[WARNING] Could not transfer metadata org.apache.jclouds.api:openstack-keystone:2.0.0-SNAPSHOT/maven-metadata.xml from/to cloudbees-private-snapshot-repository (https://repository-jclouds.forge.cloudbees.com/snapshot): Access denied to: https://repository-jclouds.forge.cloudbees.com/snapshot/org/apache/jclouds/api/openstack-keystone/2.0.0-SNAPSHOT/maven-metadata.xml
[INFO] Copying bundle: org.apache.servicemix.bundles:org.apache.servicemix.bundles.jersey-core:jar:1.11_1
[INFO]
[INFO] --- maven-bundle-plugin:2.1.0:manifest (bundle-manifest) @ jclouds-karaf ---
[WARNING] Ignoring project type pom - supportedProjectTypes = [jar, war, bundle]
[INFO]
[INFO] --- maven-site-plugin:3.3:attach-descriptor (attach-descriptor) @ jclouds-karaf ---
[INFO]
[INFO] --- apache-rat-plugin:0.10:check (default) @ jclouds-karaf ---
[INFO] 51 implicit excludes (use -debug for more details).
[INFO] Exclude: **/LICENSE.txt
[INFO] Exclude: **/header.txt
[INFO] Exclude: **/NOTICE.txt
[INFO] Exclude: **/DISCLAIMER
[INFO] Exclude: **/BUILD.txt
[INFO] Exclude: **/CHANGES.txt
[INFO] Exclude: **/README.md
[INFO] Exclude: **/README.txt
[INFO] Exclude: **/DEPENDENCIES
[INFO] Exclude: **/CONTRIBUTING.md
[INFO] Exclude: .git/**
[INFO] Exclude: **/.gitignore
[INFO] Exclude: **/*.json
[INFO] Exclude: **/*.log*
[INFO] Exclude: **/TODO
[INFO] Exclude: .mailmap
[INFO] Exclude: .idea/**
[INFO] Exclude: **/*.iml
[INFO] Exclude: **/.project
[INFO] Exclude: **/.classpath
[INFO] Exclude: **/.settings/**
[INFO] Exclude: **/.checkstyle
[INFO] Exclude: **/target/**
[INFO] Exclude: .repository/**
[INFO] Exclude: **/src/main/resources/**/*.txt
[INFO] 4 resources included (use -debug for more details)
Warning: org.apache.xerces.jaxp.SAXParserImpl$JAXPSAXParser: Property 'http://www.oracle.com/xml/jaxp/properties/entityExpansionLimit' is not recognized.
Compiler warnings:
WARNING: 'org.apache.xerces.jaxp.SAXParserImpl: Property 'http://javax.xml.XMLConstants/property/accessExternalDTD' is not recognized.'
Warning: org.apache.xerces.parsers.SAXParser: Feature 'http://javax.xml.XMLConstants/feature/secure-processing' is not recognized.
Warning: org.apache.xerces.parsers.SAXParser: Property 'http://javax.xml.XMLConstants/property/accessExternalDTD' is not recognized.
Warning: org.apache.xerces.parsers.SAXParser: Property 'http://www.oracle.com/xml/jaxp/properties/entityExpansionLimit' is not recognized.
[INFO] Rat check: Summary of files. Unapproved: 0 unknown: 0 generated: 0 approved: 4 licence.
[INFO]
[INFO] --- maven-install-plugin:2.5.1:install (default-install) @ jclouds-karaf ---
[INFO] Installing <https://jclouds.ci.cloudbees.com/job/jclouds-karaf/ws/feature/pom.xml> to /home/jenkins/.m2/repository/org/apache/jclouds/karaf/jclouds-karaf/2.0.0-SNAPSHOT/jclouds-karaf-2.0.0-SNAPSHOT.pom
[INFO] Installing <https://jclouds.ci.cloudbees.com/job/jclouds-karaf/ws/feature/target/feature.xml> to /home/jenkins/.m2/repository/org/apache/jclouds/karaf/jclouds-karaf/2.0.0-SNAPSHOT/jclouds-karaf-2.0.0-SNAPSHOT-features.xml
[INFO] Installing <https://jclouds.ci.cloudbees.com/job/jclouds-karaf/ws/feature/target/credentials.cfg> to /home/jenkins/.m2/repository/org/apache/jclouds/karaf/jclouds-karaf/2.0.0-SNAPSHOT/jclouds-karaf-2.0.0-SNAPSHOT-credentials.cfg
[INFO] Installing <https://jclouds.ci.cloudbees.com/job/jclouds-karaf/ws/feature/target/shell.cfg> to /home/jenkins/.m2/repository/org/apache/jclouds/karaf/jclouds-karaf/2.0.0-SNAPSHOT/jclouds-karaf-2.0.0-SNAPSHOT-shell.cfg
[INFO]
[INFO] --- maven-deploy-plugin:2.8.1:deploy (default-deploy) @ jclouds-karaf ---
Downloading: https://repository.apache.org/content/repositories/snapshots/org/apache/jclouds/karaf/jclouds-karaf/2.0.0-SNAPSHOT/maven-metadata.xml
Downloaded: https://repository.apache.org/content/repositories/snapshots/org/apache/jclouds/karaf/jclouds-karaf/2.0.0-SNAPSHOT/maven-metadata.xml (2 KB at 2.1 KB/sec)
Uploading: https://repository.apache.org/content/repositories/snapshots/org/apache/jclouds/karaf/jclouds-karaf/2.0.0-SNAPSHOT/jclouds-karaf-2.0.0-20140811.182548-10.pom
Uploaded: https://repository.apache.org/content/repositories/snapshots/org/apache/jclouds/karaf/jclouds-karaf/2.0.0-SNAPSHOT/jclouds-karaf-2.0.0-20140811.182548-10.pom (8 KB at 25.6 KB/sec)
Downloading: https://repository.apache.org/content/repositories/snapshots/org/apache/jclouds/karaf/jclouds-karaf/maven-metadata.xml
Downloaded: https://repository.apache.org/content/repositories/snapshots/org/apache/jclouds/karaf/jclouds-karaf/maven-metadata.xml (598 B at 1.5 KB/sec)
Uploading: https://repository.apache.org/content/repositories/snapshots/org/apache/jclouds/karaf/jclouds-karaf/2.0.0-SNAPSHOT/maven-metadata.xml
Uploaded: https://repository.apache.org/content/repositories/snapshots/org/apache/jclouds/karaf/jclouds-karaf/2.0.0-SNAPSHOT/maven-metadata.xml (2 KB at 3.4 KB/sec)
Uploading: https://repository.apache.org/content/repositories/snapshots/org/apache/jclouds/karaf/jclouds-karaf/maven-metadata.xml
Uploaded: https://repository.apache.org/content/repositories/snapshots/org/apache/jclouds/karaf/jclouds-karaf/maven-metadata.xml (598 B at 1.9 KB/sec)
Uploading: https://repository.apache.org/content/repositories/snapshots/org/apache/jclouds/karaf/jclouds-karaf/2.0.0-SNAPSHOT/jclouds-karaf-2.0.0-20140811.182548-10-features.xml
Uploaded: https://repository.apache.org/content/repositories/snapshots/org/apache/jclouds/karaf/jclouds-karaf/2.0.0-SNAPSHOT/jclouds-karaf-2.0.0-20140811.182548-10-features.xml (32 KB at 71.2 KB/sec)
Uploading: https://repository.apache.org/content/repositories/snapshots/org/apache/jclouds/karaf/jclouds-karaf/2.0.0-SNAPSHOT/maven-metadata.xml
Uploaded: https://repository.apache.org/content/repositories/snapshots/org/apache/jclouds/karaf/jclouds-karaf/2.0.0-SNAPSHOT/maven-metadata.xml (2 KB at 4.4 KB/sec)
Uploading: https://repository.apache.org/content/repositories/snapshots/org/apache/jclouds/karaf/jclouds-karaf/2.0.0-SNAPSHOT/jclouds-karaf-2.0.0-20140811.182548-10-credentials.cfg
Uploaded: https://repository.apache.org/content/repositories/snapshots/org/apache/jclouds/karaf/jclouds-karaf/2.0.0-SNAPSHOT/jclouds-karaf-2.0.0-20140811.182548-10-credentials.cfg (823 B at 2.6 KB/sec)
Uploading: https://repository.apache.org/content/repositories/snapshots/org/apache/jclouds/karaf/jclouds-karaf/2.0.0-SNAPSHOT/maven-metadata.xml
Uploaded: https://repository.apache.org/content/repositories/snapshots/org/apache/jclouds/karaf/jclouds-karaf/2.0.0-SNAPSHOT/maven-metadata.xml (2 KB at 4.4 KB/sec)
Uploading: https://repository.apache.org/content/repositories/snapshots/org/apache/jclouds/karaf/jclouds-karaf/2.0.0-SNAPSHOT/jclouds-karaf-2.0.0-20140811.182548-10-shell.cfg
Uploaded: https://repository.apache.org/content/repositories/snapshots/org/apache/jclouds/karaf/jclouds-karaf/2.0.0-SNAPSHOT/jclouds-karaf-2.0.0-20140811.182548-10-shell.cfg (3 KB at 6.5 KB/sec)
Uploading: https://repository.apache.org/content/repositories/snapshots/org/apache/jclouds/karaf/jclouds-karaf/2.0.0-SNAPSHOT/maven-metadata.xml
Uploaded: https://repository.apache.org/content/repositories/snapshots/org/apache/jclouds/karaf/jclouds-karaf/2.0.0-SNAPSHOT/maven-metadata.xml (2 KB at 2.8 KB/sec)
[INFO]
[INFO] ------------------------------------------------------------------------
[INFO] Building jclouds :: Karaf :: Integration Tests 2.0.0-SNAPSHOT
[INFO] ------------------------------------------------------------------------
[INFO]
[INFO] --- maven-clean-plugin:2.5:clean (default-clean) @ itests ---
[INFO]
[INFO] --- maven-remote-resources-plugin:1.5:process (default) @ itests ---
Downloading: http://repo.cloudbees.com/content/repositories/central/org/eclipse/osgi/3.8.0.v20120529-1548/osgi-3.8.0.v20120529-1548.pom
Downloading: https://repository-jclouds.forge.cloudbees.com/release/org/eclipse/osgi/3.8.0.v20120529-1548/osgi-3.8.0.v20120529-1548.pom
Downloading: https://oss.sonatype.org/content/repositories/releases/org/eclipse/osgi/3.8.0.v20120529-1548/osgi-3.8.0.v20120529-1548.pom
Downloading: http://download.java.net/maven/2/org/eclipse/osgi/3.8.0.v20120529-1548/osgi-3.8.0.v20120529-1548.pom
[INFO] ------------------------------------------------------------------------
[INFO] Reactor Summary:
[INFO]
[INFO] Apache jclouds :: Karaf ........................... SUCCESS [27.567s]
[INFO] jclouds :: Karaf :: Core .......................... SUCCESS [20.414s]
[INFO] jclouds :: Karaf :: Utils ......................... SUCCESS [8.595s]
[INFO] jclouds :: Karaf :: Recipe ........................ SUCCESS [10.949s]
[INFO] jclouds :: Karaf :: Cache ......................... SUCCESS [9.186s]
[INFO] jclouds :: Karaf :: Services ...................... SUCCESS [42.634s]
[INFO] jclouds :: Karaf :: Commands ...................... SUCCESS [35.002s]
[INFO] jclouds :: Karaf :: URL Handler ................... SUCCESS [7.307s]
[INFO] jclouds :: Karaf :: Chef .......................... SUCCESS [2.371s]
[INFO] jclouds :: Karaf :: Chef :: Core .................. SUCCESS [10.735s]
[INFO] jclouds :: Karaf :: Chef :: Services .............. SUCCESS [9.868s]
[INFO] jclouds :: Karaf :: Chef :: Commands .............. SUCCESS [15.319s]
[INFO] jclouds :: Karaf :: Chef :: Cache ................. SUCCESS [14.118s]
[INFO] jclouds :: Karaf :: Feature ....................... SUCCESS [1:03.124s]
[INFO] jclouds :: Karaf :: Integration Tests ............. FAILURE [16.589s]
[INFO] ------------------------------------------------------------------------
[INFO] BUILD FAILURE
[INFO] ------------------------------------------------------------------------
[INFO] Total time: 5:08.442s
[INFO] Finished at: Mon Aug 11 14:26:10 EDT 2014
[INFO] Final Memory: 92M/209M
[INFO] ------------------------------------------------------------------------
Waiting for Jenkins to finish collecting data
[ERROR] Failed to execute goal org.apache.maven.plugins:maven-remote-resources-plugin:1.5:process (default) on project itests: Error resolving project artifact: Could not transfer artifact org.eclipse:osgi:pom:3.8.0.v20120529-1548 from/to cloudbees-private-release-repository (https://repository-jclouds.forge.cloudbees.com/release): Access denied to: https://repository-jclouds.forge.cloudbees.com/release/org/eclipse/osgi/3.8.0.v20120529-1548/osgi-3.8.0.v20120529-1548.pom for project org.eclipse:osgi:jar:3.8.0.v20120529-1548 -> [Help 1]
org.apache.maven.lifecycle.LifecycleExecutionException: Failed to execute goal org.apache.maven.plugins:maven-remote-resources-plugin:1.5:process (default) on project itests: Error resolving project artifact: Could not transfer artifact org.eclipse:osgi:pom:3.8.0.v20120529-1548 from/to cloudbees-private-release-repository (https://repository-jclouds.forge.cloudbees.com/release): Access denied to: https://repository-jclouds.forge.cloudbees.com/release/org/eclipse/osgi/3.8.0.v20120529-1548/osgi-3.8.0.v20120529-1548.pom for project org.eclipse:osgi:jar:3.8.0.v20120529-1548
at org.apache.maven.lifecycle.internal.MojoExecutor.execute(MojoExecutor.java:217)
at org.apache.maven.lifecycle.internal.MojoExecutor.execute(MojoExecutor.java:153)
at org.apache.maven.lifecycle.internal.MojoExecutor.execute(MojoExecutor.java:145)
at org.apache.maven.lifecycle.internal.LifecycleModuleBuilder.buildProject(LifecycleModuleBuilder.java:84)
at org.apache.maven.lifecycle.internal.LifecycleModuleBuilder.buildProject(LifecycleModuleBuilder.java:59)
at org.apache.maven.lifecycle.internal.LifecycleStarter.singleThreadedBuild(LifecycleStarter.java:183)
at org.apache.maven.lifecycle.internal.LifecycleStarter.execute(LifecycleStarter.java:161)
at org.apache.maven.DefaultMaven.doExecute(DefaultMaven.java:319)
at org.apache.maven.DefaultMaven.execute(DefaultMaven.java:156)
at org.jvnet.hudson.maven3.launcher.Maven3Launcher.main(Maven3Launcher.java:117)
at sun.reflect.NativeMethodAccessorImpl.invoke0(Native Method)
at sun.reflect.NativeMethodAccessorImpl.invoke(NativeMethodAccessorImpl.java:57)
at sun.reflect.DelegatingMethodAccessorImpl.invoke(DelegatingMethodAccessorImpl.java:43)
at java.lang.reflect.Method.invoke(Method.java:606)
at org.codehaus.plexus.classworlds.launcher.Launcher.launchStandard(Launcher.java:329)
at org.codehaus.plexus.classworlds.launcher.Launcher.launch(Launcher.java:239)
at org.jvnet.hudson.maven3.agent.Maven3Main.launch(Maven3Main.java:178)
at sun.reflect.NativeMethodAccessorImpl.invoke0(Native Method)
at sun.reflect.NativeMethodAccessorImpl.invoke(NativeMethodAccessorImpl.java:57)
at sun.reflect.DelegatingMethodAccessorImpl.invoke(DelegatingMethodAccessorImpl.java:43)
at java.lang.reflect.Method.invoke(Method.java:606)
at hudson.maven.Maven3Builder.call(Maven3Builder.java:134)
at hudson.maven.Maven3Builder.call(Maven3Builder.java:69)
at hudson.remoting.UserRequest.perform(UserRequest.java:118)
at hudson.remoting.UserRequest.perform(UserRequest.java:48)
at hudson.remoting.Request$2.run(Request.java:328)
at hudson.remoting.InterceptingExecutorService$1.call(InterceptingExecutorService.java:72)
at java.util.concurrent.FutureTask.run(FutureTask.java:262)
at java.util.concurrent.ThreadPoolExecutor.runWorker(ThreadPoolExecutor.java:1145)
at java.util.concurrent.ThreadPoolExecutor$Worker.run(ThreadPoolExecutor.java:615)
at java.lang.Thread.run(Thread.java:744)
Caused by: org.apache.maven.plugin.MojoExecutionException: Error resolving project artifact: Could not transfer artifact org.eclipse:osgi:pom:3.8.0.v20120529-1548 from/to cloudbees-private-release-repository (https://repository-jclouds.forge.cloudbees.com/release): Access denied to: https://repository-jclouds.forge.cloudbees.com/release/org/eclipse/osgi/3.8.0.v20120529-1548/osgi-3.8.0.v20120529-1548.pom for project org.eclipse:osgi:jar:3.8.0.v20120529-1548
at org.apache.maven.plugin.resources.remote.ProcessRemoteResourcesMojo.getProjects(ProcessRemoteResourcesMojo.java:701)
at org.apache.maven.plugin.resources.remote.ProcessRemoteResourcesMojo.configureVelocityContext(ProcessRemoteResourcesMojo.java:1009)
at org.apache.maven.plugin.resources.remote.ProcessRemoteResourcesMojo.execute(ProcessRemoteResourcesMojo.java:513)
at org.apache.maven.plugin.DefaultBuildPluginManager.executeMojo(DefaultBuildPluginManager.java:101)
at org.apache.maven.lifecycle.internal.MojoExecutor.execute(MojoExecutor.java:209)
... 30 more
Caused by: org.apache.maven.project.ProjectBuildingException: Error resolving project artifact: Could not transfer artifact org.eclipse:osgi:pom:3.8.0.v20120529-1548 from/to cloudbees-private-release-repository (https://repository-jclouds.forge.cloudbees.com/release): Access denied to: https://repository-jclouds.forge.cloudbees.com/release/org/eclipse/osgi/3.8.0.v20120529-1548/osgi-3.8.0.v20120529-1548.pom for project org.eclipse:osgi:jar:3.8.0.v20120529-1548
at org.apache.maven.project.DefaultProjectBuilder.build(DefaultProjectBuilder.java:272)
at org.apache.maven.project.DefaultMavenProjectBuilder.buildFromRepository(DefaultMavenProjectBuilder.java:237)
at org.apache.maven.project.DefaultMavenProjectBuilder.buildFromRepository(DefaultMavenProjectBuilder.java:252)
at org.apache.maven.project.DefaultMavenProjectBuilder.buildFromRepository(DefaultMavenProjectBuilder.java:259)
at org.apache.maven.plugin.resources.remote.ProcessRemoteResourcesMojo.getProjects(ProcessRemoteResourcesMojo.java:671)
... 34 more
Caused by: org.sonatype.aether.resolution.ArtifactResolutionException: Could not transfer artifact org.eclipse:osgi:pom:3.8.0.v20120529-1548 from/to cloudbees-private-release-repository (https://repository-jclouds.forge.cloudbees.com/release): Access denied to: https://repository-jclouds.forge.cloudbees.com/release/org/eclipse/osgi/3.8.0.v20120529-1548/osgi-3.8.0.v20120529-1548.pom
at org.sonatype.aether.impl.internal.DefaultArtifactResolver.resolve(DefaultArtifactResolver.java:541)
at org.sonatype.aether.impl.internal.DefaultArtifactResolver.resolveArtifacts(DefaultArtifactResolver.java:220)
at org.sonatype.aether.impl.internal.DefaultArtifactResolver.resolveArtifact(DefaultArtifactResolver.java:197)
at org.sonatype.aether.impl.internal.DefaultRepositorySystem.resolveArtifact(DefaultRepositorySystem.java:323)
at org.apache.maven.project.DefaultProjectBuilder.build(DefaultProjectBuilder.java:261)
... 38 more
Caused by: org.sonatype.aether.transfer.ArtifactTransferException: Could not transfer artifact org.eclipse:osgi:pom:3.8.0.v20120529-1548 from/to cloudbees-private-release-repository (https://repository-jclouds.forge.cloudbees.com/release): Access denied to: https://repository-jclouds.forge.cloudbees.com/release/org/eclipse/osgi/3.8.0.v20120529-1548/osgi-3.8.0.v20120529-1548.pom
at org.sonatype.aether.connector.wagon.WagonRepositoryConnector$4.wrap(WagonRepositoryConnector.java:949)
at org.sonatype.aether.connector.wagon.WagonRepositoryConnector$4.wrap(WagonRepositoryConnector.java:940)
at org.sonatype.aether.connector.wagon.WagonRepositoryConnector$GetTask.flush(WagonRepositoryConnector.java:695)
at org.sonatype.aether.connector.wagon.WagonRepositoryConnector$GetTask.flush(WagonRepositoryConnector.java:689)
at org.sonatype.aether.connector.wagon.WagonRepositoryConnector.get(WagonRepositoryConnector.java:445)
at org.sonatype.aether.impl.internal.DefaultArtifactResolver.resolve(DefaultArtifactResolver.java:460)
... 42 more
Caused by: org.apache.maven.wagon.authorization.AuthorizationException: Access denied to: https://repository-jclouds.forge.cloudbees.com/release/org/eclipse/osgi/3.8.0.v20120529-1548/osgi-3.8.0.v20120529-1548.pom
at org.apache.maven.wagon.providers.http.LightweightHttpWagon.resourceExists(LightweightHttpWagon.java:348)
at org.sonatype.aether.connector.wagon.WagonRepositoryConnector$GetTask.run(WagonRepositoryConnector.java:584)
at org.sonatype.aether.util.concurrency.RunnableErrorForwarder$1.run(RunnableErrorForwarder.java:64)
... 3 more
[ERROR]
[ERROR] Re-run Maven using the -X switch to enable full debug logging.
[ERROR]
[ERROR] For more information about the errors and possible solutions, please read the following articles:
[ERROR] [Help 1] http://cwiki.apache.org/confluence/display/MAVEN/MojoExecutionException
[ERROR]
[ERROR] After correcting the problems, you can resume the build with the command
[ERROR] mvn <goals> -rf :itests
[JENKINS] Archiving <https://jclouds.ci.cloudbees.com/job/jclouds-karaf/ws/chef/commands/pom.xml> to org.apache.jclouds.karaf.chef/commands/2.0.0-SNAPSHOT/commands-2.0.0-SNAPSHOT.pom
[JENKINS] Archiving <https://jclouds.ci.cloudbees.com/job/jclouds-karaf/ws/chef/commands/target/commands-2.0.0-SNAPSHOT.jar> to org.apache.jclouds.karaf.chef/commands/2.0.0-20140811.182432-10/commands-2.0.0-20140811.182432-10.jar
[JENKINS] Archiving <https://jclouds.ci.cloudbees.com/job/jclouds-karaf/ws/chef/cache/pom.xml> to org.apache.jclouds.karaf.chef/cache/2.0.0-SNAPSHOT/cache-2.0.0-SNAPSHOT.pom
[JENKINS] Archiving <https://jclouds.ci.cloudbees.com/job/jclouds-karaf/ws/chef/cache/target/cache-2.0.0-SNAPSHOT.jar> to org.apache.jclouds.karaf.chef/cache/2.0.0-20140811.182447-10/cache-2.0.0-20140811.182447-10.jar
[JENKINS] Archiving <https://jclouds.ci.cloudbees.com/job/jclouds-karaf/ws/commands/pom.xml> to org.apache.jclouds.karaf/commands/2.0.0-SNAPSHOT/commands-2.0.0-SNAPSHOT.pom
[JENKINS] Archiving <https://jclouds.ci.cloudbees.com/job/jclouds-karaf/ws/commands/target/commands-2.0.0-SNAPSHOT.jar> to org.apache.jclouds.karaf/commands/2.0.0-20140811.182343-10/commands-2.0.0-20140811.182343-10.jar
[JENKINS] Archiving <https://jclouds.ci.cloudbees.com/job/jclouds-karaf/ws/utils/pom.xml> to org.apache.jclouds.karaf/utils/2.0.0-SNAPSHOT/utils-2.0.0-SNAPSHOT.pom
[JENKINS] Archiving <https://jclouds.ci.cloudbees.com/job/jclouds-karaf/ws/utils/target/utils-2.0.0-SNAPSHOT.jar> to org.apache.jclouds.karaf/utils/2.0.0-20140811.182205-11/utils-2.0.0-20140811.182205-11.jar
[JENKINS] Archiving <https://jclouds.ci.cloudbees.com/job/jclouds-karaf/ws/feature/pom.xml> to org.apache.jclouds.karaf/jclouds-karaf/2.0.0-SNAPSHOT/jclouds-karaf-2.0.0-SNAPSHOT.pom
[JENKINS] Archiving <https://jclouds.ci.cloudbees.com/job/jclouds-karaf/ws/feature/target/feature.xml> to org.apache.jclouds.karaf/jclouds-karaf/2.0.0-20140811.182548-10/jclouds-karaf-2.0.0-20140811.182548-10-features.xml
[JENKINS] Archiving <https://jclouds.ci.cloudbees.com/job/jclouds-karaf/ws/feature/target/credentials.cfg> to org.apache.jclouds.karaf/jclouds-karaf/2.0.0-20140811.182548-10/jclouds-karaf-2.0.0-20140811.182548-10-credentials.cfg
[JENKINS] Archiving <https://jclouds.ci.cloudbees.com/job/jclouds-karaf/ws/feature/target/shell.cfg> to org.apache.jclouds.karaf/jclouds-karaf/2.0.0-20140811.182548-10/jclouds-karaf-2.0.0-20140811.182548-10-shell.cfg
[JENKINS] Archiving <https://jclouds.ci.cloudbees.com/job/jclouds-karaf/ws/itests/pom.xml> to org.apache.jclouds.karaf/itests/2.0.0-SNAPSHOT/itests-2.0.0-SNAPSHOT.pom
[JENKINS] Archiving <https://jclouds.ci.cloudbees.com/job/jclouds-karaf/ws/chef/core/pom.xml> to org.apache.jclouds.karaf.chef/core/2.0.0-SNAPSHOT/core-2.0.0-SNAPSHOT.pom
[JENKINS] Archiving <https://jclouds.ci.cloudbees.com/job/jclouds-karaf/ws/chef/core/target/core-2.0.0-SNAPSHOT.jar> to org.apache.jclouds.karaf.chef/core/2.0.0-20140811.182406-10/core-2.0.0-20140811.182406-10.jar
[JENKINS] Archiving <https://jclouds.ci.cloudbees.com/job/jclouds-karaf/ws/urlhandler/pom.xml> to org.apache.jclouds.karaf/urlhandler/2.0.0-SNAPSHOT/urlhandler-2.0.0-SNAPSHOT.pom
[JENKINS] Archiving <https://jclouds.ci.cloudbees.com/job/jclouds-karaf/ws/urlhandler/target/urlhandler-2.0.0-SNAPSHOT.jar> to org.apache.jclouds.karaf/urlhandler/2.0.0-20140811.182351-10/urlhandler-2.0.0-20140811.182351-10.jar
[JENKINS] Archiving <https://jclouds.ci.cloudbees.com/job/jclouds-karaf/ws/services/pom.xml> to org.apache.jclouds.karaf/services/2.0.0-SNAPSHOT/services-2.0.0-SNAPSHOT.pom
[JENKINS] Archiving <https://jclouds.ci.cloudbees.com/job/jclouds-karaf/ws/services/target/services-2.0.0-SNAPSHOT.jar> to org.apache.jclouds.karaf/services/2.0.0-20140811.182308-10/services-2.0.0-20140811.182308-10.jar
[JENKINS] Archiving <https://jclouds.ci.cloudbees.com/job/jclouds-karaf/ws/core/pom.xml> to org.apache.jclouds.karaf/core/2.0.0-SNAPSHOT/core-2.0.0-SNAPSHOT.pom
[JENKINS] Archiving <https://jclouds.ci.cloudbees.com/job/jclouds-karaf/ws/core/target/core-2.0.0-SNAPSHOT.jar> to org.apache.jclouds.karaf/core/2.0.0-20140811.182155-11/core-2.0.0-20140811.182155-11.jar
[JENKINS] Archiving <https://jclouds.ci.cloudbees.com/job/jclouds-karaf/ws/recipe/pom.xml> to org.apache.jclouds.karaf/recipe/2.0.0-SNAPSHOT/recipe-2.0.0-SNAPSHOT.pom
[JENKINS] Archiving <https://jclouds.ci.cloudbees.com/job/jclouds-karaf/ws/recipe/target/recipe-2.0.0-SNAPSHOT.jar> to org.apache.jclouds.karaf/recipe/2.0.0-20140811.182216-11/recipe-2.0.0-20140811.182216-11.jar
[JENKINS] Archiving <https://jclouds.ci.cloudbees.com/job/jclouds-karaf/ws/chef/services/pom.xml> to org.apache.jclouds.karaf.chef/services/2.0.0-SNAPSHOT/services-2.0.0-SNAPSHOT.pom
[JENKINS] Archiving <https://jclouds.ci.cloudbees.com/job/jclouds-karaf/ws/chef/services/target/services-2.0.0-SNAPSHOT.jar> to org.apache.jclouds.karaf.chef/services/2.0.0-20140811.182416-10/services-2.0.0-20140811.182416-10.jar
[JENKINS] Archiving <https://jclouds.ci.cloudbees.com/job/jclouds-karaf/ws/chef/pom.xml> to org.apache.jclouds.karaf/chef/2.0.0-SNAPSHOT/chef-2.0.0-SNAPSHOT.pom
[JENKINS] Archiving <https://jclouds.ci.cloudbees.com/job/jclouds-karaf/ws/cache/pom.xml> to org.apache.jclouds.karaf/cache/2.0.0-SNAPSHOT/cache-2.0.0-SNAPSHOT.pom
[JENKINS] Archiving <https://jclouds.ci.cloudbees.com/job/jclouds-karaf/ws/cache/target/cache-2.0.0-SNAPSHOT.jar> to org.apache.jclouds.karaf/cache/2.0.0-20140811.182225-11/cache-2.0.0-20140811.182225-11.jar
[JENKINS] Archiving <https://jclouds.ci.cloudbees.com/job/jclouds-karaf/ws/pom.xml> to org.apache.jclouds/jclouds-karaf/2.0.0-SNAPSHOT/jclouds-karaf-2.0.0-SNAPSHOT.pom
channel stopped