You are viewing a plain text version of this content. The canonical link for it is here.
Posted to builds@cassandra.apache.org by Apache Jenkins Server <je...@builds.apache.org> on 2025/10/14 15:16:19 UTC
Build complete: Cassandra-trunk #2297 [ABORTED] 11278547e1c8b532969a81675750b2e542b0e379
-------------------------------------------------------------------------------
Build Cassandra-trunk #2297 Aborted
URL: https://ci-cassandra.apache.org/job/Cassandra-trunk/2297/
-------------------------------------------------------------------------------
Changes:
No changes
-------------------------------------------------------------------------------
Failed Tests:
26 tests failed.
FAILED: dtest-latest.disk_balance_test.TestDiskBalance.Tests / dtest-latest jdk11 49/64 / test_disk_balance_after_boundary_change_lcs
FAILED: dtest-latest.disk_balance_test.TestDiskBalance.Tests / dtest-latest jdk11 50/64 / test_disk_balance_after_joining_ring_stcs
FAILED: dtest-novnode.sslnodetonode_test.TestNodeToNodeSSLEncryption.Tests / dtest-novnode jdk11 51/64 / test_ssl_wrong_hostname_with_validation
FAILED: dtest-upgrade-novnode-large.upgrade_tests.upgrade_through_versions_test.TestUpgrade_current_4_0_x_To_indev_trunk.Tests / dtest-upgrade-novnode-large jdk11 30/40 / test_bootstrap_multidc
FAILED: dtest-upgrade-novnode.upgrade_tests.cql_tests.TestCQLNodes2RF1_Upgrade_indev_4_0_x_To_indev_trunk.Tests / dtest-upgrade-novnode jdk11 41/160 / test_static_with_limit
FAILED: dtest-upgrade-novnode.upgrade_tests.cql_tests.TestCQLNodes3RF3_Upgrade_current_4_1_x_To_indev_trunk.Tests / dtest-upgrade-novnode jdk11 81/160 / test_float_with_exponent
FAILED: dtest-upgrade-novnode.upgrade_tests.cql_tests.TestCQLNodes3RF3_Upgrade_current_5_0_x_To_indev_trunk.Tests / dtest-upgrade-novnode jdk11 110/160 / test_select_count_paging
FAILED: dtest-upgrade.upgrade_tests.cql_tests.TestCQLNodes2RF1_Upgrade_current_4_0_x_To_indev_trunk.Tests / dtest-upgrade jdk11 78/160 / test_npe_composite_table_slice
FAILED: dtest-upgrade.upgrade_tests.cql_tests.TestCQLNodes2RF1_Upgrade_current_4_1_x_To_indev_trunk.Tests / dtest-upgrade jdk11 23/160 / test_indexed_with_eq
FAILED: dtest-upgrade.upgrade_tests.cql_tests.TestCQLNodes2RF1_Upgrade_indev_4_0_x_To_indev_trunk.Tests / dtest-upgrade jdk11 143/160 / test_order_by
FAILED: dtest-upgrade.upgrade_tests.cql_tests.TestCQLNodes3RF3_Upgrade_current_5_0_x_To_indev_trunk.Tests / dtest-upgrade jdk11 78/160 / test_expanded_map_item_conditional
FAILED: org.apache.cassandra.distributed.test.accord.AccordInteropReadTest.Tests / jvm-dtest jdk17 15/16 / serialReadTest-_jdk17_x86_64
FAILED: org.apache.cassandra.distributed.test.log.InProgressSequenceCoordinationTest.Tests / jvm-dtest jdk11 12/16 / bootstrapProgressTest-_jdk11_x86_64
FAILED: org.apache.cassandra.distributed.test.log.InProgressSequenceCoordinationTest.Tests / jvm-dtest jdk11 12/16 / inProgressSequenceRetryTest-_jdk11_x86_64
FAILED: org.apache.cassandra.transport.AuthMessageSizeLimitTest.Tests / test-system-keyspace-directory jdk17 7/20 / sendTooBigAuthMultiFrameMessage-system_keyspace_directory_jdk17_x86_64
FAILED: dtest-latest.client_request_metrics_test.TestClientRequestMetrics.Tests / dtest-latest jdk17 34/64 / test_client_request_metrics
FAILED: dtest-latest.client_request_metrics_test.TestClientRequestMetrics.Tests / dtest-latest jdk11 34/64 / test_client_request_metrics
FAILED: dtest-novnode.client_request_metrics_test.TestClientRequestMetrics.Tests / dtest-novnode jdk11 38/64 / test_client_request_metrics
FAILED: dtest-novnode.client_request_metrics_test.TestClientRequestMetrics.Tests / dtest-novnode jdk17 38/64 / test_client_request_metrics
FAILED: dtest.client_request_metrics_test.TestClientRequestMetrics.Tests / dtest jdk17 34/64 / test_client_request_metrics
FAILED: dtest.client_request_metrics_test.TestClientRequestMetrics.Tests / dtest jdk11 34/64 / test_client_request_metrics
FAILED: org.apache.cassandra.db.compaction.CompactionAccordIteratorsTest.Tests / test-oa jdk11 9/20 / testAccordCommandsForKeyPurgerSingleCompaction-cassandra.testtag_IS_UNDEFINED
FAILED: org.apache.cassandra.io.sstable.indexsummary.IndexSummaryTest.Tests / test-cdc jdk17 20/20 / testLargeIndexSummary-cassandra.testtag_IS_UNDEFINED
FAILED: org.apache.cassandra.io.sstable.indexsummary.IndexSummaryTest.Tests / test-oa jdk17 20/20 / testLargeIndexSummary-cassandra.testtag_IS_UNDEFINED
FAILED: org.apache.cassandra.io.sstable.indexsummary.IndexSummaryTest.Tests / test-compression jdk17 20/20 / testLargeIndexSummary-cassandra.testtag_IS_UNDEFINED
FAILED: org.apache.cassandra.distributed.upgrade.ClusterMetadataUpgradeHarryTest.Tests / jvm-dtest-upgrade jdk11 1/6 / simpleUpgradeTest-cassandra.testtag_IS_UNDEFINED
-------------------------------------------------------------------------------
For complete test report and logs see https://nightlies.apache.org/cassandra/Cassandra-trunk/2297/