You are viewing a plain text version of this content. The canonical link for it is here.
Posted to notifications@jclouds.apache.org by je...@cloudbees.com on 2017/04/19 17:51:02 UTC

Build failed in Jenkins: jclouds-osgi-compat » default #46

See <https://jclouds.ci.cloudbees.com/job/jclouds-osgi-compat/default/46/display/redirect?page=changes>

Changes:

[Ignasi Barrera] [JCLOUDS-1130] Cloudstack fixed projectid parameter in listUsageRecords.

[Ignasi Barrera] [JCLOUDS-1128] Added page and pagesize fields to ListProjectOptions.

[Andrew Gaul] JCLOUDS-255: Support S3 signed URLs with expiry

[Andrew Gaul] JCLOUDS-255: Consistently use query string auth

[Andrew Gaul] Remove unused imports

------------------------------------------
[...truncated 1.03 MB...]
Test suite progress: tests succeeded: 829, failed: 1, skipped: 0.
[pool-82-thread-5] Test testWhenFindsRegion(org.jclouds.location.functions.RegionToEndpointOrProviderIfNullTest) succeeded: 3ms
Test suite progress: tests succeeded: 830, failed: 1, skipped: 0.
[pool-82-thread-3] Test testWhenRegionNameIsSameAsProviderName(org.jclouds.location.functions.RegionToEndpointOrProviderIfNullTest) succeeded: 4ms
Test suite progress: tests succeeded: 831, failed: 1, skipped: 0.
Starting test testWithConfigOnlyMatchingIds(org.jclouds.location.predicates.fromconfig.AnyOrConfiguredZoneIdTest)
Starting test testWithoutConfigAllIdsMatch(org.jclouds.location.predicates.fromconfig.AnyOrConfiguredZoneIdTest)
[pool-83-thread-1] Test testWithConfigOnlyMatchingIds(org.jclouds.location.predicates.fromconfig.AnyOrConfiguredZoneIdTest) succeeded: 2ms
Test suite progress: tests succeeded: 832, failed: 1, skipped: 0.
[pool-83-thread-2] Test testWithoutConfigAllIdsMatch(org.jclouds.location.predicates.fromconfig.AnyOrConfiguredZoneIdTest) succeeded: 2ms
Test suite progress: tests succeeded: 833, failed: 1, skipped: 0.
Starting test testWithConfigOnlyMatchingIds(org.jclouds.location.predicates.fromconfig.AnyOrConfiguredRegionIdTest)
Starting test testWithoutConfigAllIdsMatch(org.jclouds.location.predicates.fromconfig.AnyOrConfiguredRegionIdTest)
[pool-84-thread-1] Test testWithConfigOnlyMatchingIds(org.jclouds.location.predicates.fromconfig.AnyOrConfiguredRegionIdTest) succeeded: 2ms
Test suite progress: tests succeeded: 834, failed: 1, skipped: 0.
[pool-84-thread-2] Test testWithoutConfigAllIdsMatch(org.jclouds.location.predicates.fromconfig.AnyOrConfiguredRegionIdTest) succeeded: 2ms
Test suite progress: tests succeeded: 835, failed: 1, skipped: 0.
Starting test testDidntFindZoneThrowsNSEEWithReasonableMessage(org.jclouds.location.suppliers.implicit.OnlyLocationOrFirstZoneTest)
Starting test testFirstZone(org.jclouds.location.suppliers.implicit.OnlyLocationOrFirstZoneTest)
Starting test testNoZoneUsesProvider(org.jclouds.location.suppliers.implicit.OnlyLocationOrFirstZoneTest)
[pool-85-thread-3] Test testNoZoneUsesProvider(org.jclouds.location.suppliers.implicit.OnlyLocationOrFirstZoneTest) succeeded: 1ms
Test suite progress: tests succeeded: 836, failed: 1, skipped: 0.
[pool-85-thread-2] Test testFirstZone(org.jclouds.location.suppliers.implicit.OnlyLocationOrFirstZoneTest) succeeded: 3ms
Test suite progress: tests succeeded: 837, failed: 1, skipped: 0.
[pool-85-thread-1] Test testDidntFindZoneThrowsNSEEWithReasonableMessage(org.jclouds.location.suppliers.implicit.OnlyLocationOrFirstZoneTest) succeeded: 4ms
Test suite progress: tests succeeded: 838, failed: 1, skipped: 0.
Starting test testDidntFindZoneThrowsNSEEWithReasonableMessage(org.jclouds.location.suppliers.implicit.FirstZoneTest)
Starting test testFirstZone(org.jclouds.location.suppliers.implicit.FirstZoneTest)
[pool-86-thread-2] Test testFirstZone(org.jclouds.location.suppliers.implicit.FirstZoneTest) succeeded: 0ms
Test suite progress: tests succeeded: 839, failed: 1, skipped: 0.
[pool-86-thread-1] Test testDidntFindZoneThrowsNSEEWithReasonableMessage(org.jclouds.location.suppliers.implicit.FirstZoneTest) succeeded: 0ms
Test suite progress: tests succeeded: 840, failed: 1, skipped: 0.
Starting test testDidntMatchRegionIdThrowsNSEEWithReasonableMessage(org.jclouds.location.suppliers.implicit.OnlyLocationOrFirstRegionOptionallyMatchingRegionIdTest)
Starting test testFirstRegion(org.jclouds.location.suppliers.implicit.OnlyLocationOrFirstRegionOptionallyMatchingRegionIdTest)
Starting test testFindRegion(org.jclouds.location.suppliers.implicit.OnlyLocationOrFirstRegionOptionallyMatchingRegionIdTest)
Starting test testNoRegionUsesProvider(org.jclouds.location.suppliers.implicit.OnlyLocationOrFirstRegionOptionallyMatchingRegionIdTest)
[pool-87-thread-3] Test testFirstRegion(org.jclouds.location.suppliers.implicit.OnlyLocationOrFirstRegionOptionallyMatchingRegionIdTest) succeeded: 1ms
Test suite progress: tests succeeded: 841, failed: 1, skipped: 0.
[pool-87-thread-2] Test testFindRegion(org.jclouds.location.suppliers.implicit.OnlyLocationOrFirstRegionOptionallyMatchingRegionIdTest) succeeded: 1ms
Test suite progress: tests succeeded: 842, failed: 1, skipped: 0.
[pool-87-thread-1] Test testDidntMatchRegionIdThrowsNSEEWithReasonableMessage(org.jclouds.location.suppliers.implicit.OnlyLocationOrFirstRegionOptionallyMatchingRegionIdTest) succeeded: 2ms
Test suite progress: tests succeeded: 843, failed: 1, skipped: 0.
[pool-87-thread-4] Test testNoRegionUsesProvider(org.jclouds.location.suppliers.implicit.OnlyLocationOrFirstRegionOptionallyMatchingRegionIdTest) succeeded: 1ms
Test suite progress: tests succeeded: 844, failed: 1, skipped: 0.
Starting test testDidntFindRegionThrowsNSEEWithReasonableMessage(org.jclouds.location.suppliers.implicit.FirstRegionTest)
Starting test testFirstRegion(org.jclouds.location.suppliers.implicit.FirstRegionTest)
[pool-88-thread-2] Test testFirstRegion(org.jclouds.location.suppliers.implicit.FirstRegionTest) succeeded: 0ms
Test suite progress: tests succeeded: 845, failed: 1, skipped: 0.
[pool-88-thread-1] Test testDidntFindRegionThrowsNSEEWithReasonableMessage(org.jclouds.location.suppliers.implicit.FirstRegionTest) succeeded: 0ms
Test suite progress: tests succeeded: 846, failed: 1, skipped: 0.
Starting test testDidntFindNetworkThrowsNSEEWithReasonableMessage(org.jclouds.location.suppliers.implicit.FirstNetworkTest)
Starting test testFirstNetwork(org.jclouds.location.suppliers.implicit.FirstNetworkTest)
[pool-89-thread-2] Test testFirstNetwork(org.jclouds.location.suppliers.implicit.FirstNetworkTest) succeeded: 1ms
Test suite progress: tests succeeded: 847, failed: 1, skipped: 0.
[pool-89-thread-1] Test testDidntFindNetworkThrowsNSEEWithReasonableMessage(org.jclouds.location.suppliers.implicit.FirstNetworkTest) succeeded: 1ms
Test suite progress: tests succeeded: 848, failed: 1, skipped: 0.
Starting test test(org.jclouds.location.suppliers.all.ZoneToProviderTest)
Starting test testWhenNoZones(org.jclouds.location.suppliers.all.ZoneToProviderTest)
[pool-90-thread-2] Test testWhenNoZones(org.jclouds.location.suppliers.all.ZoneToProviderTest) succeeded: 0ms
Test suite progress: tests succeeded: 849, failed: 1, skipped: 0.
[pool-90-thread-1] Test test(org.jclouds.location.suppliers.all.ZoneToProviderTest) succeeded: 0ms
Test suite progress: tests succeeded: 850, failed: 1, skipped: 0.
Starting test test(org.jclouds.location.suppliers.all.JustProviderTest)
[pool-91-thread-1] Test test(org.jclouds.location.suppliers.all.JustProviderTest) succeeded: 0ms
Test suite progress: tests succeeded: 851, failed: 1, skipped: 0.
Starting test test(org.jclouds.location.suppliers.all.RegionToProviderTest)
Starting test testWhenNoRegions(org.jclouds.location.suppliers.all.RegionToProviderTest)
[pool-92-thread-2] Test testWhenNoRegions(org.jclouds.location.suppliers.all.RegionToProviderTest) succeeded: 1ms
Test suite progress: tests succeeded: 852, failed: 1, skipped: 0.
[pool-92-thread-1] Test test(org.jclouds.location.suppliers.all.RegionToProviderTest) succeeded: 1ms
Test suite progress: tests succeeded: 853, failed: 1, skipped: 0.
Starting test testEmptyWhenRegionsAndZonesBoundButNoIsoCodes(org.jclouds.location.config.ProvideIso3166CodesByLocationIdViaPropertiesTest)
Starting test testIsoCodesWhenRegionsAndZonesBoundWithIsoCodes(org.jclouds.location.config.ProvideIso3166CodesByLocationIdViaPropertiesTest)
Starting test testEmptyWhenNoLocationsBound(org.jclouds.location.config.ProvideIso3166CodesByLocationIdViaPropertiesTest)
[pool-93-thread-1] Test testEmptyWhenNoLocationsBound(org.jclouds.location.config.ProvideIso3166CodesByLocationIdViaPropertiesTest) succeeded: 3ms
Test suite progress: tests succeeded: 854, failed: 1, skipped: 0.
[pool-93-thread-3] Test testIsoCodesWhenRegionsAndZonesBoundWithIsoCodes(org.jclouds.location.config.ProvideIso3166CodesByLocationIdViaPropertiesTest) succeeded: 3ms
Test suite progress: tests succeeded: 855, failed: 1, skipped: 0.
[pool-93-thread-2] Test testEmptyWhenRegionsAndZonesBoundButNoIsoCodes(org.jclouds.location.config.ProvideIso3166CodesByLocationIdViaPropertiesTest) succeeded: 4ms
Test suite progress: tests succeeded: 856, failed: 1, skipped: 0.
Tests run: 857, Failures: 1, Errors: 0, Skipped: 0, Time elapsed: 45.427 sec <<< FAILURE! - in TestSuite
testCacheIsFasterWhenNoAnnotationPresent(org.jclouds.rest.functions.PresentWhenApiVersionLexicographicallyAtOrAfterSinceApiVersionTest)  Time elapsed: 0.005 sec  <<< FAILURE!
java.lang.AssertionError: cached [116] should be less than initial [97] expected [true] but found [false]
	at org.testng.Assert.fail(Assert.java:94)
	at org.testng.Assert.failNotEquals(Assert.java:494)
	at org.testng.Assert.assertTrue(Assert.java:42)
	at org.jclouds.rest.functions.PresentWhenApiVersionLexicographicallyAtOrAfterSinceApiVersionTest.testCacheIsFasterWhenNoAnnotationPresent(PresentWhenApiVersionLexicographicallyAtOrAfterSinceApiVersionTest.java:130)


Results :

Failed tests: 
  PresentWhenApiVersionLexicographicallyAtOrAfterSinceApiVersionTest.testCacheIsFasterWhenNoAnnotationPresent:130 cached [116] should be less than initial [97] expected [true] but found [false]

Tests run: 857, Failures: 1, Errors: 0, Skipped: 0

[INFO] ------------------------------------------------------------------------
[INFO] Reactor Summary:
[INFO] 
[INFO] Apache jclouds Project ............................ SUCCESS [13.466s]
[INFO] jclouds shared Maven resources .................... SUCCESS [4.275s]
[INFO] jclouds Components Core ........................... FAILURE [1:06.350s]
[INFO] jclouds SLF4J Logging Module ...................... SKIPPED
[INFO] jclouds OAuth core ................................ SKIPPED
[INFO] jclouds Google Cloud Core ......................... SKIPPED
[INFO] jclouds OpenStack Components Core ................. SKIPPED
[INFO] jclouds commons project ........................... SKIPPED
[INFO] jclouds script builder ............................ SKIPPED
[INFO] jclouds compute core .............................. SKIPPED
[INFO] jclouds Log4J Logging Module ...................... SKIPPED
[INFO] jclouds loadbalancer core ......................... SKIPPED
[INFO] jclouds sts api ................................... SKIPPED
[INFO] jclouds cloudwatch api ............................ SKIPPED
[INFO] jclouds bouncycastle EncryptionService Module ..... SKIPPED
[INFO] jclouds sshj ssh client ........................... SKIPPED
[INFO] jclouds cloudstack core ........................... SKIPPED
[INFO] jclouds blobstore core ............................ SKIPPED
[INFO] jclouds filesystem core ........................... SKIPPED
[INFO] jclouds bring your own node provider .............. SKIPPED
[INFO] jclouds OkHttp Driver ............................. SKIPPED
[INFO] jclouds s3 api .................................... SKIPPED
[INFO] jclouds ec2 api ................................... SKIPPED
[INFO] jclouds sqs api ................................... SKIPPED
[INFO] jclouds elasticstack core ......................... SKIPPED
[INFO] jclouds atmos components .......................... SKIPPED
[INFO] jclouds openstack-keystone api .................... SKIPPED
[INFO] jclouds openstack-cinder api ...................... SKIPPED
[INFO] Apache jclouds :: OpenStack :: Nova API ........... SKIPPED
[INFO] jclouds openstack-nova-ec2 api .................... SKIPPED
[INFO] jclouds openstack-swift api ....................... SKIPPED
[INFO] jclouds openstack-trove api ....................... SKIPPED
[INFO] jclouds rackspace cloudidentity api ............... SKIPPED
[INFO] jclouds Rackspace Cloud Load Balancers API ........ SKIPPED
[INFO] jclouds Rackspace Next Generation Cloud Block Storage US provider  SKIPPED
[INFO] jclouds Rackspace Next Generation Cloud Servers US provider  SKIPPED
[INFO] jclouds rackspace clouddns api .................... SKIPPED
[INFO] jclouds rackspace-cloudfiles api .................. SKIPPED
[INFO] jclouds route53 api ............................... SKIPPED
[INFO] jclouds Chef api .................................. SKIPPED
[INFO] jclouds docker API ................................ SKIPPED
[INFO] jclouds apis project .............................. SKIPPED
[INFO] jclouds GoGrid provider ........................... SKIPPED
[INFO] jclouds Azure Storage provider .................... SKIPPED
[INFO] jclouds Apache Http Components Client ............. SKIPPED
[INFO] jclouds joda DateService Module ................... SKIPPED
[INFO] jclouds netty payload module ...................... SKIPPED
[INFO] jclouds enterprise Module ......................... SKIPPED
[INFO] jclouds Amazon Simple Storage Service (S3) provider  SKIPPED
[INFO] jclouds Amazon Elastic Load Balancer provider ..... SKIPPED
[INFO] jclouds Amazon EC2 provider ....................... SKIPPED
[INFO] jclouds Amazon Simple Queue Service provider ...... SKIPPED
[INFO] jclouds DigitalOcean v2 API Provider .............. SKIPPED
[INFO] jclouds ElasticHosts Peer1 London provider ........ SKIPPED
[INFO] jclouds ElasticHosts Peer1 San Antonio provider ... SKIPPED
[INFO] jclouds ElasticHosts BlueSquare London provider ... SKIPPED
[INFO] jclouds ElasticHosts Peer1 Toronto provider ....... SKIPPED
[INFO] jclouds ElasticHosts Peer1 Los Angeles provider ... SKIPPED
[INFO] jclouds ElasticHosts Amsterdam provider ........... SKIPPED
[INFO] jclouds ElasticHosts San Jose provider ............ SKIPPED
[INFO] jclouds ElasticHosts Hong Kong provider ........... SKIPPED
[INFO] jclouds ElasticHosts Sydney provider .............. SKIPPED
[INFO] jclouds ElasticHosts Miami provider ............... SKIPPED
[INFO] jclouds ElasticHosts Dallas provider .............. SKIPPED
[INFO] jclouds Open Hosting East1 provider ............... SKIPPED
[INFO] jclouds Serverlove Manchester provider ............ SKIPPED
[INFO] jclouds SkaliCloud Malaysia provider .............. SKIPPED
[INFO] jclouds Go2Cloud Johannesburg1 provider ........... SKIPPED
[INFO] jclouds Google Compute Engine provider ............ SKIPPED
[INFO] jclouds SoftLayer core ............................ SKIPPED
[INFO] jclouds Rackspace Cloud Files US provider ......... SKIPPED
[INFO] jclouds Rackspace Cloud Files UK provider ......... SKIPPED
[INFO] jclouds Rackspace Next Generation Cloud DNS US provider  SKIPPED
[INFO] jclouds Rackspace Next Generation Cloud DNS UK provider  SKIPPED
[INFO] jclouds Rackspace Cloud Databases US provider ..... SKIPPED
[INFO] jclouds Rackspace Cloud Databases UK provider ..... SKIPPED
[INFO] jclouds Rackspace Cloud Load Balancers US provider  SKIPPED
[INFO] jclouds Rackspace Cloud Load Balancers UK provider  SKIPPED
[INFO] jclouds Rackspace Next Generation Cloud Block Storage UK provider  SKIPPED
[INFO] jclouds Rackspace Next Generation Cloud Servers provider  SKIPPED
[INFO] jclouds GleSYS core ............................... SKIPPED
[INFO] jclouds Amazon Identity and Access Management (STS) provider  SKIPPED
[INFO] jclouds Amazon Route 53 provider .................. SKIPPED
[INFO] jclouds ultradns-ws provider ...................... SKIPPED
[INFO] jclouds dynect api ................................ SKIPPED
[INFO] jclouds ProfitBricks api .......................... SKIPPED
[INFO] jclouds providers project ......................... SKIPPED
[INFO] jclouds jsch ssh client ........................... SKIPPED
[INFO] jclouds example components for a standalone compute provider  SKIPPED
[INFO] jclouds skeletons project ......................... SKIPPED
[INFO] jclouds Google App Engine Components .............. SKIPPED
[INFO] jclouds drivers project ........................... SKIPPED
[INFO] allcompute ........................................ SKIPPED
[INFO] allblobstore ...................................... SKIPPED
[INFO] allloadbalancer ................................... SKIPPED
[INFO] all ............................................... SKIPPED
[INFO] Apache jclouds .................................... SKIPPED
[INFO] ------------------------------------------------------------------------
[INFO] BUILD FAILURE
[INFO] ------------------------------------------------------------------------
[INFO] Total time: 1:28.377s
[INFO] Finished at: Wed Apr 19 13:51:01 EDT 2017
[INFO] Final Memory: 75M/224M
[INFO] ------------------------------------------------------------------------
[ERROR] Failed to execute goal org.apache.maven.plugins:maven-surefire-plugin:2.17:test (default-test) on project jclouds-core: There are test failures.
[ERROR] 
[ERROR] Please refer to <https://jclouds.ci.cloudbees.com/job/jclouds-osgi-compat/default/ws/core/target/surefire-reports> for the individual test results.
[ERROR] -> [Help 1]
org.apache.maven.lifecycle.LifecycleExecutionException: Failed to execute goal org.apache.maven.plugins:maven-surefire-plugin:2.17:test (default-test) on project jclouds-core: There are test failures.

Please refer to <https://jclouds.ci.cloudbees.com/job/jclouds-osgi-compat/default/ws/core/target/surefire-reports> for the individual test results.
	at org.apache.maven.lifecycle.internal.MojoExecutor.execute(MojoExecutor.java:213)
	at org.apache.maven.lifecycle.internal.MojoExecutor.execute(MojoExecutor.java:153)
	at org.apache.maven.lifecycle.internal.MojoExecutor.execute(MojoExecutor.java:145)
	at org.apache.maven.lifecycle.internal.LifecycleModuleBuilder.buildProject(LifecycleModuleBuilder.java:84)
	at org.apache.maven.lifecycle.internal.LifecycleModuleBuilder.buildProject(LifecycleModuleBuilder.java:59)
	at org.apache.maven.lifecycle.internal.LifecycleStarter.singleThreadedBuild(LifecycleStarter.java:183)
	at org.apache.maven.lifecycle.internal.LifecycleStarter.execute(LifecycleStarter.java:161)
	at org.apache.maven.DefaultMaven.doExecute(DefaultMaven.java:320)
	at org.apache.maven.DefaultMaven.execute(DefaultMaven.java:156)
	at org.apache.maven.cli.MavenCli.execute(MavenCli.java:537)
	at org.apache.maven.cli.MavenCli.doMain(MavenCli.java:196)
	at org.apache.maven.cli.MavenCli.main(MavenCli.java:141)
	at sun.reflect.NativeMethodAccessorImpl.invoke0(Native Method)
	at sun.reflect.NativeMethodAccessorImpl.invoke(NativeMethodAccessorImpl.java:57)
	at sun.reflect.DelegatingMethodAccessorImpl.invoke(DelegatingMethodAccessorImpl.java:43)
	at java.lang.reflect.Method.invoke(Method.java:606)
	at org.codehaus.plexus.classworlds.launcher.Launcher.launchEnhanced(Launcher.java:290)
	at org.codehaus.plexus.classworlds.launcher.Launcher.launch(Launcher.java:230)
	at org.codehaus.plexus.classworlds.launcher.Launcher.mainWithExitCode(Launcher.java:409)
	at org.codehaus.plexus.classworlds.launcher.Launcher.main(Launcher.java:352)
Caused by: org.apache.maven.plugin.MojoFailureException: There are test failures.

Please refer to <https://jclouds.ci.cloudbees.com/job/jclouds-osgi-compat/default/ws/core/target/surefire-reports> for the individual test results.
	at org.apache.maven.plugin.surefire.SurefireHelper.reportExecution(SurefireHelper.java:82)
	at org.apache.maven.plugin.surefire.SurefirePlugin.handleSummary(SurefirePlugin.java:195)
	at org.apache.maven.plugin.surefire.AbstractSurefireMojo.executeAfterPreconditionsChecked(AbstractSurefireMojo.java:861)
	at org.apache.maven.plugin.surefire.AbstractSurefireMojo.execute(AbstractSurefireMojo.java:729)
	at org.apache.maven.plugin.DefaultBuildPluginManager.executeMojo(DefaultBuildPluginManager.java:101)
	at org.apache.maven.lifecycle.internal.MojoExecutor.execute(MojoExecutor.java:209)
	... 19 more
[ERROR] 
[ERROR] Re-run Maven using the -X switch to enable full debug logging.
[ERROR] 
[ERROR] For more information about the errors and possible solutions, please read the following articles:
[ERROR] [Help 1] http://cwiki.apache.org/confluence/display/MAVEN/MojoFailureException
[ERROR] 
[ERROR] After correcting the problems, you can resume the build with the command
[ERROR]   mvn <goals> -rf :jclouds-core
Build step 'Invoke top-level Maven targets' marked build as failure

Jenkins build is back to normal : jclouds-osgi-compat » default #47

Posted by je...@cloudbees.com.
See <https://jclouds.ci.cloudbees.com/job/jclouds-osgi-compat/default/47/display/redirect?page=changes>