You are viewing a plain text version of this content. The canonical link for it is here.
Posted to dev@geronimo.apache.org by Jarek Gawor <jg...@gmail.com> on 2007/09/26 03:07:28 UTC
Re: [BUILD] Trunk: Successful
Prasad,
Do you know why the ResultsSummary page only shows a subset of the
results for 2.1? For example, the results for web-testsuite are
missing.
Jarek
On 25 Sep 2007 21:09:21 -0000, prasad@apache.org <pr...@apache.org> wrote:
> OpenEJB trunk at 579286
> Geronimo Revision: 579360 built with tests included
>
> See the full build-1600.log file at http://people.apache.org/~prasad/binaries/trunk/20070925/build-1600.log
> Download the binaries from http://people.apache.org/~prasad/binaries/trunk/20070925
>
> [INFO] BUILD SUCCESSFUL
> [INFO] ------------------------------------------------------------------------
> [INFO] Total time: 28 minutes 55 seconds
> [INFO] Finished at: Tue Sep 25 16:40:36 EDT 2007
> [INFO] Final Memory: 211M/1010M
> [INFO] ------------------------------------------------------------------------
>
> TESTSUITE RESULTS (Failures only)
> =================================
> See detailed results at http://people.apache.org/~prasad/testsuite/ResultsSummary.html
>
> [INFO] Running console-testsuite.advance-test
> [INFO] Tests run: 12, Failures: 1, Errors: 0, Skipped: 0, Time elapsed: 141.882 sec <<< FAILURE!
> --
> [INFO] Running deployment-testsuite.jca-cms
> [INFO] Tests run: 1, Failures: 1, Errors: 0, Skipped: 0, Time elapsed: 0.313 sec <<< FAILURE!
> --
> [INFO] Running sec-testsuite.security
> [INFO] Tests run: 2, Failures: 2, Errors: 0, Skipped: 0, Time elapsed: 0.638 sec <<< FAILURE!
>
>
Re: [BUILD] Trunk: Successful
Posted by Prasad Kashyap <go...@gmail.com>.
This is weird. The maven-maven-plugin aborts when it encounters an
error on Linux. On Windows, it keeps going.
Cheers
Prasad
On 9/25/07, Jarek Gawor <jg...@gmail.com> wrote:
> Oh, nice. Is there a way to configure maven not to abort the tests in such case?
>
> Jarek
>
> On 9/25/07, Prasad Kashyap <go...@gmail.com> wrote:
> > http://people.apache.org/~prasad/binaries/trunk/20070925/test-1600.log
> >
> > We have to exclude the ejbcontainer tests.
> >
> > Cheers
> > Prasad.
> >
> >
> > On 9/25/07, Jarek Gawor <jg...@gmail.com> wrote:
> > > Prasad,
> > >
> > > Do you know why the ResultsSummary page only shows a subset of the
> > > results for 2.1? For example, the results for web-testsuite are
> > > missing.
> > >
> > > Jarek
> > >
> > > On 25 Sep 2007 21:09:21 -0000, prasad@apache.org <pr...@apache.org> wrote:
> > > > OpenEJB trunk at 579286
> > > > Geronimo Revision: 579360 built with tests included
> > > >
> > > > See the full build-1600.log file at http://people.apache.org/~prasad/binaries/trunk/20070925/build-1600.log
> > > > Download the binaries from http://people.apache.org/~prasad/binaries/trunk/20070925
> > > >
> > > > [INFO] BUILD SUCCESSFUL
> > > > [INFO] ------------------------------------------------------------------------
> > > > [INFO] Total time: 28 minutes 55 seconds
> > > > [INFO] Finished at: Tue Sep 25 16:40:36 EDT 2007
> > > > [INFO] Final Memory: 211M/1010M
> > > > [INFO] ------------------------------------------------------------------------
> > > >
> > > > TESTSUITE RESULTS (Failures only)
> > > > =================================
> > > > See detailed results at http://people.apache.org/~prasad/testsuite/ResultsSummary.html
> > > >
> > > > [INFO] Running console-testsuite.advance-test
> > > > [INFO] Tests run: 12, Failures: 1, Errors: 0, Skipped: 0, Time elapsed: 141.882 sec <<< FAILURE!
> > > > --
> > > > [INFO] Running deployment-testsuite.jca-cms
> > > > [INFO] Tests run: 1, Failures: 1, Errors: 0, Skipped: 0, Time elapsed: 0.313 sec <<< FAILURE!
> > > > --
> > > > [INFO] Running sec-testsuite.security
> > > > [INFO] Tests run: 2, Failures: 2, Errors: 0, Skipped: 0, Time elapsed: 0.638 sec <<< FAILURE!
> > > >
> > > >
> > >
> >
>
Re: [BUILD] Trunk: Successful
Posted by Jarek Gawor <jg...@gmail.com>.
Oh, nice. Is there a way to configure maven not to abort the tests in such case?
Jarek
On 9/25/07, Prasad Kashyap <go...@gmail.com> wrote:
> http://people.apache.org/~prasad/binaries/trunk/20070925/test-1600.log
>
> We have to exclude the ejbcontainer tests.
>
> Cheers
> Prasad.
>
>
> On 9/25/07, Jarek Gawor <jg...@gmail.com> wrote:
> > Prasad,
> >
> > Do you know why the ResultsSummary page only shows a subset of the
> > results for 2.1? For example, the results for web-testsuite are
> > missing.
> >
> > Jarek
> >
> > On 25 Sep 2007 21:09:21 -0000, prasad@apache.org <pr...@apache.org> wrote:
> > > OpenEJB trunk at 579286
> > > Geronimo Revision: 579360 built with tests included
> > >
> > > See the full build-1600.log file at http://people.apache.org/~prasad/binaries/trunk/20070925/build-1600.log
> > > Download the binaries from http://people.apache.org/~prasad/binaries/trunk/20070925
> > >
> > > [INFO] BUILD SUCCESSFUL
> > > [INFO] ------------------------------------------------------------------------
> > > [INFO] Total time: 28 minutes 55 seconds
> > > [INFO] Finished at: Tue Sep 25 16:40:36 EDT 2007
> > > [INFO] Final Memory: 211M/1010M
> > > [INFO] ------------------------------------------------------------------------
> > >
> > > TESTSUITE RESULTS (Failures only)
> > > =================================
> > > See detailed results at http://people.apache.org/~prasad/testsuite/ResultsSummary.html
> > >
> > > [INFO] Running console-testsuite.advance-test
> > > [INFO] Tests run: 12, Failures: 1, Errors: 0, Skipped: 0, Time elapsed: 141.882 sec <<< FAILURE!
> > > --
> > > [INFO] Running deployment-testsuite.jca-cms
> > > [INFO] Tests run: 1, Failures: 1, Errors: 0, Skipped: 0, Time elapsed: 0.313 sec <<< FAILURE!
> > > --
> > > [INFO] Running sec-testsuite.security
> > > [INFO] Tests run: 2, Failures: 2, Errors: 0, Skipped: 0, Time elapsed: 0.638 sec <<< FAILURE!
> > >
> > >
> >
>
Re: [BUILD] Trunk: Successful
Posted by Prasad Kashyap <go...@gmail.com>.
http://people.apache.org/~prasad/binaries/trunk/20070925/test-1600.log
We have to exclude the ejbcontainer tests.
Cheers
Prasad.
On 9/25/07, Jarek Gawor <jg...@gmail.com> wrote:
> Prasad,
>
> Do you know why the ResultsSummary page only shows a subset of the
> results for 2.1? For example, the results for web-testsuite are
> missing.
>
> Jarek
>
> On 25 Sep 2007 21:09:21 -0000, prasad@apache.org <pr...@apache.org> wrote:
> > OpenEJB trunk at 579286
> > Geronimo Revision: 579360 built with tests included
> >
> > See the full build-1600.log file at http://people.apache.org/~prasad/binaries/trunk/20070925/build-1600.log
> > Download the binaries from http://people.apache.org/~prasad/binaries/trunk/20070925
> >
> > [INFO] BUILD SUCCESSFUL
> > [INFO] ------------------------------------------------------------------------
> > [INFO] Total time: 28 minutes 55 seconds
> > [INFO] Finished at: Tue Sep 25 16:40:36 EDT 2007
> > [INFO] Final Memory: 211M/1010M
> > [INFO] ------------------------------------------------------------------------
> >
> > TESTSUITE RESULTS (Failures only)
> > =================================
> > See detailed results at http://people.apache.org/~prasad/testsuite/ResultsSummary.html
> >
> > [INFO] Running console-testsuite.advance-test
> > [INFO] Tests run: 12, Failures: 1, Errors: 0, Skipped: 0, Time elapsed: 141.882 sec <<< FAILURE!
> > --
> > [INFO] Running deployment-testsuite.jca-cms
> > [INFO] Tests run: 1, Failures: 1, Errors: 0, Skipped: 0, Time elapsed: 0.313 sec <<< FAILURE!
> > --
> > [INFO] Running sec-testsuite.security
> > [INFO] Tests run: 2, Failures: 2, Errors: 0, Skipped: 0, Time elapsed: 0.638 sec <<< FAILURE!
> >
> >
>