You are viewing a plain text version of this content. The canonical link for it is here.
Posted to builds@lucene.apache.org by Policeman Jenkins Server via builds <bu...@lucene.apache.org> on 2026/07/07 17:26:45 UTC
[JENKINS] Lucene-nightly-main-Linux (64bit/hotspot/jdk-25.0.2) - Build # 1782 - Still Unstable!
Build: https://jenkins.thetaphi.de/job/Lucene-nightly-main-Linux/1782/
Java: 64bit/hotspot/jdk-25.0.2 -XX:-UseCompressedOops -XX:+UseParallelGC
2 tests failed.
FAILED: org.apache.lucene.sandbox.search.TestSortedDvMultiRangeQuery.testDuelWithStandardDisjunction
Error Message:
java.lang.AssertionError: expected:<1077 hits> but was:<1076 hits>
Stack Trace:
java.lang.AssertionError: expected:<1077 hits> but was:<1076 hits>
at __randomizedtesting.SeedInfo.seed([5442DB6A085D4B7F:D64102A910CE7EBB]:0)
at junit@4.13.2/org.junit.Assert.fail(Assert.java:89)
at junit@4.13.2/org.junit.Assert.failNotEquals(Assert.java:835)
at junit@4.13.2/org.junit.Assert.assertEquals(Assert.java:120)
at junit@4.13.2/org.junit.Assert.assertEquals(Assert.java:146)
at org.apache.lucene.sandbox.search.TestSortedDvMultiRangeQuery.testDuelWithStandardDisjunction(TestSortedDvMultiRangeQuery.java:155)
FAILED: org.apache.lucene.facet.range.TestRangeFacetCounts.testRandomLongsMultiValued
Error Message:
java.lang.AssertionError: expected:<2770> but was:<2771>
Stack Trace:
java.lang.AssertionError: expected:<2770> but was:<2771>
at __randomizedtesting.SeedInfo.seed([5442DB6A085D4B7F:F4880E41B4BA1E74]:0)
at junit@4.13.2/org.junit.Assert.fail(Assert.java:89)
at junit@4.13.2/org.junit.Assert.failNotEquals(Assert.java:835)
at junit@4.13.2/org.junit.Assert.assertEquals(Assert.java:647)
at junit@4.13.2/org.junit.Assert.assertEquals(Assert.java:633)
at org.apache.lucene.facet.range.TestRangeFacetCounts.testRandomLongsMultiValued(TestRangeFacetCounts.java:1072)