You are viewing a plain text version of this content. The canonical link for it is here.
Posted to commits@tomee.apache.org by "Continuum@vmbuild.apache.org" <op...@incubator.apache.org> on 2007/04/01 23:07:50 UTC
[continuum] BUILD FAILURE: OpenEJB :: Container :: Core
Online report : http://vmbuild.apache.org/continuum/servlet/continuum/target/ProjectBuild.vm/view/ProjectBuild/id/158/buildId/97605
Build statistics:
State: Failed
Previous State: Failed
Started at: Sun, 1 Apr 2007 14:02:29 -0700
Finished at: Sun, 1 Apr 2007 14:07:50 -0700
Total time: 5m 20s
Build Trigger: Schedule
Exit code: 1
Building machine hostname: vmbuild.apache.org
Operating system : Linux(unknown)
Java version : 1.5.0_06(Sun Microsystems Inc.)
Changes
kevan OPENEJB-546 Add support for allowedMethods support for Timer support. Container code currently sets Operation and Allowed Method State separately. Would be cleaner to combine these. However, current code is working and I'm on a bit of vacation. So, wanted to get this code in... I'll keep the jira open till I fix
/incubator/openejb/trunk/openejb3/container/openejb-core/src/main/java/org/apache/openejb/assembler/classic/EnterpriseBeanBuilder.java
/incubator/openejb/trunk/openejb3/container/openejb-core/src/main/java/org/apache/openejb/core/BaseContext.java
/incubator/openejb/trunk/openejb3/container/openejb-core/src/main/java/org/apache/openejb/core/BaseSessionContext.java
/incubator/openejb/trunk/openejb3/container/openejb-core/src/main/java/org/apache/openejb/core/ThreadContext.java
/incubator/openejb/trunk/openejb3/container/openejb-core/src/main/java/org/apache/openejb/core/cmp/CmpContainer.java
/incubator/openejb/trunk/openejb3/container/openejb-core/src/main/java/org/apache/openejb/core/entity/EntityContainer.java
/incubator/openejb/trunk/openejb3/container/openejb-core/src/main/java/org/apache/openejb/core/entity/EntityContext.java
/incubator/openejb/trunk/openejb3/container/openejb-core/src/main/java/org/apache/openejb/core/entity/EntityInstanceManager.java
/incubator/openejb/trunk/openejb3/container/openejb-core/src/main/java/org/apache/openejb/core/mdb/MdbContainer.java
/incubator/openejb/trunk/openejb3/container/openejb-core/src/main/java/org/apache/openejb/core/mdb/MdbContext.java
/incubator/openejb/trunk/openejb3/container/openejb-core/src/main/java/org/apache/openejb/core/mdb/MdbInstanceFactory.java
/incubator/openejb/trunk/openejb3/container/openejb-core/src/main/java/org/apache/openejb/core/stateful/SessionSynchronizationCoordinator.java
/incubator/openejb/trunk/openejb3/container/openejb-core/src/main/java/org/apache/openejb/core/stateful/StatefulContainer.java
/incubator/openejb/trunk/openejb3/container/openejb-core/src/main/java/org/apache/openejb/core/stateful/StatefulContext.java
/incubator/openejb/trunk/openejb3/container/openejb-core/src/main/java/org/apache/openejb/core/stateful/StatefulInstanceManager.java
/incubator/openejb/trunk/openejb3/container/openejb-core/src/main/java/org/apache/openejb/core/stateless/StatelessContainer.java
/incubator/openejb/trunk/openejb3/container/openejb-core/src/main/java/org/apache/openejb/core/stateless/StatelessContext.java
/incubator/openejb/trunk/openejb3/container/openejb-core/src/main/java/org/apache/openejb/core/stateless/StatelessInstanceManager.java
/incubator/openejb/trunk/openejb3/container/openejb-core/src/main/java/org/apache/openejb/core/timer/EjbTimerServiceImpl.java
/incubator/openejb/trunk/openejb3/container/openejb-core/src/main/java/org/apache/openejb/core/timer/NullEjbTimerServiceImpl.java
/incubator/openejb/trunk/openejb3/container/openejb-core/src/main/java/org/apache/openejb/core/timer/TimerImpl.java
****************************************************************************
Output:
****************************************************************************
[INFO] Scanning for projects...
[INFO] ----------------------------------------------------------------------------
[INFO] Building OpenEJB :: Container :: Core
[INFO] task-segment: [install]
[INFO] ----------------------------------------------------------------------------
[INFO] [tools:require-java-version {execution: default}]
[INFO] [tools:copy-legal-files {execution: install-legal-files}]
[INFO] [resources:resources]
[INFO] Using default encoding to copy filtered resources.
[INFO] [dependency:copy {execution: copy-dependencies}]
[INFO] Configured Artifact: org.apache.openejb:openejb-javaagent:null:3.0-incubating-SNAPSHOT:jar
[INFO] openejb-javaagent-3.0-incubating-SNAPSHOT.jar already exists.
[WARNING] While downloading xerces:xerces:2.4.0
This artifact has been relocated to xerces:xercesImpl:2.4.0.
[INFO] snapshot org.apache.geronimo.modules:geronimo-transaction:2.0-SNAPSHOT: checking for updates from codehaus-snapshot
[INFO] snapshot org.apache.geronimo.modules:geronimo-transaction:2.0-SNAPSHOT: checking for updates from apache-m2-snapshot
[INFO] snapshot org.apache.geronimo.modules:geronimo-transaction:2.0-SNAPSHOT: checking for updates from apache.snapshots
[INFO] snapshot org.apache.geronimo.modules:geronimo-core:2.0-SNAPSHOT: checking for updates from codehaus-snapshot
[INFO] snapshot org.apache.geronimo.modules:geronimo-core:2.0-SNAPSHOT: checking for updates from apache-m2-snapshot
[INFO] snapshot org.apache.geronimo.modules:geronimo-core:2.0-SNAPSHOT: checking for updates from apache.snapshots
[INFO] snapshot org.apache.geronimo.modules:geronimo-system:2.0-SNAPSHOT: checking for updates from codehaus-snapshot
[INFO] snapshot org.apache.geronimo.modules:geronimo-system:2.0-SNAPSHOT: checking for updates from apache-m2-snapshot
[INFO] snapshot org.apache.geronimo.modules:geronimo-system:2.0-SNAPSHOT: checking for updates from apache.snapshots
[INFO] snapshot org.apache.geronimo.modules:geronimo-util:2.0-SNAPSHOT: checking for updates from codehaus-snapshot
[INFO] snapshot org.apache.geronimo.modules:geronimo-util:2.0-SNAPSHOT: checking for updates from apache-m2-snapshot
[INFO] snapshot org.apache.geronimo.modules:geronimo-util:2.0-SNAPSHOT: checking for updates from apache.snapshots
[INFO] snapshot org.apache.geronimo.modules:geronimo-kernel:2.0-SNAPSHOT: checking for updates from codehaus-snapshot
[INFO] snapshot org.apache.geronimo.modules:geronimo-kernel:2.0-SNAPSHOT: checking for updates from apache-m2-snapshot
[INFO] snapshot org.apache.geronimo.modules:geronimo-kernel:2.0-SNAPSHOT: checking for updates from apache.snapshots
[WARNING]
Artifact junit:junit:jar:4.1:test retains local scope 'test' overriding broader scope 'compile'
given by a dependency. If this is not intended, modify or remove the local scope.
[WARNING]
Artifact hsqldb:hsqldb:jar:1.8.0.7:test retains local scope 'test' overriding broader scope 'compile'
given by a dependency. If this is not intended, modify or remove the local scope.
[INFO] snapshot org.apache.openejb:openejb-itests-app:3.0-incubating-SNAPSHOT: checking for updates from codehaus-snapshot
[INFO] snapshot org.apache.openejb:openejb-itests-app:3.0-incubating-SNAPSHOT: checking for updates from apache-m2-snapshot
[INFO] snapshot org.apache.openejb:openejb-itests-app:3.0-incubating-SNAPSHOT: checking for updates from apache.snapshots
Downloading: http://people.apache.org/repo/m2-snapshot-repository/org/apache/openejb/openejb-itests-app/3.0-incubating-SNAPSHOT/openejb-itests-app-3.0-incubating-20070401.202159-105.pom
2K downloaded
[WARNING]
Artifact commons-collections:commons-collections:jar:3.1:test retains local scope 'test' overriding broader scope 'compile'
given by a dependency. If this is not intended, modify or remove the local scope.
[INFO] [compiler:compile]
Compiling 21 source files to /x1/continuum/working-directory/158/target/classes
Downloading: http://people.apache.org/repo/m2-incubating-repository/org/apache/axis2/axis2-jaxws-api/20070330.190024-102/axis2-jaxws-api-20070330.190024-102.pom
[WARNING] Unable to get resource 'org.apache.axis2:axis2-jaxws-api:pom:20070330.190024-102' from repository apache-incubating-repository (http://people.apache.org/repo/m2-incubating-repository)
Downloading: http://repo1.maven.org/maven2/org/apache/axis2/axis2-jaxws-api/20070330.190024-102/axis2-jaxws-api-20070330.190024-102.pom
[WARNING] Unable to get resource 'org.apache.axis2:axis2-jaxws-api:pom:20070330.190024-102' from repository central (http://repo1.maven.org/maven2)
Downloading: http://people.apache.org/repo/m2-snapshot-repository/org/apache/openejb/openejb-itests-app/3.0-incubating-SNAPSHOT/openejb-itests-app-3.0-incubating-20070401.202159-105.jar
8872K downloaded
[INFO] [antrun:run {execution: default}]
[INFO] Executing tasks
[INFO] Executed tasks
[INFO] [resources:testResources]
[INFO] Using default encoding to copy filtered resources.
[INFO] [compiler:testCompile]
[INFO] Nothing to compile - all classes are up to date
[INFO] [surefire:test]
[INFO] Surefire report directory: /x1/continuum/working-directory/158/target/surefire-reports
-------------------------------------------------------
T E S T S
-------------------------------------------------------
Running org.apache.openejb.config.OpenEjb2CmpConversionTest
log4j:WARN No appenders could be found for logger (OpenEJB).
log4j:WARN Please initialize the log4j system properly.
Tests run: 9, Failures: 0, Errors: 0, Skipped: 0, Time elapsed: 10.095 sec
Running org.apache.openejb.core.stateless.StatelessInterceptorTest
log4j:WARN No appenders could be found for logger (OpenEJB.startup.config).
log4j:WARN Please initialize the log4j system properly.
Tests run: 1, Failures: 0, Errors: 0, Skipped: 0, Time elapsed: 4.79 sec
Running org.apache.openejb.core.mdb.MdbTest
log4j:WARN No appenders could be found for logger (org.apache.activemq.broker.BrokerService).
log4j:WARN Please initialize the log4j system properly.
Tests run: 1, Failures: 0, Errors: 0, Skipped: 0, Time elapsed: 15.588 sec
Running org.apache.openejb.core.stateful.StatefulInterceptorTest
log4j:WARN No appenders could be found for logger (OpenEJB.startup.config).
log4j:WARN Please initialize the log4j system properly.
Tests run: 1, Failures: 0, Errors: 0, Skipped: 0, Time elapsed: 4.339 sec
Running org.apache.openejb.config.ConfigureServiceTest
log4j:WARN No appenders could be found for logger (OpenEJB.startup.config).
log4j:WARN Please initialize the log4j system properly.
Tests run: 4, Failures: 0, Errors: 0, Skipped: 0, Time elapsed: 1.22 sec
Running org.apache.openejb.core.mdb.SimpleJmsTest
log4j:WARN No appenders could be found for logger (org.apache.activemq.broker.BrokerService).
log4j:WARN Please initialize the log4j system properly.
Tests run: 1, Failures: 0, Errors: 0, Skipped: 0, Time elapsed: 11.079 sec
Running org.apache.openejb.config.SunQueryFilterTest
Tests run: 5, Failures: 0, Errors: 0, Skipped: 0, Time elapsed: 0.109 sec
Running org.apache.openejb.config.SunCmpConversionTest
log4j:WARN No appenders could be found for logger (OpenEJB).
log4j:WARN Please initialize the log4j system properly.
Tests run: 8, Failures: 0, Errors: 0, Skipped: 0, Time elapsed: 11.231 sec
Running org.apache.openejb.core.stateful.Compat3to2Test
log4j:WARN No appenders could be found for logger (OpenEJB.startup.config).
log4j:WARN Please initialize the log4j system properly.
Tests run: 1, Failures: 0, Errors: 0, Skipped: 0, Time elapsed: 4.344 sec
Running org.apache.openejb.ApplicationTest
test server = org.apache.openejb.test.IvmTestServer
entry = java.naming.factory.initial:org.apache.openejb.client.LocalInitialContextFactory
WARN - Unable use logging config as there are 3 file references containing directories which have not been created. See the list below.
WARN - [0] /x1/continuum/working-directory/158/target/test-classes/conf/logs/transaction.log
WARN - [1] /x1/continuum/working-directory/158/target/test-classes/conf/logs/openejb.log
WARN - [2] /x1/continuum/working-directory/158/target/test-classes/conf/logs/server.log
Apache OpenEJB 3.0-incubating-SNAPSHOT build: 20070401-02:02
http://incubator.apache.org/openejb
INFO - openejb.home = /x1/continuum/working-directory/158/target/test-classes
INFO - openejb.base = /x1/continuum/working-directory/158/target/test-classes
INFO - Found AppModule in classpath: /home/continuum/.m2/repository/org/apache/openejb/openejb-itests-app/3.0-incubating-SNAPSHOT/openejb-itests-app-3.0-incubating-SNAPSHOT.jar
WARN - Auto-linking res-ref-name 'org.apache.openejb.test.stateful.AnnotatedFieldInjectionStatefulBean/daataSource' in bean AnnotatedFieldInjectionStatefulBean to Connector(id=Default JDBC Database)
WARN - Auto-creating a connector with id 'Default JMS Connection Factory' of type 'javax.jms.ConnectionFactory for 'AnnotatedFieldInjectionStatefulBean'. THERE IS LITTLE CHANCE THIS WILL WORK!
WARN - Auto-linking res-ref-name 'org.apache.openejb.test.stateful.AnnotatedFieldInjectionStatefulBean/coonnectionFactory' in bean AnnotatedFieldInjectionStatefulBean to Connector(id=Default JMS Connection Factory)
WARN - Auto-linking res-ref-name 'org.apache.openejb.test.stateful.AnnotatedFieldInjectionStatefulBean/queueCoonnectionFactory' in bean AnnotatedFieldInjectionStatefulBean to Connector(id=Default JMS Connection Factory)
WARN - Auto-linking res-ref-name 'org.apache.openejb.test.stateful.AnnotatedFieldInjectionStatefulBean/topicCoonnectionFactory' in bean AnnotatedFieldInjectionStatefulBean to Connector(id=Default JMS Connection Factory)
WARN - Auto-linking res-ref-name 'org.apache.openejb.test.stateless.AnnotatedFieldInjectionStatelessBean/daataSource' in bean AnnotatedFieldInjectionStatelessBean to Connector(id=Default JDBC Database)
WARN - Auto-linking res-ref-name 'org.apache.openejb.test.stateless.AnnotatedFieldInjectionStatelessBean/coonnectionFactory' in bean AnnotatedFieldInjectionStatelessBean to Connector(id=Default JMS Connection Factory)
WARN - Auto-linking res-ref-name 'org.apache.openejb.test.stateless.AnnotatedFieldInjectionStatelessBean/queueCoonnectionFactory' in bean AnnotatedFieldInjectionStatelessBean to Connector(id=Default JMS Connection Factory)
WARN - Auto-linking res-ref-name 'org.apache.openejb.test.stateless.AnnotatedFieldInjectionStatelessBean/topicCoonnectionFactory' in bean AnnotatedFieldInjectionStatelessBean to Connector(id=Default JMS Connection Factory)
log4j:WARN No appenders could be found for logger (org.apache.activemq.broker.BrokerService).
log4j:WARN Please initialize the log4j system properly.
ERROR - FATAL ERROR: Unknown error in Assembler. Please send the following stack trace and this message to user@openejb.org :
org.apache.xbean.recipe.MissingAccessorException: Unable to find a valid setter method: public void org.apache.openejb.core.mdb.MdbContainer.setServerUrl(java.lang.String)
at org.apache.xbean.recipe.ObjectRecipe.findSetter(ObjectRecipe.java:692)
at org.apache.xbean.recipe.ObjectRecipe.setProperty(ObjectRecipe.java:275)
at org.apache.xbean.recipe.ObjectRecipe.setProperties(ObjectRecipe.java:251)
at org.apache.xbean.recipe.ObjectRecipe.create(ObjectRecipe.java:198)
at org.apache.xbean.recipe.AbstractRecipe.create(AbstractRecipe.java:28)
at org.apache.openejb.assembler.classic.Assembler.createContainer(Assembler.java:603)
at org.apache.openejb.assembler.classic.Assembler.buildContainerSystem(Assembler.java:293)
at org.apache.openejb.assembler.classic.Assembler.build(Assembler.java:201)
at org.apache.openejb.OpenEJB$Instance.<init>(OpenEJB.java:147)
at org.apache.openejb.OpenEJB.init(OpenEJB.java:280)
at org.apache.openejb.OpenEJB.init(OpenEJB.java:265)
at sun.reflect.NativeMethodAccessorImpl.invoke0(Native Method)
at sun.reflect.NativeMethodAccessorImpl.invoke(NativeMethodAccessorImpl.java:39)
at sun.reflect.DelegatingMethodAccessorImpl.invoke(DelegatingMethodAccessorImpl.java:25)
at java.lang.reflect.Method.invoke(Method.java:585)
at org.apache.openejb.loader.OpenEJBInstance.init(OpenEJBInstance.java:36)
at org.apache.openejb.client.LocalInitialContextFactory.init(LocalInitialContextFactory.java:56)
at org.apache.openejb.client.LocalInitialContextFactory.getInitialContext(LocalInitialContextFactory.java:42)
at javax.naming.spi.NamingManager.getInitialContext(NamingManager.java:667)
at javax.naming.InitialContext.getDefaultInitCtx(InitialContext.java:247)
at javax.naming.InitialContext.init(InitialContext.java:223)
at javax.naming.InitialContext.<init>(InitialContext.java:197)
at org.apache.openejb.test.HsqldbTestDatabase.start(HsqldbTestDatabase.java:180)
at org.apache.openejb.test.TestManager.start(TestManager.java:79)
at org.apache.openejb.iTest.setUp(iTest.java:57)
at org.apache.openejb.test.TestSuite.run(TestSuite.java:41)
at sun.reflect.NativeMethodAccessorImpl.invoke0(Native Method)
at sun.reflect.NativeMethodAccessorImpl.invoke(NativeMethodAccessorImpl.java:39)
at sun.reflect.DelegatingMethodAccessorImpl.invoke(DelegatingMethodAccessorImpl.java:25)
at java.lang.reflect.Method.invoke(Method.java:585)
at org.apache.maven.surefire.junit.JUnitTestSet.execute(JUnitTestSet.java:210)
at org.apache.maven.surefire.suite.AbstractDirectoryTestSuite.executeTestSet(AbstractDirectoryTestSuite.java:135)
at org.apache.maven.surefire.suite.AbstractDirectoryTestSuite.execute(AbstractDirectoryTestSuite.java:160)
at org.apache.maven.surefire.Surefire.run(Surefire.java:81)
at sun.reflect.NativeMethodAccessorImpl.invoke0(Native Method)
at sun.reflect.NativeMethodAccessorImpl.invoke(NativeMethodAccessorImpl.java:39)
at sun.reflect.DelegatingMethodAccessorImpl.invoke(DelegatingMethodAccessorImpl.java:25)
at java.lang.reflect.Method.invoke(Method.java:585)
at org.apache.maven.surefire.booter.SurefireBooter.runSuitesInProcess(SurefireBooter.java:182)
at org.apache.maven.surefire.booter.SurefireBooter.main(SurefireBooter.java:743)
FATAL - OpenEJB has encountered a fatal error and cannot be started: Assembler failed to build the container system.
org.apache.openejb.OpenEJBException: org.apache.xbean.recipe.MissingAccessorException: Unable to find a valid setter method: public void org.apache.openejb.core.mdb.MdbContainer.setServerUrl(java.lang.String): Unable to find a valid setter method: public void org.apache.openejb.core.mdb.MdbContainer.setServerUrl(java.lang.String)
at org.apache.openejb.assembler.classic.Assembler.build(Assembler.java:214)
at org.apache.openejb.OpenEJB$Instance.<init>(OpenEJB.java:147)
at org.apache.openejb.OpenEJB.init(OpenEJB.java:280)
at org.apache.openejb.OpenEJB.init(OpenEJB.java:265)
at sun.reflect.NativeMethodAccessorImpl.invoke0(Native Method)
at sun.reflect.NativeMethodAccessorImpl.invoke(NativeMethodAccessorImpl.java:39)
at sun.reflect.DelegatingMethodAccessorImpl.invoke(DelegatingMethodAccessorImpl.java:25)
at java.lang.reflect.Method.invoke(Method.java:585)
at org.apache.openejb.loader.OpenEJBInstance.init(OpenEJBInstance.java:36)
at org.apache.openejb.client.LocalInitialContextFactory.init(LocalInitialContextFactory.java:56)
at org.apache.openejb.client.LocalInitialContextFactory.getInitialContext(LocalInitialContextFactory.java:42)
at javax.naming.spi.NamingManager.getInitialContext(NamingManager.java:667)
at javax.naming.InitialContext.getDefaultInitCtx(InitialContext.java:247)
at javax.naming.InitialContext.init(InitialContext.java:223)
at javax.naming.InitialContext.<init>(InitialContext.java:197)
at org.apache.openejb.test.HsqldbTestDatabase.start(HsqldbTestDatabase.java:180)
at org.apache.openejb.test.TestManager.start(TestManager.java:79)
at org.apache.openejb.iTest.setUp(iTest.java:57)
at org.apache.openejb.test.TestSuite.run(TestSuite.java:41)
at sun.reflect.NativeMethodAccessorImpl.invoke0(Native Method)
at sun.reflect.NativeMethodAccessorImpl.invoke(NativeMethodAccessorImpl.java:39)
at sun.reflect.DelegatingMethodAccessorImpl.invoke(DelegatingMethodAccessorImpl.java:25)
at java.lang.reflect.Method.invoke(Method.java:585)
at org.apache.maven.surefire.junit.JUnitTestSet.execute(JUnitTestSet.java:210)
at org.apache.maven.surefire.suite.AbstractDirectoryTestSuite.executeTestSet(AbstractDirectoryTestSuite.java:135)
at org.apache.maven.surefire.suite.AbstractDirectoryTestSuite.execute(AbstractDirectoryTestSuite.java:160)
at org.apache.maven.surefire.Surefire.run(Surefire.java:81)
at sun.reflect.NativeMethodAccessorImpl.invoke0(Native Method)
at sun.reflect.NativeMethodAccessorImpl.invoke(NativeMethodAccessorImpl.java:39)
at sun.reflect.DelegatingMethodAccessorImpl.invoke(DelegatingMethodAccessorImpl.java:25)
at java.lang.reflect.Method.invoke(Method.java:585)
at org.apache.maven.surefire.booter.SurefireBooter.runSuitesInProcess(SurefireBooter.java:182)
at org.apache.maven.surefire.booter.SurefireBooter.main(SurefireBooter.java:743)
Caused by: org.apache.xbean.recipe.MissingAccessorException: Unable to find a valid setter method: public void org.apache.openejb.core.mdb.MdbContainer.setServerUrl(java.lang.String)
at org.apache.xbean.recipe.ObjectRecipe.findSetter(ObjectRecipe.java:692)
at org.apache.xbean.recipe.ObjectRecipe.setProperty(ObjectRecipe.java:275)
at org.apache.xbean.recipe.ObjectRecipe.setProperties(ObjectRecipe.java:251)
at org.apache.xbean.recipe.ObjectRecipe.create(ObjectRecipe.java:198)
at org.apache.xbean.recipe.AbstractRecipe.create(AbstractRecipe.java:28)
at org.apache.openejb.assembler.classic.Assembler.createContainer(Assembler.java:603)
at org.apache.openejb.assembler.classic.Assembler.buildContainerSystem(Assembler.java:293)
at org.apache.openejb.assembler.classic.Assembler.build(Assembler.java:201)
... 32 more
Tests run: 1, Failures: 0, Errors: 1, Skipped: 0, Time elapsed: 16.704 sec <<< FAILURE!
Running org.apache.openejb.core.mdb.JmsProxyTest
log4j:WARN No appenders could be found for logger (org.apache.activemq.broker.BrokerService).
log4j:WARN Please initialize the log4j system properly.
Tests run: 1, Failures: 0, Errors: 0, Skipped: 0, Time elapsed: 11.123 sec
Running org.apache.openejb.assembler.classic.JdbcConfigTest
log4j:WARN No appenders could be found for logger (OpenEJB.startup.config).
log4j:WARN Please initialize the log4j system properly.
Tests run: 1, Failures: 0, Errors: 0, Skipped: 0, Time elapsed: 2.378 sec
Running org.apache.openejb.util.ClassesTest
Tests run: 1, Failures: 0, Errors: 0, Skipped: 0, Time elapsed: 0.066 sec
Running org.apache.openejb.core.ivm.naming.IvmContextTest
Tests run: 1, Failures: 0, Errors: 0, Skipped: 0, Time elapsed: 0.093 sec
Running org.apache.openejb.config.JaxbUnmarshallerTest
Tests run: 1, Failures: 0, Errors: 0, Skipped: 0, Time elapsed: 1.988 sec
Running org.apache.openejb.core.stateful.StatefulContainerTest
log4j:WARN No appenders could be found for logger (OpenEJB.startup.config).
log4j:WARN Please initialize the log4j system properly.
Tests run: 2, Failures: 0, Errors: 0, Skipped: 0, Time elapsed: 5.272 sec
Running org.apache.openejb.core.cmp.jpa.JpaTest
Tests run: 2, Failures: 0, Errors: 0, Skipped: 0, Time elapsed: 8.081 sec
Running org.apache.openejb.DependenceValidationTest
Tests run: 1, Failures: 0, Errors: 0, Skipped: 0, Time elapsed: 1.407 sec
Running org.apache.openejb.core.stateful.StatefulSessionBeanTest
log4j:WARN No appenders could be found for logger (OpenEJB.startup.config).
log4j:WARN Please initialize the log4j system properly.
Tests run: 1, Failures: 0, Errors: 0, Skipped: 0, Time elapsed: 4.431 sec
Running org.apache.openejb.core.stateless.CrossClassLoaderProxyTest
log4j:WARN No appenders could be found for logger (OpenEJB).
log4j:WARN Please initialize the log4j system properly.
Tests run: 4, Failures: 0, Errors: 0, Skipped: 0, Time elapsed: 1.067 sec
Running org.apache.openejb.core.stateless.ExtendedInjectionTest
log4j:WARN No appenders could be found for logger (OpenEJB).
log4j:WARN Please initialize the log4j system properly.
Tests run: 2, Failures: 0, Errors: 0, Skipped: 0, Time elapsed: 0.948 sec
Running org.apache.openejb.assembler.classic.RedeployTest
log4j:WARN No appenders could be found for logger (OpenEJB.startup.config).
log4j:WARN Please initialize the log4j system properly.
234 INFO [main] openjpa.MetaData - Found 36 classes with metadata in 89 milliseconds.
44 INFO [main] openjpa.MetaData - Found 1 classes with metadata in 38 milliseconds.
765 INFO [main] openjpa.MetaData - Parsing resource "jar:file:/home/continuum/.m2/repository/org/apache/openejb/openejb-itests-beans/3.0-incubating-SNAPSHOT/openejb-itests-beans-3.0-incubating-SNAPSHOT.jar!/META-INF/jpa.mapping.xml".
1368 INFO [main] openjpa.MetaData - Parsing class "org.apache.openejb.test.entity.cmp2.Employee".
1408 INFO [main] openjpa.MetaData - Parsing class "org.apache.openejb.test.entity.cmp2.Employee".
1408 INFO [main] openjpa.MetaData - Parsing package "org.apache.openejb.test.entity.cmp2.Employee".
1432 INFO [main] openjpa.MetaData - Parsing resource "jar:file:/tmp/OpenEJB_Generated_38325.jar!/META-INF/openejb-cmp-generated-orm.xml".
1530 INFO [main] openjpa.MetaData - Parsing class "org.apache.openejb.test.entity.cmp.BasicCmpBean".
1535 INFO [main] openjpa.MetaData - Parsing class "org.apache.openejb.test.entity.cmp.BasicCmpBean".
1535 INFO [main] openjpa.MetaData - Parsing package "org.apache.openejb.test.entity.cmp.BasicCmpBean".
1540 INFO [main] openjpa.MetaData - Parsing class "org.apache.openejb.test.entity.cmp.ComplexCmpBean".
1544 INFO [main] openjpa.MetaData - Parsing class "org.apache.openejb.test.entity.cmp.ComplexCmpBean".
1549 INFO [main] openjpa.MetaData - Parsing class "org.apache.openejb.test.entity.cmp.UnknownCmpBean".
1550 INFO [main] openjpa.MetaData - Parsing class "org.apache.openejb.test.entity.cmp.UnknownCmpBean".
1555 INFO [main] openjpa.MetaData - Parsing class "org.apache.openejb.test.entity.cmp.AllowedOperationsCmpBean".
1557 INFO [main] openjpa.MetaData - Parsing class "org.apache.openejb.test.entity.cmp.AllowedOperationsCmpBean".
1561 INFO [main] openjpa.MetaData - Parsing class "org.apache.openejb.test.entity.cmp.EncCmpBean".
1567 INFO [main] openjpa.MetaData - Parsing class "org.apache.openejb.test.entity.cmp.EncCmpBean".
1571 INFO [main] openjpa.MetaData - Parsing class "org.apache.openejb.test.entity.cmp.ContextLookupCmpBean".
1593 INFO [main] openjpa.MetaData - Parsing class "org.apache.openejb.test.entity.cmp.ContextLookupCmpBean".
1598 INFO [main] openjpa.MetaData - Parsing class "org.apache.openejb.test.entity.cmp.RmiIiopCmpBean".
1602 INFO [main] openjpa.MetaData - Parsing class "org.apache.openejb.test.entity.cmp.RmiIiopCmpBean".
1610 INFO [main] openjpa.MetaData - Parsing class "openejb.org.apache.openejb.test.entity.cmp.BasicCmpBeanX".
1611 INFO [main] openjpa.MetaData - Parsing class "openejb.org.apache.openejb.test.entity.cmp.BasicCmpBeanX".
1611 INFO [main] openjpa.MetaData - Parsing package "openejb.org.apache.openejb.test.entity.cmp.BasicCmpBeanX".
1612 INFO [main] openjpa.MetaData - Parsing query "BasicCmpBeanX.findByLastName(java.lang.String)".
1614 INFO [main] openjpa.MetaData - Parsing query "BasicCmpBeanX.findEmptyCollection".
1624 INFO [main] openjpa.MetaData - Parsing class "openejb.org.apache.openejb.test.entity.cmp.ComplexCmpBeanX".
1624 INFO [main] openjpa.MetaData - Parsing class "openejb.org.apache.openejb.test.entity.cmp.ComplexCmpBeanX".
1625 INFO [main] openjpa.MetaData - Parsing query "ComplexCmpBeanX.findByLastName(java.lang.String)".
1625 INFO [main] openjpa.MetaData - Parsing query "ComplexCmpBeanX.findEmptyCollection".
1628 INFO [main] openjpa.MetaData - Parsing class "openejb.org.apache.openejb.test.entity.cmp.UnknownCmpBeanX".
1628 INFO [main] openjpa.MetaData - Parsing class "openejb.org.apache.openejb.test.entity.cmp.UnknownCmpBeanX".
1629 INFO [main] openjpa.MetaData - Parsing query "UnknownCmpBeanX.findByLastName(java.lang.String)".
1629 INFO [main] openjpa.MetaData - Parsing query "UnknownCmpBeanX.findEmptyCollection".
1636 INFO [main] openjpa.MetaData - Parsing class "openejb.org.apache.openejb.test.entity.cmp.BasicCmp2Bean".
1638 INFO [main] openjpa.MetaData - Parsing class "openejb.org.apache.openejb.test.entity.cmp.BasicCmp2Bean".
1639 INFO [main] openjpa.MetaData - Parsing query "BasicCmp2Bean.findByLastName(java.lang.String)".
1639 INFO [main] openjpa.MetaData - Parsing query "BasicCmp2Bean.findEmptyCollection".
1647 INFO [main] openjpa.MetaData - Parsing class "openejb.org.apache.openejb.test.entity.cmp.ComplexCmp2Bean".
1649 INFO [main] openjpa.MetaData - Parsing class "openejb.org.apache.openejb.test.entity.cmp.ComplexCmp2Bean".
1650 INFO [main] openjpa.MetaData - Parsing query "ComplexCmp2Bean.findByLastName(java.lang.String)".
1651 INFO [main] openjpa.MetaData - Parsing query "ComplexCmp2Bean.findEmptyCollection".
1655 INFO [main] openjpa.MetaData - Parsing class "openejb.org.apache.openejb.test.entity.cmp.UnknownCmp2Bean".
1657 INFO [main] openjpa.MetaData - Parsing class "openejb.org.apache.openejb.test.entity.cmp.UnknownCmp2Bean".
1658 INFO [main] openjpa.MetaData - Parsing query "UnknownCmp2Bean.findByLastName(java.lang.String)".
1658 INFO [main] openjpa.MetaData - Parsing query "UnknownCmp2Bean.findEmptyCollection".
1663 INFO [main] openjpa.MetaData - Parsing class "openejb.org.apache.openejb.test.entity.cmp.AOBasicCmpBean".
1663 INFO [main] openjpa.MetaData - Parsing class "openejb.org.apache.openejb.test.entity.cmp.AOBasicCmpBean".
1664 INFO [main] openjpa.MetaData - Parsing query "AOBasicCmpBean.findByLastName(java.lang.String)".
1665 INFO [main] openjpa.MetaData - Parsing query "AOBasicCmpBean.findEmptyCollection".
1675 INFO [main] openjpa.MetaData - Parsing class "openejb.org.apache.openejb.test.entity.cmp.AllowedOperationsCmp2Bean".
1677 INFO [main] openjpa.MetaData - Parsing class "openejb.org.apache.openejb.test.entity.cmp.AllowedOperationsCmp2Bean".
1678 INFO [main] openjpa.MetaData - Parsing query "AllowedOperationsCmp2Bean.findByLastName(java.lang.String)".
1678 INFO [main] openjpa.MetaData - Parsing query "AllowedOperationsCmp2Bean.findEmptyCollection".
1681 INFO [main] openjpa.MetaData - Parsing class "openejb.org.apache.openejb.test.entity.cmp.EncCmpBean".
1682 INFO [main] openjpa.MetaData - Parsing class "openejb.org.apache.openejb.test.entity.cmp.EncCmpBean".
1690 INFO [main] openjpa.MetaData - Parsing class "openejb.org.apache.openejb.test.entity.cmp.EncCmp2Bean".
1693 INFO [main] openjpa.MetaData - Parsing class "openejb.org.apache.openejb.test.entity.cmp.EncCmp2Bean".
1695 INFO [main] openjpa.MetaData - Parsing class "openejb.org.apache.openejb.test.entity.cmp.ContextLookupCmpBean".
1696 INFO [main] openjpa.MetaData - Parsing class "openejb.org.apache.openejb.test.entity.cmp.ContextLookupCmpBean".
1701 INFO [main] openjpa.MetaData - Parsing class "openejb.org.apache.openejb.test.entity.cmp.Cmp_RMI_IIOP_Bean".
1702 INFO [main] openjpa.MetaData - Parsing class "openejb.org.apache.openejb.test.entity.cmp.Cmp_RMI_IIOP_Bean".
1709 INFO [main] openjpa.MetaData - Parsing class "openejb.org.apache.openejb.test.entity.cmp.Cmp2_RMI_IIOP_Bean".
1711 INFO [main] openjpa.MetaData - Parsing class "openejb.org.apache.openejb.test.entity.cmp.Cmp2_RMI_IIOP_Bean".
1720 INFO [main] openjpa.MetaData - Parsing class "openejb.org.apache.openejb.test.entity.cmr.onetoone.Person".
1730 INFO [main] openjpa.MetaData - Parsing class "openejb.org.apache.openejb.test.entity.cmr.onetoone.Person".
1731 INFO [main] openjpa.MetaData - Parsing package "openejb.org.apache.openejb.test.entity.cmr.onetoone.Person".
1732 INFO [main] openjpa.MetaData - Parsing query "Person.findByPrimaryKey(org.apache.openejb.test.entity.cmr.onetoone.PersonPk)".
1736 INFO [main] openjpa.MetaData - Parsing class "openejb.org.apache.openejb.test.entity.cmr.onetoone.License".
1745 INFO [main] openjpa.MetaData - Parsing class "openejb.org.apache.openejb.test.entity.cmr.onetoone.License".
1746 INFO [main] openjpa.MetaData - Parsing query "License.findByPrimaryKey(org.apache.openejb.test.entity.cmr.onetoone.LicensePk)".
1755 INFO [main] openjpa.MetaData - Parsing class "openejb.org.apache.openejb.test.entity.cmr.onetomany.Artist".
1760 INFO [main] openjpa.MetaData - Parsing class "openejb.org.apache.openejb.test.entity.cmr.onetomany.Artist".
1760 INFO [main] openjpa.MetaData - Parsing package "openejb.org.apache.openejb.test.entity.cmr.onetomany.Artist".
1762 INFO [main] openjpa.MetaData - Parsing query "Artist.findByPrimaryKey(org.apache.openejb.test.entity.cmr.onetomany.ArtistPk)".
1768 INFO [main] openjpa.MetaData - Parsing class "openejb.org.apache.openejb.test.entity.cmr.onetomany.Song".
1772 INFO [main] openjpa.MetaData - Parsing class "openejb.org.apache.openejb.test.entity.cmr.onetomany.Song".
1773 INFO [main] openjpa.MetaData - Parsing query "Song.findByPrimaryKey(org.apache.openejb.test.entity.cmr.onetomany.SongPk)".
1778 INFO [main] openjpa.MetaData - Parsing class "openejb.org.apache.openejb.test.entity.cmr.manytomany.Game".
1783 INFO [main] openjpa.MetaData - Parsing class "openejb.org.apache.openejb.test.entity.cmr.manytomany.Game".
1783 INFO [main] openjpa.MetaData - Parsing package "openejb.org.apache.openejb.test.entity.cmr.manytomany.Game".
1784 INFO [main] openjpa.MetaData - Parsing query "Game.findByPrimaryKey(org.apache.openejb.test.entity.cmr.manytomany.GamePk)".
1791 INFO [main] openjpa.MetaData - Parsing class "openejb.org.apache.openejb.test.entity.cmr.manytomany.Platform".
1795 INFO [main] openjpa.MetaData - Parsing class "openejb.org.apache.openejb.test.entity.cmr.manytomany.Platform".
1795 INFO [main] openjpa.MetaData - Parsing query "Platform.findByPrimaryKey(org.apache.openejb.test.entity.cmr.manytomany.PlatformPk)".
1799 INFO [main] openjpa.MetaData - Parsing class "openejb.org.apache.openejb.test.entity.cmr.onetoone.ComplexPerson".
1802 INFO [main] openjpa.MetaData - Parsing class "openejb.org.apache.openejb.test.entity.cmr.onetoone.ComplexPerson".
1803 INFO [main] openjpa.MetaData - Parsing query "ComplexPerson.findByPrimaryKey(java.lang.Integer)".
1809 INFO [main] openjpa.MetaData - Parsing class "openejb.org.apache.openejb.test.entity.cmr.onetoone.ComplexLicense".
1811 INFO [main] openjpa.MetaData - Parsing class "openejb.org.apache.openejb.test.entity.cmr.onetoone.ComplexLicense".
1811 INFO [main] openjpa.MetaData - Parsing query "ComplexLicense.findByPrimaryKey(java.lang.Integer)".
1820 INFO [main] openjpa.MetaData - Parsing class "openejb.org.apache.openejb.test.entity.cmr.onetomany.ComplexArtist".
1822 INFO [main] openjpa.MetaData - Parsing class "openejb.org.apache.openejb.test.entity.cmr.onetomany.ComplexArtist".
1823 INFO [main] openjpa.MetaData - Parsing query "ComplexArtist.findByPrimaryKey(java.lang.Integer)".
1826 INFO [main] openjpa.MetaData - Parsing class "openejb.org.apache.openejb.test.entity.cmr.onetomany.ComplexSong".
1828 INFO [main] openjpa.MetaData - Parsing class "openejb.org.apache.openejb.test.entity.cmr.onetomany.ComplexSong".
1828 INFO [main] openjpa.MetaData - Parsing query "ComplexSong.findByPrimaryKey(java.lang.Integer)".
1831 INFO [main] openjpa.MetaData - Parsing class "openejb.org.apache.openejb.test.entity.cmr.manytomany.ComplexGame".
1833 INFO [main] openjpa.MetaData - Parsing class "openejb.org.apache.openejb.test.entity.cmr.manytomany.ComplexGame".
1833 INFO [main] openjpa.MetaData - Parsing query "ComplexGame.findByPrimaryKey(java.lang.Integer)".
1837 INFO [main] openjpa.MetaData - Parsing class "openejb.org.apache.openejb.test.entity.cmr.manytomany.ComplexPlatform".
1839 INFO [main] openjpa.MetaData - Parsing class "openejb.org.apache.openejb.test.entity.cmr.manytomany.ComplexPlatform".
1839 INFO [main] openjpa.MetaData - Parsing query "ComplexPlatform.findByPrimaryKey(java.lang.Integer)".
1858 INFO [main] openjpa.MetaData - Parsing class "openejb.org.apache.openejb.test.entity.ejbql.Query".
1860 INFO [main] openjpa.MetaData - Parsing class "openejb.org.apache.openejb.test.entity.ejbql.Query".
1861 INFO [main] openjpa.MetaData - Parsing package "openejb.org.apache.openejb.test.entity.ejbql.Query".
1862 INFO [main] openjpa.MetaData - Parsing query "Query.ejbSelectSingleStringField(java.lang.String)".
1862 INFO [main] openjpa.MetaData - Parsing query "Query.ejbSelectSingleBooleanField(boolean)".
1863 INFO [main] openjpa.MetaData - Parsing query "Query.ejbSelectSingleCharField(char)".
1863 INFO [main] openjpa.MetaData - Parsing query "Query.ejbSelectSingleByteField(byte)".
1864 INFO [main] openjpa.MetaData - Parsing query "Query.ejbSelectSingleShortField(short)".
1864 INFO [main] openjpa.MetaData - Parsing query "Query.ejbSelectSingleIntField(int)".
1864 INFO [main] openjpa.MetaData - Parsing query "Query.ejbSelectSingleLongField(long)".
1864 INFO [main] openjpa.MetaData - Parsing query "Query.ejbSelectSingleFloatField(float)".
1865 INFO [main] openjpa.MetaData - Parsing query "Query.ejbSelectSingleDoubleField(double)".
1865 INFO [main] openjpa.MetaData - Parsing query "Query.ejbSelectCollectionStringField".
1866 INFO [main] openjpa.MetaData - Parsing query "Query.ejbSelectCollectionBooleanField".
1866 INFO [main] openjpa.MetaData - Parsing query "Query.ejbSelectCollectionCharField".
1866 INFO [main] openjpa.MetaData - Parsing query "Query.ejbSelectCollectionByteField".
1867 INFO [main] openjpa.MetaData - Parsing query "Query.ejbSelectCollectionShortField".
1867 INFO [main] openjpa.MetaData - Parsing query "Query.ejbSelectCollectionIntField".
1867 INFO [main] openjpa.MetaData - Parsing query "Query.ejbSelectCollectionLongField".
1868 INFO [main] openjpa.MetaData - Parsing query "Query.ejbSelectCollectionFloatField".
1868 INFO [main] openjpa.MetaData - Parsing query "Query.ejbSelectCollectionDoubleField".
1868 INFO [main] openjpa.MetaData - Parsing query "Query.ejbSelectSingleLocalEjb(int)".
1869 INFO [main] openjpa.MetaData - Parsing query "Query.ejbSelectSingleRemoteEjb(int)".
1869 INFO [main] openjpa.MetaData - Parsing query "Query.ejbSelectCollectionLocalEjb".
1869 INFO [main] openjpa.MetaData - Parsing query "Query.ejbSelectCollectionRemoteEjb".
1874 INFO [main] openjpa.MetaData - Parsing class "openejb.org.apache.openejb.test.entity.ejbql.QueryData".
1877 INFO [main] openjpa.MetaData - Parsing class "openejb.org.apache.openejb.test.entity.ejbql.QueryData".
1883 INFO [main] openjpa.MetaData - Parsing class "org.apache.openejb.test.object.OperationsPolicy".
1883 INFO [main] openjpa.MetaData - Parsing package "org.apache.openejb.test.object.OperationsPolicy".
1905 INFO [main] openjpa.MetaData - Parsing class "javax.ejb.EntityContext".
1906 INFO [main] openjpa.MetaData - Parsing package "javax.ejb.EntityContext".
2729 INFO [main] openjpa.MetaData - Parsing class "org.apache.openejb.test.entity.cmp.BasicCmp2Bean".
2797 INFO [main] openjpa.MetaData - Parsing class "org.apache.openejb.test.entity.cmp.ComplexCmp2Bean".
2800 INFO [main] openjpa.MetaData - Parsing class "org.apache.openejb.test.entity.cmp.ComplexCmpBeanPk".
2871 INFO [main] openjpa.MetaData - Parsing class "org.apache.openejb.test.entity.cmp.UnknownCmp2Bean".
3033 INFO [main] openjpa.MetaData - Parsing class "org.apache.openejb.test.entity.cmp.AllowedOperationsCmp2Bean".
3200 INFO [main] openjpa.MetaData - Parsing class "org.apache.openejb.test.entity.cmp.EncCmp2Bean".
3491 INFO [main] openjpa.MetaData - Parsing class "org.apache.openejb.test.entity.cmp.RmiIiopCmp2Bean".
3548 INFO [main] openjpa.MetaData - Parsing class "org.apache.openejb.test.entity.cmr.onetoone.PersonBean".
3548 INFO [main] openjpa.MetaData - Parsing package "org.apache.openejb.test.entity.cmr.onetoone.PersonBean".
3550 INFO [main] openjpa.MetaData - Parsing class "org.apache.openejb.test.entity.cmr.onetoone.LicenseBean".
3656 INFO [main] openjpa.MetaData - Parsing class "org.apache.openejb.test.entity.cmr.onetomany.ArtistBean".
3656 INFO [main] openjpa.MetaData - Parsing package "org.apache.openejb.test.entity.cmr.onetomany.ArtistBean".
3656 INFO [main] openjpa.MetaData - Parsing class "org.apache.openejb.test.entity.cmr.onetomany.SongBean".
3787 INFO [main] openjpa.MetaData - Parsing class "org.apache.openejb.test.entity.cmr.manytomany.GameBean".
3788 INFO [main] openjpa.MetaData - Parsing package "org.apache.openejb.test.entity.cmr.manytomany.GameBean".
3788 INFO [main] openjpa.MetaData - Parsing class "org.apache.openejb.test.entity.cmr.manytomany.PlatformBean".
3902 INFO [main] openjpa.MetaData - Parsing class "org.apache.openejb.test.entity.cmr.onetoone.PersonPk".
3972 INFO [main] openjpa.MetaData - Parsing class "org.apache.openejb.test.entity.cmr.onetoone.LicensePk".
4027 INFO [main] openjpa.MetaData - Parsing class "org.apache.openejb.test.entity.cmr.onetomany.ArtistPk".
4074 INFO [main] openjpa.MetaData - Parsing class "org.apache.openejb.test.entity.cmr.onetomany.SongPk".
4129 INFO [main] openjpa.MetaData - Parsing class "org.apache.openejb.test.entity.cmr.manytomany.GamePk".
4168 INFO [main] openjpa.MetaData - Parsing class "org.apache.openejb.test.entity.cmr.manytomany.PlatformPk".
4242 INFO [main] openjpa.MetaData - Parsing class "org.apache.openejb.test.entity.ejbql.QueryBean".
4243 INFO [main] openjpa.MetaData - Parsing package "org.apache.openejb.test.entity.ejbql.QueryBean".
4291 INFO [main] openjpa.MetaData - Parsing class "org.apache.openejb.test.entity.ejbql.QueryDataBean".
44 INFO [main] openjpa.MetaData - Found 36 classes with metadata in 43 milliseconds.
38 INFO [main] openjpa.MetaData - Found 1 classes with metadata in 37 milliseconds.
42 INFO [main] openjpa.MetaData - Found 36 classes with metadata in 41 milliseconds.
32 INFO [main] openjpa.MetaData - Found 1 classes with metadata in 31 milliseconds.
Tests run: 1, Failures: 0, Errors: 0, Skipped: 0, Time elapsed: 30.533 sec
Running org.apache.openejb.resource.SharedLocalConnectionManagerTest
Tests run: 1, Failures: 0, Errors: 0, Skipped: 0, Time elapsed: 1.13 sec
Running org.apache.openejb.assembler.classic.InterceptorBindingInfoComparatorTest
Tests run: 2, Failures: 0, Errors: 0, Skipped: 0, Time elapsed: 0.186 sec
Running org.apache.openejb.assembler.classic.MdbConfigTest
log4j:WARN No appenders could be found for logger (OpenEJB.startup.config).
log4j:WARN Please initialize the log4j system properly.
Tests run: 1, Failures: 0, Errors: 0, Skipped: 0, Time elapsed: 9.98 sec
Running org.apache.openejb.core.security.PropertiesLoginModuleTest
Path to login config: /x1/continuum/working-directory/158/target/test-classes/login.config
Path to login config: /x1/continuum/working-directory/158/target/test-classes/login.config
Path to login config: /x1/continuum/working-directory/158/target/test-classes/login.config
Tests run: 3, Failures: 0, Errors: 3, Skipped: 0, Time elapsed: 0.282 sec <<< FAILURE!
Running org.apache.openejb.assembler.classic.PersistenceUnitRefTest
Tests run: 1, Failures: 0, Errors: 0, Skipped: 0, Time elapsed: 0.208 sec
Running org.apache.openejb.resource.GeronimoConnectionManagerTest
log4j:WARN No appenders could be found for logger (org.apache.geronimo.connector.outbound.AbstractSinglePoolConnectionInterceptor).
log4j:WARN Please initialize the log4j system properly.
Tests run: 1, Failures: 0, Errors: 0, Skipped: 0, Time elapsed: 1.118 sec
Running org.apache.openejb.core.mdb.JmsTest
log4j:WARN No appenders could be found for logger (org.apache.activemq.broker.BrokerService).
log4j:WARN Please initialize the log4j system properly.
Tests run: 1, Failures: 0, Errors: 0, Skipped: 0, Time elapsed: 11.986 sec
Running org.apache.openejb.SomeoneBrokeSurefireAndThisIsADirtyHackForItTest
test server = org.apache.openejb.test.IvmTestServer
entry = java.naming.factory.initial:org.apache.openejb.client.LocalInitialContextFactory
WARN - Unable use logging config as there are 3 file references containing directories which have not been created. See the list below.
WARN - [0] /x1/continuum/working-directory/158/target/test-classes/conf/logs/transaction.log
WARN - [1] /x1/continuum/working-directory/158/target/test-classes/conf/logs/openejb.log
WARN - [2] /x1/continuum/working-directory/158/target/test-classes/conf/logs/server.log
Apache OpenEJB 3.0-incubating-SNAPSHOT build: 20070401-02:02
http://incubator.apache.org/openejb
INFO - openejb.home = /x1/continuum/working-directory/158/target/test-classes
INFO - openejb.base = /x1/continuum/working-directory/158/target/test-classes
INFO - Found EjbModule in classpath: /home/continuum/.m2/repository/org/apache/openejb/openejb-itests-beans/3.0-incubating-SNAPSHOT/openejb-itests-beans-3.0-incubating-SNAPSHOT.jar
WARN - Auto-linking res-ref-name 'stateless/references/Resource_manager_access' in bean client/tests/entity/cmp/allowed_operations/EntityHome to Connector(id=Default JDBC Database)
WARN - Auto-linking res-ref-name 'stateless/references/Resource_manager_access' in bean client/tests/entity/cmp2/allowed_operations/EntityHome to Connector(id=Default JDBC Database)
WARN - Auto-linking res-ref-name 'org.apache.openejb.test.stateful.AnnotatedFieldInjectionStatefulBean/daataSource' in bean AnnotatedFieldInjectionStatefulBean to Connector(id=Default JDBC Database)
WARN - Auto-linking res-ref-name 'org.apache.openejb.test.stateful.AnnotatedFieldInjectionStatefulBean/coonnectionFactory' in bean AnnotatedFieldInjectionStatefulBean to Connector(id=Default JMS Connection Factory)
WARN - Auto-linking res-ref-name 'org.apache.openejb.test.stateful.AnnotatedFieldInjectionStatefulBean/queueCoonnectionFactory' in bean AnnotatedFieldInjectionStatefulBean to Connector(id=Default JMS Connection Factory)
WARN - Auto-linking res-ref-name 'org.apache.openejb.test.stateful.AnnotatedFieldInjectionStatefulBean/topicCoonnectionFactory' in bean AnnotatedFieldInjectionStatefulBean to Connector(id=Default JMS Connection Factory)
WARN - Auto-linking res-ref-name 'org.apache.openejb.test.stateless.AnnotatedFieldInjectionStatelessBean/daataSource' in bean AnnotatedFieldInjectionStatelessBean to Connector(id=Default JDBC Database)
WARN - Auto-linking res-ref-name 'org.apache.openejb.test.stateless.AnnotatedFieldInjectionStatelessBean/coonnectionFactory' in bean AnnotatedFieldInjectionStatelessBean to Connector(id=Default JMS Connection Factory)
WARN - Auto-linking res-ref-name 'org.apache.openejb.test.stateless.AnnotatedFieldInjectionStatelessBean/queueCoonnectionFactory' in bean AnnotatedFieldInjectionStatelessBean to Connector(id=Default JMS Connection Factory)
WARN - Auto-linking res-ref-name 'org.apache.openejb.test.stateless.AnnotatedFieldInjectionStatelessBean/topicCoonnectionFactory' in bean AnnotatedFieldInjectionStatelessBean to Connector(id=Default JMS Connection Factory)
WARN - Auto-linking res-ref-name 'org.apache.openejb.test.mdb.AnnotatedFieldInjectionMdbBean/daataSource' in bean AnnotatedFieldInjectionMdbBean to Connector(id=Default JDBC Database)
WARN - Auto-linking res-ref-name 'org.apache.openejb.test.mdb.AnnotatedFieldInjectionMdbBean/coonnectionFactory' in bean AnnotatedFieldInjectionMdbBean to Connector(id=Default JMS Connection Factory)
WARN - Auto-linking res-ref-name 'org.apache.openejb.test.mdb.AnnotatedFieldInjectionMdbBean/queueCoonnectionFactory' in bean AnnotatedFieldInjectionMdbBean to Connector(id=Default JMS Connection Factory)
WARN - Auto-linking res-ref-name 'org.apache.openejb.test.mdb.AnnotatedFieldInjectionMdbBean/topicCoonnectionFactory' in bean AnnotatedFieldInjectionMdbBean to Connector(id=Default JMS Connection Factory)
log4j:WARN No appenders could be found for logger (org.apache.activemq.broker.BrokerService).
log4j:WARN Please initialize the log4j system properly.
ERROR - FATAL ERROR: Unknown error in Assembler. Please send the following stack trace and this message to user@openejb.org :
org.apache.xbean.recipe.MissingAccessorException: Unable to find a valid setter method: public void org.apache.openejb.core.mdb.MdbContainer.setServerUrl(java.lang.String)
at org.apache.xbean.recipe.ObjectRecipe.findSetter(ObjectRecipe.java:692)
at org.apache.xbean.recipe.ObjectRecipe.setProperty(ObjectRecipe.java:275)
at org.apache.xbean.recipe.ObjectRecipe.setProperties(ObjectRecipe.java:251)
at org.apache.xbean.recipe.ObjectRecipe.create(ObjectRecipe.java:198)
at org.apache.xbean.recipe.AbstractRecipe.create(AbstractRecipe.java:28)
at org.apache.openejb.assembler.classic.Assembler.createContainer(Assembler.java:603)
at org.apache.openejb.assembler.classic.Assembler.buildContainerSystem(Assembler.java:293)
at org.apache.openejb.assembler.classic.Assembler.build(Assembler.java:201)
at org.apache.openejb.OpenEJB$Instance.<init>(OpenEJB.java:147)
at org.apache.openejb.OpenEJB.init(OpenEJB.java:280)
at org.apache.openejb.OpenEJB.init(OpenEJB.java:265)
at sun.reflect.NativeMethodAccessorImpl.invoke0(Native Method)
at sun.reflect.NativeMethodAccessorImpl.invoke(NativeMethodAccessorImpl.java:39)
at sun.reflect.DelegatingMethodAccessorImpl.invoke(DelegatingMethodAccessorImpl.java:25)
at java.lang.reflect.Method.invoke(Method.java:585)
at org.apache.openejb.loader.OpenEJBInstance.init(OpenEJBInstance.java:36)
at org.apache.openejb.client.LocalInitialContextFactory.init(LocalInitialContextFactory.java:56)
at org.apache.openejb.client.LocalInitialContextFactory.getInitialContext(LocalInitialContextFactory.java:42)
at javax.naming.spi.NamingManager.getInitialContext(NamingManager.java:667)
at javax.naming.InitialContext.getDefaultInitCtx(InitialContext.java:247)
at javax.naming.InitialContext.init(InitialContext.java:223)
at javax.naming.InitialContext.<init>(InitialContext.java:197)
at org.apache.openejb.test.HsqldbTestDatabase.start(HsqldbTestDatabase.java:180)
at org.apache.openejb.test.TestManager.start(TestManager.java:79)
at org.apache.openejb.iTest.setUp(iTest.java:57)
at org.apache.openejb.test.TestSuite.run(TestSuite.java:41)
at sun.reflect.NativeMethodAccessorImpl.invoke0(Native Method)
at sun.reflect.NativeMethodAccessorImpl.invoke(NativeMethodAccessorImpl.java:39)
at sun.reflect.DelegatingMethodAccessorImpl.invoke(DelegatingMethodAccessorImpl.java:25)
at java.lang.reflect.Method.invoke(Method.java:585)
at org.apache.maven.surefire.junit.JUnitTestSet.execute(JUnitTestSet.java:210)
at org.apache.maven.surefire.suite.AbstractDirectoryTestSuite.executeTestSet(AbstractDirectoryTestSuite.java:135)
at org.apache.maven.surefire.suite.AbstractDirectoryTestSuite.execute(AbstractDirectoryTestSuite.java:160)
at org.apache.maven.surefire.Surefire.run(Surefire.java:81)
at sun.reflect.NativeMethodAccessorImpl.invoke0(Native Method)
at sun.reflect.NativeMethodAccessorImpl.invoke(NativeMethodAccessorImpl.java:39)
at sun.reflect.DelegatingMethodAccessorImpl.invoke(DelegatingMethodAccessorImpl.java:25)
at java.lang.reflect.Method.invoke(Method.java:585)
at org.apache.maven.surefire.booter.SurefireBooter.runSuitesInProcess(SurefireBooter.java:182)
at org.apache.maven.surefire.booter.SurefireBooter.main(SurefireBooter.java:743)
FATAL - OpenEJB has encountered a fatal error and cannot be started: Assembler failed to build the container system.
org.apache.openejb.OpenEJBException: org.apache.xbean.recipe.MissingAccessorException: Unable to find a valid setter method: public void org.apache.openejb.core.mdb.MdbContainer.setServerUrl(java.lang.String): Unable to find a valid setter method: public void org.apache.openejb.core.mdb.MdbContainer.setServerUrl(java.lang.String)
at org.apache.openejb.assembler.classic.Assembler.build(Assembler.java:214)
at org.apache.openejb.OpenEJB$Instance.<init>(OpenEJB.java:147)
at org.apache.openejb.OpenEJB.init(OpenEJB.java:280)
at org.apache.openejb.OpenEJB.init(OpenEJB.java:265)
at sun.reflect.NativeMethodAccessorImpl.invoke0(Native Method)
at sun.reflect.NativeMethodAccessorImpl.invoke(NativeMethodAccessorImpl.java:39)
at sun.reflect.DelegatingMethodAccessorImpl.invoke(DelegatingMethodAccessorImpl.java:25)
at java.lang.reflect.Method.invoke(Method.java:585)
at org.apache.openejb.loader.OpenEJBInstance.init(OpenEJBInstance.java:36)
at org.apache.openejb.client.LocalInitialContextFactory.init(LocalInitialContextFactory.java:56)
at org.apache.openejb.client.LocalInitialContextFactory.getInitialContext(LocalInitialContextFactory.java:42)
at javax.naming.spi.NamingManager.getInitialContext(NamingManager.java:667)
at javax.naming.InitialContext.getDefaultInitCtx(InitialContext.java:247)
at javax.naming.InitialContext.init(InitialContext.java:223)
at javax.naming.InitialContext.<init>(InitialContext.java:197)
at org.apache.openejb.test.HsqldbTestDatabase.start(HsqldbTestDatabase.java:180)
at org.apache.openejb.test.TestManager.start(TestManager.java:79)
at org.apache.openejb.iTest.setUp(iTest.java:57)
at org.apache.openejb.test.TestSuite.run(TestSuite.java:41)
at sun.reflect.NativeMethodAccessorImpl.invoke0(Native Method)
at sun.reflect.NativeMethodAccessorImpl.invoke(NativeMethodAccessorImpl.java:39)
at sun.reflect.DelegatingMethodAccessorImpl.invoke(DelegatingMethodAccessorImpl.java:25)
at java.lang.reflect.Method.invoke(Method.java:585)
at org.apache.maven.surefire.junit.JUnitTestSet.execute(JUnitTestSet.java:210)
at org.apache.maven.surefire.suite.AbstractDirectoryTestSuite.executeTestSet(AbstractDirectoryTestSuite.java:135)
at org.apache.maven.surefire.suite.AbstractDirectoryTestSuite.execute(AbstractDirectoryTestSuite.java:160)
at org.apache.maven.surefire.Surefire.run(Surefire.java:81)
at sun.reflect.NativeMethodAccessorImpl.invoke0(Native Method)
at sun.reflect.NativeMethodAccessorImpl.invoke(NativeMethodAccessorImpl.java:39)
at sun.reflect.DelegatingMethodAccessorImpl.invoke(DelegatingMethodAccessorImpl.java:25)
at java.lang.reflect.Method.invoke(Method.java:585)
at org.apache.maven.surefire.booter.SurefireBooter.runSuitesInProcess(SurefireBooter.java:182)
at org.apache.maven.surefire.booter.SurefireBooter.main(SurefireBooter.java:743)
Caused by: org.apache.xbean.recipe.MissingAccessorException: Unable to find a valid setter method: public void org.apache.openejb.core.mdb.MdbContainer.setServerUrl(java.lang.String)
at org.apache.xbean.recipe.ObjectRecipe.findSetter(ObjectRecipe.java:692)
at org.apache.xbean.recipe.ObjectRecipe.setProperty(ObjectRecipe.java:275)
at org.apache.xbean.recipe.ObjectRecipe.setProperties(ObjectRecipe.java:251)
at org.apache.xbean.recipe.ObjectRecipe.create(ObjectRecipe.java:198)
at org.apache.xbean.recipe.AbstractRecipe.create(AbstractRecipe.java:28)
at org.apache.openejb.assembler.classic.Assembler.createContainer(Assembler.java:603)
at org.apache.openejb.assembler.classic.Assembler.buildContainerSystem(Assembler.java:293)
at org.apache.openejb.assembler.classic.Assembler.build(Assembler.java:201)
... 32 more
Tests run: 1, Failures: 0, Errors: 1, Skipped: 0, Time elapsed: 15.374 sec <<< FAILURE!
Running org.apache.openejb.iTest
Tests run: 0, Failures: 0, Errors: 0, Skipped: 0, Time elapsed: 0.034 sec
Running org.apache.openejb.core.stateless.StatelessContainerTest
log4j:WARN No appenders could be found for logger (OpenEJB).
log4j:WARN Please initialize the log4j system properly.
Tests run: 3, Failures: 0, Errors: 0, Skipped: 0, Time elapsed: 0.881 sec
Running org.apache.openejb.core.TemporaryClassLoaderTest
Tests run: 1, Failures: 0, Errors: 0, Skipped: 0, Time elapsed: 0.18 sec
Running org.apache.openejb.core.security.SecurityTest
log4j:WARN No appenders could be found for logger (OpenEJB.startup.config).
log4j:WARN Please initialize the log4j system properly.
Tests run: 1, Failures: 0, Errors: 1, Skipped: 0, Time elapsed: 4.422 sec <<< FAILURE!
Running org.apache.openejb.assembler.classic.OpenEjbConfigurationValidationTest
Tests run: 1, Failures: 0, Errors: 0, Skipped: 0, Time elapsed: 0.212 sec
Results :
Tests run: 67, Failures: 0, Errors: 6, Skipped: 0
[INFO] ------------------------------------------------------------------------
[ERROR] BUILD FAILURE
[INFO] ------------------------------------------------------------------------
[INFO] There are test failures.
[INFO] ------------------------------------------------------------------------
[INFO] For more information, run Maven with the -e switch
[INFO] ------------------------------------------------------------------------
[INFO] Total time: 5 minutes 18 seconds
[INFO] Finished at: Sun Apr 01 14:07:49 PDT 2007
[INFO] Final Memory: 14M/30M
[INFO] ------------------------------------------------------------------------
****************************************************************************