You are viewing a plain text version of this content. The canonical link for it is here.
Posted to builds@beam.apache.org by Apache Jenkins Server <je...@builds.apache.org> on 2023/07/30 16:16:09 UTC

Build failed in Jenkins: beam_PreCommit_Go_Cron #7401

See <https://ci-beam.apache.org/job/beam_PreCommit_Go_Cron/7401/display/redirect>

Changes:


------------------------------------------
Started by timer
Running as SYSTEM
[EnvInject] - Loading node environment variables.
Building remotely on apache-beam-jenkins-7 (beam) in workspace <https://ci-beam.apache.org/job/beam_PreCommit_Go_Cron/ws/>
The recommended git tool is: NONE
No credentials specified
Wiping out workspace first.
Cloning the remote Git repository
Using shallow clone with depth 1
Avoid fetching tags
Cloning repository https://github.com/apache/beam.git
 > git init <https://ci-beam.apache.org/job/beam_PreCommit_Go_Cron/ws/src> # timeout=10
Fetching upstream changes from https://github.com/apache/beam.git
 > git --version # timeout=10
 > git --version # 'git version 2.25.1'
 > git fetch --no-tags --force --progress --depth=1 -- https://github.com/apache/beam.git +refs/heads/*:refs/remotes/origin/* # timeout=10
 > git config remote.origin.url https://github.com/apache/beam.git # timeout=10
 > git config --add remote.origin.fetch +refs/heads/*:refs/remotes/origin/* # timeout=10
 > git config remote.origin.url https://github.com/apache/beam.git # timeout=10
Using shallow fetch with depth 1
Fetching upstream changes from https://github.com/apache/beam.git
 > git fetch --no-tags --force --progress --depth=1 -- https://github.com/apache/beam.git +refs/heads/*:refs/remotes/origin/* +refs/pull/${ghprbPullId}/*:refs/remotes/origin/pr/${ghprbPullId}/* # timeout=10
 > git rev-parse origin/master^{commit} # timeout=10
Checking out Revision af533fe976c05e708d9573f0b6cbeb31bf9dbb3a (origin/master)
 > git config core.sparsecheckout # timeout=10
 > git checkout -f af533fe976c05e708d9573f0b6cbeb31bf9dbb3a # timeout=10
Commit message: "Fix jenkins Go PostCommit runs (#27747)"
 > git rev-list --no-walk af533fe976c05e708d9573f0b6cbeb31bf9dbb3a # timeout=10
No emails were triggered.
[EnvInject] - Executing scripts and injecting environment variables after the SCM step.
[EnvInject] - Injecting as environment variables the properties content 
SETUPTOOLS_USE_DISTUTILS=stdlib
SPARK_LOCAL_IP=127.0.0.1

[EnvInject] - Variables injected successfully.
[Gradle] - Launching build.
[src] $ <https://ci-beam.apache.org/job/beam_PreCommit_Go_Cron/ws/src/gradlew> --continue --max-workers=8 -Dorg.gradle.jvmargs=-Xms2g -Dorg.gradle.jvmargs=-Xmx6g -Dorg.gradle.vfs.watch=false -Pdocker-pull-licenses :goPreCommit
To honour the JVM settings for this build a single-use Daemon process will be forked. See https://docs.gradle.org/7.6.2/userguide/gradle_daemon.html#sec:disabling_the_daemon.
Daemon will be stopped at the end of the build 
Configuration on demand is an incubating feature.
Gradle Enterprise plugins resolution: https://plugins.gradle.org/m2
Enforcing Gradle Enterprise: https://ge.apache.org, allowUntrustedServer: false
> Task :buildSrc:compileJava NO-SOURCE
> Task :buildSrc:compileGroovy FROM-CACHE
> Task :buildSrc:pluginDescriptors
> Task :buildSrc:processResources
> Task :buildSrc:classes
> Task :buildSrc:jar
> Task :buildSrc:assemble
> Task :buildSrc:spotlessGroovy FROM-CACHE
> Task :buildSrc:spotlessGroovyCheck UP-TO-DATE
> Task :buildSrc:spotlessGroovyGradle FROM-CACHE
> Task :buildSrc:spotlessGroovyGradleCheck UP-TO-DATE
> Task :buildSrc:spotlessCheck UP-TO-DATE
> Task :buildSrc:compileTestJava NO-SOURCE
> Task :buildSrc:compileTestGroovy NO-SOURCE
> Task :buildSrc:pluginUnderTestMetadata
> Task :buildSrc:processTestResources NO-SOURCE
> Task :buildSrc:testClasses UP-TO-DATE
> Task :buildSrc:test NO-SOURCE
> Task :buildSrc:validatePlugins FROM-CACHE
> Task :buildSrc:check UP-TO-DATE
> Task :buildSrc:build

> Configure project :sdks:go:container
docker-pull-licenses set, running go-licenses
System Go installation: /snap/bin/go is go version go1.16.15 linux/amd64; Preparing to use /home/jenkins/go/bin/go1.20.6
go1.20.6: already downloaded in /home/jenkins/sdk/go1.20.6
GOCMD=/home/jenkins/go/bin/go1.20.6
System Go installation: /snap/bin/go is go version go1.16.15 linux/amd64; Preparing to use /home/jenkins/go/bin/go1.20.6
go1.20.6: already downloaded in /home/jenkins/sdk/go1.20.6
GOCMD=/home/jenkins/go/bin/go1.20.6
System Go installation: /snap/bin/go is go version go1.16.15 linux/amd64; Preparing to use /home/jenkins/go/bin/go1.20.6
go1.20.6: already downloaded in /home/jenkins/sdk/go1.20.6
GOCMD=/home/jenkins/go/bin/go1.20.6
System Go installation: /snap/bin/go is go version go1.16.15 linux/amd64; Preparing to use /home/jenkins/go/bin/go1.20.6
go1.20.6: already downloaded in /home/jenkins/sdk/go1.20.6
GOCMD=/home/jenkins/go/bin/go1.20.6
System Go installation: /snap/bin/go is go version go1.16.15 linux/amd64; Preparing to use /home/jenkins/go/bin/go1.20.6
go1.20.6: already downloaded in /home/jenkins/sdk/go1.20.6
GOCMD=/home/jenkins/go/bin/go1.20.6
System Go installation: /snap/bin/go is go version go1.16.15 linux/amd64; Preparing to use /home/jenkins/go/bin/go1.20.6
go1.20.6: already downloaded in /home/jenkins/sdk/go1.20.6
GOCMD=/home/jenkins/go/bin/go1.20.6

> Task :sdks:go:test:goPrepare UP-TO-DATE
> Task :sdks:go:container:goPrepare UP-TO-DATE
> Task :sdks:python:container:goPrepare UP-TO-DATE
> Task :sdks:go:goPrepare UP-TO-DATE
> Task :sdks:java:container:goPrepare UP-TO-DATE
> Task :sdks:go:examples:goPrepare UP-TO-DATE

> Task :sdks:go:test:goBuild
/home/jenkins/go/bin/go1.20.6 build -o ./build/bin/linux_amd64/ ./...

> Task :sdks:python:container:goBuild
/home/jenkins/go/bin/go1.20.6 build -o ./build/target/launcher/linux_amd64/boot boot.go piputil.go

> Task :sdks:go:container:goBuild
/home/jenkins/go/bin/go1.20.6 build -o ./build/target/linux_amd64/boot boot.go boot_test.go

> Task :sdks:java:container:goBuild
/home/jenkins/go/bin/go1.20.6 build -o ./build/target/linux_amd64/boot boot.go boot_test.go pathingjar.go pathingjar_test.go

> Task :sdks:go:goBuild
/home/jenkins/go/bin/go1.20.6 build -o ./build/bin/linux_amd64/ ./...
# github.com/apache/beam/sdks/v2/go/examples/complete/autocomplete
/home/jenkins/sdk/go1.20.6/pkg/tool/linux_amd64/link: mapping output file failed: no space left on device
# github.com/apache/beam/sdks/v2/go/examples/minimal_wordcount
/home/jenkins/sdk/go1.20.6/pkg/tool/linux_amd64/link: mapping output file failed: no space left on device
# github.com/apache/beam/sdks/v2/go/examples/cookbook/tornadoes
/home/jenkins/sdk/go1.20.6/pkg/tool/linux_amd64/link: mapping output file failed: no space left on device

> Task :sdks:go:examples:goBuild
/home/jenkins/go/bin/go1.20.6 build -o ./build/bin/linux_amd64/ ./...
# github.com/apache/beam/sdks/v2/go/examples/complete/autocomplete
/home/jenkins/sdk/go1.20.6/pkg/tool/linux_amd64/link: mapping output file failed: no space left on device
# github.com/apache/beam/sdks/v2/go/examples/multiout
/home/jenkins/sdk/go1.20.6/pkg/tool/linux_amd64/link: mapping output file failed: no space left on device

> Task :sdks:go:test:goBuild
# github.com/apache/beam/sdks/v2/go/test/load/group_by_key
/home/jenkins/sdk/go1.20.6/pkg/tool/linux_amd64/link: mapping output file failed: no space left on device
# github.com/apache/beam/sdks/v2/go/test/load/cogbk
/home/jenkins/sdk/go1.20.6/pkg/tool/linux_amd64/link: mapping output file failed: no space left on device
# github.com/apache/beam/sdks/v2/go/test/load/pardo
/home/jenkins/sdk/go1.20.6/pkg/tool/linux_amd64/link: mapping output file failed: no space left on device
# github.com/apache/beam/sdks/v2/go/test/load/sideinput
/home/jenkins/sdk/go1.20.6/pkg/tool/linux_amd64/link: mapping output file failed: no space left on device

> Task :sdks:go:test:goBuild FAILED

> Task :sdks:go:goBuild
# github.com/apache/beam/sdks/v2/go/examples/kafka
/home/jenkins/sdk/go1.20.6/pkg/tool/linux_amd64/link: mapping output file failed: no space left on device

> Task :sdks:go:examples:goBuild FAILED
> Task :sdks:go:goBuild FAILED

FAILURE: Build completed with 3 failures.

1: Task failed with an exception.
-----------
* What went wrong:
Execution failed for task ':sdks:go:test:goBuild'.
> Process 'command 'sh'' finished with non-zero exit value 1

* Try:
> Run with --stacktrace option to get the stack trace.
> Run with --info or --debug option to get more log output.
==============================================================================

2: Task failed with an exception.
-----------
* What went wrong:
Execution failed for task ':sdks:go:examples:goBuild'.
> Process 'command 'sh'' finished with non-zero exit value 1

* Try:
> Run with --stacktrace option to get the stack trace.
> Run with --info or --debug option to get more log output.
==============================================================================

3: Task failed with an exception.
-----------
* What went wrong:
Execution failed for task ':sdks:go:goBuild'.
> Process 'command 'sh'' finished with non-zero exit value 1

* Try:
> Run with --stacktrace option to get the stack trace.
> Run with --info or --debug option to get more log output.
==============================================================================

* Get more help at https://help.gradle.org

Deprecated Gradle features were used in this build, making it incompatible with Gradle 8.0.

You can use '--warning-mode all' to show the individual deprecation warnings and determine if they come from your own scripts or plugins.

See https://docs.gradle.org/7.6.2/userguide/command_line_interface.html#sec:command_line_warnings

BUILD FAILED in 1m 37s
16 actionable tasks: 10 executed, 4 from cache, 2 up-to-date

Publishing build scan...
https://ge.apache.org/s/tkr52ntvrhjhe

Build step 'Invoke Gradle script' changed build result to FAILURE
Build step 'Invoke Gradle script' marked build as failure

---------------------------------------------------------------------
To unsubscribe, e-mail: builds-unsubscribe@beam.apache.org
For additional commands, e-mail: builds-help@beam.apache.org


Jenkins build is back to normal : beam_PreCommit_Go_Cron #7402

Posted by Apache Jenkins Server <je...@builds.apache.org>.
See <https://ci-beam.apache.org/job/beam_PreCommit_Go_Cron/7402/display/redirect>


---------------------------------------------------------------------
To unsubscribe, e-mail: builds-unsubscribe@beam.apache.org
For additional commands, e-mail: builds-help@beam.apache.org