You are viewing a plain text version of this content. The canonical link for it is here.
Posted to dev@kafka.apache.org by Apache Jenkins Server <je...@builds.apache.org> on 2020/06/15 19:56:56 UTC

Build failed in Jenkins: kafka-trunk-jdk11 #1569

See <https://builds.apache.org/job/kafka-trunk-jdk11/1569/display/redirect?page=changes>

Changes:

[github] MINOR: Avoid WARN log message when re-init from checkpoint skipped

[github] MINOR: Fix log message for transition from standby to active (#8872)


------------------------------------------
[...truncated 2.24 MB...]
org.apache.kafka.streams.TopologyTestDriverTest > shouldReturnAllStores[Eos enabled = false] STARTED

org.apache.kafka.streams.TopologyTestDriverTest > shouldReturnAllStores[Eos enabled = false] PASSED

org.apache.kafka.streams.TopologyTestDriverTest > shouldNotCreateStateDirectoryForStatelessTopology[Eos enabled = false] STARTED

org.apache.kafka.streams.TopologyTestDriverTest > shouldNotCreateStateDirectoryForStatelessTopology[Eos enabled = false] PASSED

org.apache.kafka.streams.TopologyTestDriverTest > shouldApplyGlobalUpdatesCorrectlyInRecursiveTopologies[Eos enabled = false] STARTED

org.apache.kafka.streams.TopologyTestDriverTest > shouldApplyGlobalUpdatesCorrectlyInRecursiveTopologies[Eos enabled = false] PASSED

org.apache.kafka.streams.TopologyTestDriverTest > shouldReturnAllStoresNames[Eos enabled = false] STARTED

org.apache.kafka.streams.TopologyTestDriverTest > shouldReturnAllStoresNames[Eos enabled = false] PASSED

org.apache.kafka.streams.TopologyTestDriverTest > shouldPassRecordHeadersIntoSerializersAndDeserializers[Eos enabled = false] STARTED

org.apache.kafka.streams.TopologyTestDriverTest > shouldPassRecordHeadersIntoSerializersAndDeserializers[Eos enabled = false] PASSED

org.apache.kafka.streams.TopologyTestDriverTest > shouldProcessConsumerRecordList[Eos enabled = false] STARTED

org.apache.kafka.streams.TopologyTestDriverTest > shouldProcessConsumerRecordList[Eos enabled = false] PASSED

org.apache.kafka.streams.TopologyTestDriverTest > shouldUseSinkSpecificSerializers[Eos enabled = false] STARTED

org.apache.kafka.streams.TopologyTestDriverTest > shouldUseSinkSpecificSerializers[Eos enabled = false] PASSED

org.apache.kafka.streams.TopologyTestDriverTest > shouldFlushStoreForFirstInput[Eos enabled = false] STARTED

org.apache.kafka.streams.TopologyTestDriverTest > shouldFlushStoreForFirstInput[Eos enabled = false] PASSED

org.apache.kafka.streams.TopologyTestDriverTest > shouldProcessFromSourceThatMatchPattern[Eos enabled = false] STARTED

org.apache.kafka.streams.TopologyTestDriverTest > shouldProcessFromSourceThatMatchPattern[Eos enabled = false] PASSED

org.apache.kafka.streams.TopologyTestDriverTest > shouldCaptureSinkTopicNamesIfWrittenInto[Eos enabled = false] STARTED

org.apache.kafka.streams.TopologyTestDriverTest > shouldCaptureSinkTopicNamesIfWrittenInto[Eos enabled = false] PASSED

org.apache.kafka.streams.TopologyTestDriverTest > shouldUpdateStoreForNewKey[Eos enabled = false] STARTED

org.apache.kafka.streams.TopologyTestDriverTest > shouldUpdateStoreForNewKey[Eos enabled = false] PASSED

org.apache.kafka.streams.TopologyTestDriverTest > shouldSendRecordViaCorrectSourceTopicDeprecated[Eos enabled = false] STARTED

org.apache.kafka.streams.TopologyTestDriverTest > shouldSendRecordViaCorrectSourceTopicDeprecated[Eos enabled = false] PASSED

org.apache.kafka.streams.TopologyTestDriverTest > shouldPunctuateOnWallClockTime[Eos enabled = false] STARTED

org.apache.kafka.streams.TopologyTestDriverTest > shouldPunctuateOnWallClockTime[Eos enabled = false] PASSED

org.apache.kafka.streams.TopologyTestDriverTest > shouldSetRecordMetadata[Eos enabled = false] STARTED

org.apache.kafka.streams.TopologyTestDriverTest > shouldSetRecordMetadata[Eos enabled = false] PASSED

org.apache.kafka.streams.TopologyTestDriverTest > shouldNotUpdateStoreForLargerValue[Eos enabled = false] STARTED

org.apache.kafka.streams.TopologyTestDriverTest > shouldNotUpdateStoreForLargerValue[Eos enabled = false] PASSED

org.apache.kafka.streams.TopologyTestDriverTest > shouldReturnCorrectInMemoryStoreTypeOnly[Eos enabled = false] STARTED

org.apache.kafka.streams.TopologyTestDriverTest > shouldReturnCorrectInMemoryStoreTypeOnly[Eos enabled = false] PASSED

org.apache.kafka.streams.TopologyTestDriverTest > shouldThrowForMissingTime[Eos enabled = false] STARTED

org.apache.kafka.streams.TopologyTestDriverTest > shouldThrowForMissingTime[Eos enabled = false] PASSED

org.apache.kafka.streams.TopologyTestDriverTest > shouldCaptureInternalTopicNamesIfWrittenInto[Eos enabled = false] STARTED

org.apache.kafka.streams.TopologyTestDriverTest > shouldCaptureInternalTopicNamesIfWrittenInto[Eos enabled = false] PASSED

org.apache.kafka.streams.TopologyTestDriverTest > shouldPunctuateOnWallClockTimeDeprecated[Eos enabled = false] STARTED

org.apache.kafka.streams.TopologyTestDriverTest > shouldPunctuateOnWallClockTimeDeprecated[Eos enabled = false] PASSED

org.apache.kafka.streams.TopologyTestDriverTest > shouldProcessRecordForTopic[Eos enabled = false] STARTED

org.apache.kafka.streams.TopologyTestDriverTest > shouldProcessRecordForTopic[Eos enabled = false] PASSED

org.apache.kafka.streams.TopologyTestDriverTest > shouldForwardRecordsFromSubtopologyToSubtopology[Eos enabled = false] STARTED

org.apache.kafka.streams.TopologyTestDriverTest > shouldForwardRecordsFromSubtopologyToSubtopology[Eos enabled = false] PASSED

org.apache.kafka.streams.TopologyTestDriverTest > shouldNotUpdateStoreForSmallerValue[Eos enabled = false] STARTED

org.apache.kafka.streams.TopologyTestDriverTest > shouldNotUpdateStoreForSmallerValue[Eos enabled = false] PASSED

org.apache.kafka.streams.TopologyTestDriverTest > shouldCreateStateDirectoryForStatefulTopology[Eos enabled = false] STARTED

org.apache.kafka.streams.TopologyTestDriverTest > shouldCreateStateDirectoryForStatefulTopology[Eos enabled = false] PASSED

org.apache.kafka.streams.TopologyTestDriverTest > shouldPunctuateIfWallClockTimeAdvances[Eos enabled = false] STARTED

org.apache.kafka.streams.TopologyTestDriverTest > shouldPunctuateIfWallClockTimeAdvances[Eos enabled = false] PASSED

> Task :streams:upgrade-system-tests-0101:spotbugsMain NO-SOURCE
> Task :streams:upgrade-system-tests-0101:test
> Task :streams:upgrade-system-tests-0102:compileJava NO-SOURCE
> Task :streams:upgrade-system-tests-0102:processResources NO-SOURCE
> Task :streams:upgrade-system-tests-0102:classes UP-TO-DATE
> Task :streams:upgrade-system-tests-0102:checkstyleMain NO-SOURCE
> Task :streams:upgrade-system-tests-0102:compileTestJava
> Task :streams:upgrade-system-tests-0102:processTestResources NO-SOURCE
> Task :streams:upgrade-system-tests-0102:testClasses
> Task :streams:upgrade-system-tests-0102:checkstyleTest
> Task :streams:upgrade-system-tests-0102:spotbugsMain NO-SOURCE
> Task :streams:upgrade-system-tests-0102:test
> Task :streams:upgrade-system-tests-0110:compileJava NO-SOURCE
> Task :streams:upgrade-system-tests-0110:processResources NO-SOURCE
> Task :streams:upgrade-system-tests-0110:classes UP-TO-DATE
> Task :streams:upgrade-system-tests-0110:checkstyleMain NO-SOURCE
> Task :streams:upgrade-system-tests-0110:compileTestJava
> Task :streams:upgrade-system-tests-0110:processTestResources NO-SOURCE
> Task :streams:upgrade-system-tests-0110:testClasses
> Task :streams:upgrade-system-tests-0110:checkstyleTest
> Task :streams:upgrade-system-tests-0110:spotbugsMain NO-SOURCE
> Task :streams:upgrade-system-tests-0110:test
> Task :streams:upgrade-system-tests-10:compileJava NO-SOURCE
> Task :streams:upgrade-system-tests-10:processResources NO-SOURCE
> Task :streams:upgrade-system-tests-10:classes UP-TO-DATE
> Task :streams:upgrade-system-tests-10:checkstyleMain NO-SOURCE
> Task :streams:upgrade-system-tests-10:compileTestJava
> Task :streams:upgrade-system-tests-10:processTestResources NO-SOURCE
> Task :streams:upgrade-system-tests-10:testClasses
> Task :streams:upgrade-system-tests-10:checkstyleTest
> Task :streams:upgrade-system-tests-10:spotbugsMain NO-SOURCE
> Task :streams:upgrade-system-tests-10:test
> Task :streams:upgrade-system-tests-11:compileJava NO-SOURCE
> Task :streams:upgrade-system-tests-11:processResources NO-SOURCE
> Task :streams:upgrade-system-tests-11:classes UP-TO-DATE
> Task :streams:upgrade-system-tests-11:checkstyleMain NO-SOURCE
> Task :streams:upgrade-system-tests-11:compileTestJava
> Task :streams:upgrade-system-tests-11:processTestResources NO-SOURCE
> Task :streams:upgrade-system-tests-11:testClasses
> Task :streams:upgrade-system-tests-11:checkstyleTest
> Task :streams:upgrade-system-tests-11:spotbugsMain NO-SOURCE
> Task :streams:upgrade-system-tests-11:test
> Task :streams:upgrade-system-tests-20:compileJava NO-SOURCE
> Task :streams:upgrade-system-tests-20:processResources NO-SOURCE
> Task :streams:upgrade-system-tests-20:classes UP-TO-DATE
> Task :streams:upgrade-system-tests-20:checkstyleMain NO-SOURCE
> Task :streams:upgrade-system-tests-20:compileTestJava
> Task :streams:upgrade-system-tests-20:processTestResources NO-SOURCE
> Task :streams:upgrade-system-tests-20:testClasses
> Task :streams:upgrade-system-tests-20:checkstyleTest
> Task :streams:upgrade-system-tests-20:spotbugsMain NO-SOURCE
> Task :streams:upgrade-system-tests-20:test
> Task :streams:upgrade-system-tests-21:compileJava NO-SOURCE
> Task :streams:upgrade-system-tests-21:processResources NO-SOURCE
> Task :streams:upgrade-system-tests-21:classes UP-TO-DATE
> Task :streams:upgrade-system-tests-21:checkstyleMain NO-SOURCE
> Task :streams:upgrade-system-tests-21:compileTestJava
> Task :streams:upgrade-system-tests-21:processTestResources NO-SOURCE
> Task :streams:upgrade-system-tests-21:testClasses
> Task :streams:upgrade-system-tests-21:checkstyleTest
> Task :streams:upgrade-system-tests-21:spotbugsMain NO-SOURCE
> Task :streams:upgrade-system-tests-21:test
> Task :streams:upgrade-system-tests-22:compileJava NO-SOURCE
> Task :streams:upgrade-system-tests-22:processResources NO-SOURCE
> Task :streams:upgrade-system-tests-22:classes UP-TO-DATE
> Task :streams:upgrade-system-tests-22:checkstyleMain NO-SOURCE
> Task :streams:upgrade-system-tests-22:compileTestJava
> Task :streams:upgrade-system-tests-22:processTestResources NO-SOURCE
> Task :streams:upgrade-system-tests-22:testClasses
> Task :streams:upgrade-system-tests-22:checkstyleTest
> Task :streams:upgrade-system-tests-22:spotbugsMain NO-SOURCE
> Task :streams:upgrade-system-tests-22:test
> Task :streams:upgrade-system-tests-23:compileJava NO-SOURCE
> Task :streams:upgrade-system-tests-23:processResources NO-SOURCE
> Task :streams:upgrade-system-tests-23:classes UP-TO-DATE
> Task :streams:upgrade-system-tests-23:checkstyleMain NO-SOURCE
> Task :streams:upgrade-system-tests-23:compileTestJava
> Task :streams:upgrade-system-tests-23:processTestResources NO-SOURCE
> Task :streams:upgrade-system-tests-23:testClasses
> Task :streams:upgrade-system-tests-23:checkstyleTest
> Task :streams:upgrade-system-tests-23:spotbugsMain NO-SOURCE
> Task :streams:upgrade-system-tests-23:test
> Task :streams:upgrade-system-tests-24:compileJava NO-SOURCE
> Task :streams:upgrade-system-tests-24:processResources NO-SOURCE
> Task :streams:upgrade-system-tests-24:classes UP-TO-DATE
> Task :streams:upgrade-system-tests-24:checkstyleMain NO-SOURCE
> Task :streams:upgrade-system-tests-24:compileTestJava
> Task :streams:upgrade-system-tests-24:processTestResources NO-SOURCE
> Task :streams:upgrade-system-tests-24:testClasses
> Task :streams:upgrade-system-tests-24:checkstyleTest
> Task :streams:upgrade-system-tests-24:spotbugsMain NO-SOURCE
> Task :streams:upgrade-system-tests-24:test
> Task :streams:upgrade-system-tests-25:compileJava NO-SOURCE
> Task :streams:upgrade-system-tests-25:processResources NO-SOURCE
> Task :streams:upgrade-system-tests-25:classes UP-TO-DATE
> Task :streams:upgrade-system-tests-25:checkstyleMain NO-SOURCE
> Task :streams:upgrade-system-tests-25:compileTestJava
> Task :streams:upgrade-system-tests-25:processTestResources NO-SOURCE
> Task :streams:upgrade-system-tests-25:testClasses
> Task :streams:upgrade-system-tests-25:checkstyleTest
> Task :streams:upgrade-system-tests-25:spotbugsMain NO-SOURCE
> Task :streams:upgrade-system-tests-25:test

FAILURE: Build completed with 3 failures.

1: Task failed with an exception.
-----------
* What went wrong:
Execution failed for task ':streams:checkstyleMain'.
> Checkstyle rule violations were found. See the report at: file://<https://builds.apache.org/job/kafka-trunk-jdk11/ws/streams/build/reports/checkstyle/main.html>
  Checkstyle files with violations: 1
  Checkstyle violations by severity: [error:1]


* Try:
Run with --stacktrace option to get the stack trace. Run with --info or --debug option to get more log output. Run with --scan to get full insights.
==============================================================================

2: Task failed with an exception.
-----------
* What went wrong:
Execution failed for task ':core:test'.
> There were failing tests. See the report at: file://<https://builds.apache.org/job/kafka-trunk-jdk11/ws/core/build/reports/tests/test/index.html>

* Try:
Run with --stacktrace option to get the stack trace. Run with --info or --debug option to get more log output. Run with --scan to get full insights.
==============================================================================

3: Task failed with an exception.
-----------
* What went wrong:
Execution failed for task ':connect:mirror:test'.
> There were failing tests. See the report at: file://<https://builds.apache.org/job/kafka-trunk-jdk11/ws/connect/mirror/build/reports/tests/test/index.html>

* Try:
Run with --stacktrace option to get the stack trace. Run with --info or --debug option to get more log output. Run with --scan to get full insights.
==============================================================================

* Get more help at https://help.gradle.org

Deprecated Gradle features were used in this build, making it incompatible with Gradle 7.0.
Use '--warning-mode all' to show the individual deprecation warnings.
See https://docs.gradle.org/6.5/userguide/command_line_interface.html#sec:command_line_warnings

BUILD FAILED in 1h 30m 12s
214 actionable tasks: 182 executed, 32 up-to-date
Build step 'Execute shell' marked build as failure
Recording test results
ERROR: No tool found matching GRADLE_4_10_2_HOME
Setting GRADLE_4_10_3_HOME=/home/jenkins/tools/gradle/4.10.3
ERROR: No tool found matching GRADLE_4_10_2_HOME
Setting GRADLE_4_10_3_HOME=/home/jenkins/tools/gradle/4.10.3
Not sending mail to unregistered user noreply@github.com

Jenkins build is back to normal : kafka-trunk-jdk11 #1587

Posted by Apache Jenkins Server <je...@builds.apache.org>.
See <https://builds.apache.org/job/kafka-trunk-jdk11/1587/display/redirect?page=changes>


Build failed in Jenkins: kafka-trunk-jdk11 #1586

Posted by Apache Jenkins Server <je...@builds.apache.org>.
See <https://builds.apache.org/job/kafka-trunk-jdk11/1586/display/redirect?page=changes>

Changes:

[github] KAFKA-10185: Restoration info logging (#8896)

[github] KAFKA-10138: Prefer --bootstrap-server for reassign_partitions command


------------------------------------------
[...truncated 3.18 MB...]
org.apache.kafka.streams.TopologyTestDriverTest > shouldCaptureInternalTopicNamesIfWrittenInto[Eos enabled = false] STARTED

org.apache.kafka.streams.TopologyTestDriverTest > shouldCaptureInternalTopicNamesIfWrittenInto[Eos enabled = false] PASSED

org.apache.kafka.streams.TopologyTestDriverTest > shouldPunctuateOnWallClockTimeDeprecated[Eos enabled = false] STARTED

org.apache.kafka.streams.TopologyTestDriverTest > shouldPunctuateOnWallClockTimeDeprecated[Eos enabled = false] PASSED

org.apache.kafka.streams.TopologyTestDriverTest > shouldProcessRecordForTopic[Eos enabled = false] STARTED

org.apache.kafka.streams.TopologyTestDriverTest > shouldProcessRecordForTopic[Eos enabled = false] PASSED

org.apache.kafka.streams.TopologyTestDriverTest > shouldForwardRecordsFromSubtopologyToSubtopology[Eos enabled = false] STARTED

org.apache.kafka.streams.TopologyTestDriverTest > shouldForwardRecordsFromSubtopologyToSubtopology[Eos enabled = false] PASSED

org.apache.kafka.streams.TopologyTestDriverTest > shouldNotUpdateStoreForSmallerValue[Eos enabled = false] STARTED

org.apache.kafka.streams.TopologyTestDriverTest > shouldNotUpdateStoreForSmallerValue[Eos enabled = false] PASSED

org.apache.kafka.streams.TopologyTestDriverTest > shouldCreateStateDirectoryForStatefulTopology[Eos enabled = false] STARTED

org.apache.kafka.streams.TopologyTestDriverTest > shouldCreateStateDirectoryForStatefulTopology[Eos enabled = false] PASSED

org.apache.kafka.streams.TopologyTestDriverTest > shouldPunctuateIfWallClockTimeAdvances[Eos enabled = false] STARTED

org.apache.kafka.streams.TopologyTestDriverTest > shouldPunctuateIfWallClockTimeAdvances[Eos enabled = false] PASSED

org.apache.kafka.streams.internals.WindowStoreFacadeTest > shouldReturnIsOpen STARTED

org.apache.kafka.streams.internals.WindowStoreFacadeTest > shouldReturnIsOpen PASSED

org.apache.kafka.streams.internals.WindowStoreFacadeTest > shouldReturnName STARTED

org.apache.kafka.streams.internals.WindowStoreFacadeTest > shouldReturnName PASSED

org.apache.kafka.streams.internals.WindowStoreFacadeTest > shouldPutWithUnknownTimestamp STARTED

org.apache.kafka.streams.internals.WindowStoreFacadeTest > shouldPutWithUnknownTimestamp PASSED

org.apache.kafka.streams.internals.WindowStoreFacadeTest > shouldPutWindowStartTimestampWithUnknownTimestamp STARTED

org.apache.kafka.streams.internals.WindowStoreFacadeTest > shouldPutWindowStartTimestampWithUnknownTimestamp PASSED

org.apache.kafka.streams.internals.WindowStoreFacadeTest > shouldReturnIsPersistent STARTED

org.apache.kafka.streams.internals.WindowStoreFacadeTest > shouldReturnIsPersistent PASSED

org.apache.kafka.streams.internals.WindowStoreFacadeTest > shouldForwardClose STARTED

org.apache.kafka.streams.internals.WindowStoreFacadeTest > shouldForwardClose PASSED

org.apache.kafka.streams.internals.WindowStoreFacadeTest > shouldForwardFlush STARTED

org.apache.kafka.streams.internals.WindowStoreFacadeTest > shouldForwardFlush PASSED

org.apache.kafka.streams.internals.WindowStoreFacadeTest > shouldForwardInit STARTED

org.apache.kafka.streams.internals.WindowStoreFacadeTest > shouldForwardInit PASSED

org.apache.kafka.streams.TestTopicsTest > testNonUsedOutputTopic STARTED

org.apache.kafka.streams.TestTopicsTest > testNonUsedOutputTopic PASSED

org.apache.kafka.streams.TestTopicsTest > testEmptyTopic STARTED

org.apache.kafka.streams.TestTopicsTest > testEmptyTopic PASSED

org.apache.kafka.streams.TestTopicsTest > testStartTimestamp STARTED

org.apache.kafka.streams.TestTopicsTest > testStartTimestamp PASSED

org.apache.kafka.streams.TestTopicsTest > testNegativeAdvance STARTED

org.apache.kafka.streams.TestTopicsTest > testNegativeAdvance PASSED

org.apache.kafka.streams.TestTopicsTest > shouldNotAllowToCreateWithNullDriver STARTED

org.apache.kafka.streams.TestTopicsTest > shouldNotAllowToCreateWithNullDriver PASSED

org.apache.kafka.streams.TestTopicsTest > testDuration STARTED

org.apache.kafka.streams.TestTopicsTest > testDuration PASSED

org.apache.kafka.streams.TestTopicsTest > testOutputToString STARTED

org.apache.kafka.streams.TestTopicsTest > testOutputToString PASSED

org.apache.kafka.streams.TestTopicsTest > testValue STARTED

org.apache.kafka.streams.TestTopicsTest > testValue PASSED

org.apache.kafka.streams.TestTopicsTest > testTimestampAutoAdvance STARTED

org.apache.kafka.streams.TestTopicsTest > testTimestampAutoAdvance PASSED

org.apache.kafka.streams.TestTopicsTest > testOutputWrongSerde STARTED

org.apache.kafka.streams.TestTopicsTest > testOutputWrongSerde PASSED

org.apache.kafka.streams.TestTopicsTest > shouldNotAllowToCreateOutputTopicWithNullTopicName STARTED

org.apache.kafka.streams.TestTopicsTest > shouldNotAllowToCreateOutputTopicWithNullTopicName PASSED

org.apache.kafka.streams.TestTopicsTest > testWrongSerde STARTED

org.apache.kafka.streams.TestTopicsTest > testWrongSerde PASSED

org.apache.kafka.streams.TestTopicsTest > testKeyValuesToMapWithNull STARTED

org.apache.kafka.streams.TestTopicsTest > testKeyValuesToMapWithNull PASSED

org.apache.kafka.streams.TestTopicsTest > testNonExistingOutputTopic STARTED

org.apache.kafka.streams.TestTopicsTest > testNonExistingOutputTopic PASSED

org.apache.kafka.streams.TestTopicsTest > testMultipleTopics STARTED

org.apache.kafka.streams.TestTopicsTest > testMultipleTopics PASSED

org.apache.kafka.streams.TestTopicsTest > testKeyValueList STARTED

org.apache.kafka.streams.TestTopicsTest > testKeyValueList PASSED

org.apache.kafka.streams.TestTopicsTest > shouldNotAllowToCreateOutputWithNullDriver STARTED

org.apache.kafka.streams.TestTopicsTest > shouldNotAllowToCreateOutputWithNullDriver PASSED

org.apache.kafka.streams.TestTopicsTest > testValueList STARTED

org.apache.kafka.streams.TestTopicsTest > testValueList PASSED

org.apache.kafka.streams.TestTopicsTest > testRecordList STARTED

org.apache.kafka.streams.TestTopicsTest > testRecordList PASSED

org.apache.kafka.streams.TestTopicsTest > testNonExistingInputTopic STARTED

org.apache.kafka.streams.TestTopicsTest > testNonExistingInputTopic PASSED

org.apache.kafka.streams.TestTopicsTest > testKeyValuesToMap STARTED

org.apache.kafka.streams.TestTopicsTest > testKeyValuesToMap PASSED

org.apache.kafka.streams.TestTopicsTest > testRecordsToList STARTED

org.apache.kafka.streams.TestTopicsTest > testRecordsToList PASSED

org.apache.kafka.streams.TestTopicsTest > testKeyValueListDuration STARTED

org.apache.kafka.streams.TestTopicsTest > testKeyValueListDuration PASSED

org.apache.kafka.streams.TestTopicsTest > testInputToString STARTED

org.apache.kafka.streams.TestTopicsTest > testInputToString PASSED

org.apache.kafka.streams.TestTopicsTest > testTimestamp STARTED

org.apache.kafka.streams.TestTopicsTest > testTimestamp PASSED

org.apache.kafka.streams.TestTopicsTest > testWithHeaders STARTED

org.apache.kafka.streams.TestTopicsTest > testWithHeaders PASSED

org.apache.kafka.streams.TestTopicsTest > testKeyValue STARTED

org.apache.kafka.streams.TestTopicsTest > testKeyValue PASSED

org.apache.kafka.streams.TestTopicsTest > shouldNotAllowToCreateTopicWithNullTopicName STARTED

org.apache.kafka.streams.TestTopicsTest > shouldNotAllowToCreateTopicWithNullTopicName PASSED

> Task :streams:upgrade-system-tests-20:spotbugsMain NO-SOURCE
> Task :streams:upgrade-system-tests-20:test
> Task :streams:upgrade-system-tests-21:compileJava NO-SOURCE
> Task :streams:upgrade-system-tests-21:processResources NO-SOURCE
> Task :streams:upgrade-system-tests-21:classes UP-TO-DATE
> Task :streams:upgrade-system-tests-21:checkstyleMain NO-SOURCE
> Task :streams:upgrade-system-tests-21:compileTestJava
> Task :streams:upgrade-system-tests-21:processTestResources NO-SOURCE
> Task :streams:upgrade-system-tests-21:testClasses
> Task :streams:upgrade-system-tests-21:checkstyleTest
> Task :streams:upgrade-system-tests-21:spotbugsMain NO-SOURCE
> Task :streams:upgrade-system-tests-21:test
> Task :streams:upgrade-system-tests-22:compileJava NO-SOURCE
> Task :streams:upgrade-system-tests-22:processResources NO-SOURCE
> Task :streams:upgrade-system-tests-22:classes UP-TO-DATE
> Task :streams:upgrade-system-tests-22:checkstyleMain NO-SOURCE
> Task :streams:upgrade-system-tests-22:compileTestJava
> Task :streams:upgrade-system-tests-22:processTestResources NO-SOURCE
> Task :streams:upgrade-system-tests-22:testClasses
> Task :streams:upgrade-system-tests-22:checkstyleTest
> Task :streams:upgrade-system-tests-22:spotbugsMain NO-SOURCE
> Task :streams:upgrade-system-tests-22:test
> Task :streams:upgrade-system-tests-23:compileJava NO-SOURCE
> Task :streams:upgrade-system-tests-23:processResources NO-SOURCE
> Task :streams:upgrade-system-tests-23:classes UP-TO-DATE
> Task :streams:upgrade-system-tests-23:checkstyleMain NO-SOURCE
> Task :streams:upgrade-system-tests-23:compileTestJava
> Task :streams:upgrade-system-tests-23:processTestResources NO-SOURCE
> Task :streams:upgrade-system-tests-23:testClasses
> Task :streams:upgrade-system-tests-23:checkstyleTest
> Task :streams:upgrade-system-tests-23:spotbugsMain NO-SOURCE
> Task :streams:upgrade-system-tests-23:test
> Task :streams:upgrade-system-tests-24:compileJava NO-SOURCE
> Task :streams:upgrade-system-tests-24:processResources NO-SOURCE
> Task :streams:upgrade-system-tests-24:classes UP-TO-DATE
> Task :streams:upgrade-system-tests-24:checkstyleMain NO-SOURCE
> Task :streams:upgrade-system-tests-24:compileTestJava
> Task :streams:upgrade-system-tests-24:processTestResources NO-SOURCE
> Task :streams:upgrade-system-tests-24:testClasses
> Task :streams:upgrade-system-tests-24:checkstyleTest
> Task :streams:upgrade-system-tests-24:spotbugsMain NO-SOURCE
> Task :streams:upgrade-system-tests-24:test
> Task :streams:upgrade-system-tests-25:compileJava NO-SOURCE
> Task :streams:upgrade-system-tests-25:processResources NO-SOURCE
> Task :streams:upgrade-system-tests-25:classes UP-TO-DATE
> Task :streams:upgrade-system-tests-25:checkstyleMain NO-SOURCE
> Task :streams:upgrade-system-tests-25:compileTestJava
> Task :streams:upgrade-system-tests-25:processTestResources NO-SOURCE
> Task :streams:upgrade-system-tests-25:testClasses
> Task :streams:upgrade-system-tests-25:checkstyleTest
> Task :streams:upgrade-system-tests-25:spotbugsMain NO-SOURCE
> Task :streams:upgrade-system-tests-25:test

FAILURE: Build failed with an exception.

* What went wrong:
Execution failed for task ':connect:mirror:test'.
> There were failing tests. See the report at: file://<https://builds.apache.org/job/kafka-trunk-jdk11/ws/connect/mirror/build/reports/tests/test/index.html>

* Try:
Run with --stacktrace option to get the stack trace. Run with --info or --debug option to get more log output. Run with --scan to get full insights.

* Get more help at https://help.gradle.org

Deprecated Gradle features were used in this build, making it incompatible with Gradle 7.0.
Use '--warning-mode all' to show the individual deprecation warnings.
See https://docs.gradle.org/6.5/userguide/command_line_interface.html#sec:command_line_warnings

BUILD FAILED in 1h 55m 48s
215 actionable tasks: 183 executed, 32 up-to-date
Build step 'Execute shell' marked build as failure
Recording test results
ERROR: No tool found matching GRADLE_4_10_2_HOME
Setting GRADLE_4_10_3_HOME=/home/jenkins/tools/gradle/4.10.3
ERROR: No tool found matching GRADLE_4_10_2_HOME
Setting GRADLE_4_10_3_HOME=/home/jenkins/tools/gradle/4.10.3
Not sending mail to unregistered user noreply@github.com

Build failed in Jenkins: kafka-trunk-jdk11 #1585

Posted by Apache Jenkins Server <je...@builds.apache.org>.
See <https://builds.apache.org/job/kafka-trunk-jdk11/1585/display/redirect?page=changes>

Changes:

[github] KAFKA-9891: add integration tests for EOS and StandbyTask (#8890)


------------------------------------------
[...truncated 6.35 MB...]
org.apache.kafka.streams.TopologyTestDriverTest > shouldCaptureInternalTopicNamesIfWrittenInto[Eos enabled = false] STARTED

org.apache.kafka.streams.TopologyTestDriverTest > shouldCaptureInternalTopicNamesIfWrittenInto[Eos enabled = false] PASSED

org.apache.kafka.streams.TopologyTestDriverTest > shouldPunctuateOnWallClockTimeDeprecated[Eos enabled = false] STARTED

org.apache.kafka.streams.TopologyTestDriverTest > shouldPunctuateOnWallClockTimeDeprecated[Eos enabled = false] PASSED

org.apache.kafka.streams.TopologyTestDriverTest > shouldProcessRecordForTopic[Eos enabled = false] STARTED

org.apache.kafka.streams.TopologyTestDriverTest > shouldProcessRecordForTopic[Eos enabled = false] PASSED

org.apache.kafka.streams.TopologyTestDriverTest > shouldForwardRecordsFromSubtopologyToSubtopology[Eos enabled = false] STARTED

org.apache.kafka.streams.TopologyTestDriverTest > shouldForwardRecordsFromSubtopologyToSubtopology[Eos enabled = false] PASSED

org.apache.kafka.streams.TopologyTestDriverTest > shouldNotUpdateStoreForSmallerValue[Eos enabled = false] STARTED

org.apache.kafka.streams.TopologyTestDriverTest > shouldNotUpdateStoreForSmallerValue[Eos enabled = false] PASSED

org.apache.kafka.streams.TopologyTestDriverTest > shouldCreateStateDirectoryForStatefulTopology[Eos enabled = false] STARTED

org.apache.kafka.streams.TopologyTestDriverTest > shouldCreateStateDirectoryForStatefulTopology[Eos enabled = false] PASSED

org.apache.kafka.streams.TopologyTestDriverTest > shouldPunctuateIfWallClockTimeAdvances[Eos enabled = false] STARTED

org.apache.kafka.streams.TopologyTestDriverTest > shouldPunctuateIfWallClockTimeAdvances[Eos enabled = false] PASSED

org.apache.kafka.streams.internals.WindowStoreFacadeTest > shouldReturnIsOpen STARTED

org.apache.kafka.streams.internals.WindowStoreFacadeTest > shouldReturnIsOpen PASSED

org.apache.kafka.streams.internals.WindowStoreFacadeTest > shouldReturnName STARTED

org.apache.kafka.streams.internals.WindowStoreFacadeTest > shouldReturnName PASSED

org.apache.kafka.streams.internals.WindowStoreFacadeTest > shouldPutWithUnknownTimestamp STARTED

org.apache.kafka.streams.internals.WindowStoreFacadeTest > shouldPutWithUnknownTimestamp PASSED

org.apache.kafka.streams.internals.WindowStoreFacadeTest > shouldPutWindowStartTimestampWithUnknownTimestamp STARTED

org.apache.kafka.streams.internals.WindowStoreFacadeTest > shouldPutWindowStartTimestampWithUnknownTimestamp PASSED

org.apache.kafka.streams.internals.WindowStoreFacadeTest > shouldReturnIsPersistent STARTED

org.apache.kafka.streams.internals.WindowStoreFacadeTest > shouldReturnIsPersistent PASSED

org.apache.kafka.streams.internals.WindowStoreFacadeTest > shouldForwardClose STARTED

org.apache.kafka.streams.internals.WindowStoreFacadeTest > shouldForwardClose PASSED

org.apache.kafka.streams.internals.WindowStoreFacadeTest > shouldForwardFlush STARTED

org.apache.kafka.streams.internals.WindowStoreFacadeTest > shouldForwardFlush PASSED

org.apache.kafka.streams.internals.WindowStoreFacadeTest > shouldForwardInit STARTED

org.apache.kafka.streams.internals.WindowStoreFacadeTest > shouldForwardInit PASSED

org.apache.kafka.streams.TestTopicsTest > testNonUsedOutputTopic STARTED

org.apache.kafka.streams.TestTopicsTest > testNonUsedOutputTopic PASSED

org.apache.kafka.streams.TestTopicsTest > testEmptyTopic STARTED

org.apache.kafka.streams.TestTopicsTest > testEmptyTopic PASSED

org.apache.kafka.streams.TestTopicsTest > testStartTimestamp STARTED

org.apache.kafka.streams.TestTopicsTest > testStartTimestamp PASSED

org.apache.kafka.streams.TestTopicsTest > testNegativeAdvance STARTED

org.apache.kafka.streams.TestTopicsTest > testNegativeAdvance PASSED

org.apache.kafka.streams.TestTopicsTest > shouldNotAllowToCreateWithNullDriver STARTED

org.apache.kafka.streams.TestTopicsTest > shouldNotAllowToCreateWithNullDriver PASSED

org.apache.kafka.streams.TestTopicsTest > testDuration STARTED

org.apache.kafka.streams.TestTopicsTest > testDuration PASSED

org.apache.kafka.streams.TestTopicsTest > testOutputToString STARTED

org.apache.kafka.streams.TestTopicsTest > testOutputToString PASSED

org.apache.kafka.streams.TestTopicsTest > testValue STARTED

org.apache.kafka.streams.TestTopicsTest > testValue PASSED

org.apache.kafka.streams.TestTopicsTest > testTimestampAutoAdvance STARTED

org.apache.kafka.streams.TestTopicsTest > testTimestampAutoAdvance PASSED

org.apache.kafka.streams.TestTopicsTest > testOutputWrongSerde STARTED

org.apache.kafka.streams.TestTopicsTest > testOutputWrongSerde PASSED

org.apache.kafka.streams.TestTopicsTest > shouldNotAllowToCreateOutputTopicWithNullTopicName STARTED

org.apache.kafka.streams.TestTopicsTest > shouldNotAllowToCreateOutputTopicWithNullTopicName PASSED

org.apache.kafka.streams.TestTopicsTest > testWrongSerde STARTED

org.apache.kafka.streams.TestTopicsTest > testWrongSerde PASSED

org.apache.kafka.streams.TestTopicsTest > testKeyValuesToMapWithNull STARTED

org.apache.kafka.streams.TestTopicsTest > testKeyValuesToMapWithNull PASSED

org.apache.kafka.streams.TestTopicsTest > testNonExistingOutputTopic STARTED

org.apache.kafka.streams.TestTopicsTest > testNonExistingOutputTopic PASSED

org.apache.kafka.streams.TestTopicsTest > testMultipleTopics STARTED

org.apache.kafka.streams.TestTopicsTest > testMultipleTopics PASSED

org.apache.kafka.streams.TestTopicsTest > testKeyValueList STARTED

org.apache.kafka.streams.TestTopicsTest > testKeyValueList PASSED

org.apache.kafka.streams.TestTopicsTest > shouldNotAllowToCreateOutputWithNullDriver STARTED

org.apache.kafka.streams.TestTopicsTest > shouldNotAllowToCreateOutputWithNullDriver PASSED

org.apache.kafka.streams.TestTopicsTest > testValueList STARTED

org.apache.kafka.streams.TestTopicsTest > testValueList PASSED

org.apache.kafka.streams.TestTopicsTest > testRecordList STARTED

org.apache.kafka.streams.TestTopicsTest > testRecordList PASSED

org.apache.kafka.streams.TestTopicsTest > testNonExistingInputTopic STARTED

org.apache.kafka.streams.TestTopicsTest > testNonExistingInputTopic PASSED

org.apache.kafka.streams.TestTopicsTest > testKeyValuesToMap STARTED

org.apache.kafka.streams.TestTopicsTest > testKeyValuesToMap PASSED

org.apache.kafka.streams.TestTopicsTest > testRecordsToList STARTED

org.apache.kafka.streams.TestTopicsTest > testRecordsToList PASSED

org.apache.kafka.streams.TestTopicsTest > testKeyValueListDuration STARTED

org.apache.kafka.streams.TestTopicsTest > testKeyValueListDuration PASSED

org.apache.kafka.streams.TestTopicsTest > testInputToString STARTED

org.apache.kafka.streams.TestTopicsTest > testInputToString PASSED

org.apache.kafka.streams.TestTopicsTest > testTimestamp STARTED

org.apache.kafka.streams.TestTopicsTest > testTimestamp PASSED

org.apache.kafka.streams.TestTopicsTest > testWithHeaders STARTED

org.apache.kafka.streams.TestTopicsTest > testWithHeaders PASSED

org.apache.kafka.streams.TestTopicsTest > testKeyValue STARTED

org.apache.kafka.streams.TestTopicsTest > testKeyValue PASSED

org.apache.kafka.streams.TestTopicsTest > shouldNotAllowToCreateTopicWithNullTopicName STARTED

org.apache.kafka.streams.TestTopicsTest > shouldNotAllowToCreateTopicWithNullTopicName PASSED

> Task :streams:upgrade-system-tests-20:spotbugsMain NO-SOURCE
> Task :streams:upgrade-system-tests-20:test
> Task :streams:upgrade-system-tests-21:compileJava NO-SOURCE
> Task :streams:upgrade-system-tests-21:processResources NO-SOURCE
> Task :streams:upgrade-system-tests-21:classes UP-TO-DATE
> Task :streams:upgrade-system-tests-21:checkstyleMain NO-SOURCE
> Task :streams:upgrade-system-tests-21:compileTestJava
> Task :streams:upgrade-system-tests-21:processTestResources NO-SOURCE
> Task :streams:upgrade-system-tests-21:testClasses
> Task :streams:upgrade-system-tests-21:checkstyleTest
> Task :streams:upgrade-system-tests-21:spotbugsMain NO-SOURCE
> Task :streams:upgrade-system-tests-21:test
> Task :streams:upgrade-system-tests-22:compileJava NO-SOURCE
> Task :streams:upgrade-system-tests-22:processResources NO-SOURCE
> Task :streams:upgrade-system-tests-22:classes UP-TO-DATE
> Task :streams:upgrade-system-tests-22:checkstyleMain NO-SOURCE
> Task :streams:upgrade-system-tests-22:compileTestJava
> Task :streams:upgrade-system-tests-22:processTestResources NO-SOURCE
> Task :streams:upgrade-system-tests-22:testClasses
> Task :streams:upgrade-system-tests-22:checkstyleTest
> Task :streams:upgrade-system-tests-22:spotbugsMain NO-SOURCE
> Task :streams:upgrade-system-tests-22:test
> Task :streams:upgrade-system-tests-23:compileJava NO-SOURCE
> Task :streams:upgrade-system-tests-23:processResources NO-SOURCE
> Task :streams:upgrade-system-tests-23:classes UP-TO-DATE
> Task :streams:upgrade-system-tests-23:checkstyleMain NO-SOURCE
> Task :streams:upgrade-system-tests-23:compileTestJava
> Task :streams:upgrade-system-tests-23:processTestResources NO-SOURCE
> Task :streams:upgrade-system-tests-23:testClasses
> Task :streams:upgrade-system-tests-23:checkstyleTest
> Task :streams:upgrade-system-tests-23:spotbugsMain NO-SOURCE
> Task :streams:upgrade-system-tests-23:test
> Task :streams:upgrade-system-tests-24:compileJava NO-SOURCE
> Task :streams:upgrade-system-tests-24:processResources NO-SOURCE
> Task :streams:upgrade-system-tests-24:classes UP-TO-DATE
> Task :streams:upgrade-system-tests-24:checkstyleMain NO-SOURCE
> Task :streams:upgrade-system-tests-24:compileTestJava
> Task :streams:upgrade-system-tests-24:processTestResources NO-SOURCE
> Task :streams:upgrade-system-tests-24:testClasses
> Task :streams:upgrade-system-tests-24:checkstyleTest
> Task :streams:upgrade-system-tests-24:spotbugsMain NO-SOURCE
> Task :streams:upgrade-system-tests-24:test
> Task :streams:upgrade-system-tests-25:compileJava NO-SOURCE
> Task :streams:upgrade-system-tests-25:processResources NO-SOURCE
> Task :streams:upgrade-system-tests-25:classes UP-TO-DATE
> Task :streams:upgrade-system-tests-25:checkstyleMain NO-SOURCE
> Task :streams:upgrade-system-tests-25:compileTestJava
> Task :streams:upgrade-system-tests-25:processTestResources NO-SOURCE
> Task :streams:upgrade-system-tests-25:testClasses
> Task :streams:upgrade-system-tests-25:checkstyleTest
> Task :streams:upgrade-system-tests-25:spotbugsMain NO-SOURCE
> Task :streams:upgrade-system-tests-25:test

FAILURE: Build failed with an exception.

* What went wrong:
Execution failed for task ':connect:mirror:test'.
> There were failing tests. See the report at: file://<https://builds.apache.org/job/kafka-trunk-jdk11/ws/connect/mirror/build/reports/tests/test/index.html>

* Try:
Run with --stacktrace option to get the stack trace. Run with --info or --debug option to get more log output. Run with --scan to get full insights.

* Get more help at https://help.gradle.org

Deprecated Gradle features were used in this build, making it incompatible with Gradle 7.0.
Use '--warning-mode all' to show the individual deprecation warnings.
See https://docs.gradle.org/6.5/userguide/command_line_interface.html#sec:command_line_warnings

BUILD FAILED in 1h 58m 35s
215 actionable tasks: 210 executed, 5 up-to-date
Build step 'Execute shell' marked build as failure
Recording test results
ERROR: No tool found matching GRADLE_4_10_2_HOME
Setting GRADLE_4_10_3_HOME=/home/jenkins/tools/gradle/4.10.3
ERROR: No tool found matching GRADLE_4_10_2_HOME
Setting GRADLE_4_10_3_HOME=/home/jenkins/tools/gradle/4.10.3
Not sending mail to unregistered user noreply@github.com

Build failed in Jenkins: kafka-trunk-jdk11 #1584

Posted by Apache Jenkins Server <je...@builds.apache.org>.
See <https://builds.apache.org/job/kafka-trunk-jdk11/1584/display/redirect?page=changes>

Changes:

[github] MINOR: Reduce build time by gating test coverage plugins behind a flag


------------------------------------------
[...truncated 3.17 MB...]
org.apache.kafka.streams.TestTopicsTest > testWithHeaders PASSED

org.apache.kafka.streams.TestTopicsTest > testKeyValue STARTED

org.apache.kafka.streams.TestTopicsTest > testKeyValue PASSED

org.apache.kafka.streams.TestTopicsTest > shouldNotAllowToCreateTopicWithNullTopicName STARTED

org.apache.kafka.streams.TestTopicsTest > shouldNotAllowToCreateTopicWithNullTopicName PASSED

org.apache.kafka.streams.test.ConsumerRecordFactoryTest > shouldCreateConsumerRecordsFromKeyValuePairs STARTED

org.apache.kafka.streams.test.ConsumerRecordFactoryTest > shouldCreateConsumerRecordsFromKeyValuePairs PASSED

org.apache.kafka.streams.test.ConsumerRecordFactoryTest > shouldNotAllowToCreateTopicWithNullTopicNameWithNullKeyAndDefaultTimestamp STARTED

org.apache.kafka.streams.test.ConsumerRecordFactoryTest > shouldNotAllowToCreateTopicWithNullTopicNameWithNullKeyAndDefaultTimestamp PASSED

org.apache.kafka.streams.test.ConsumerRecordFactoryTest > shouldRequireCustomTopicNameIfNotDefaultFactoryTopicNameWithDefaultTimestamp STARTED

org.apache.kafka.streams.test.ConsumerRecordFactoryTest > shouldRequireCustomTopicNameIfNotDefaultFactoryTopicNameWithDefaultTimestamp PASSED

org.apache.kafka.streams.test.ConsumerRecordFactoryTest > shouldNotAllowToCreateTopicWithNullTopicNameWithNullKey STARTED

org.apache.kafka.streams.test.ConsumerRecordFactoryTest > shouldNotAllowToCreateTopicWithNullTopicNameWithNullKey PASSED

org.apache.kafka.streams.test.ConsumerRecordFactoryTest > shouldCreateNullKeyConsumerRecordWithOtherTopicNameAndTimestampWithTimetamp STARTED

org.apache.kafka.streams.test.ConsumerRecordFactoryTest > shouldCreateNullKeyConsumerRecordWithOtherTopicNameAndTimestampWithTimetamp PASSED

org.apache.kafka.streams.test.ConsumerRecordFactoryTest > shouldCreateConsumerRecordWithTimestamp STARTED

org.apache.kafka.streams.test.ConsumerRecordFactoryTest > shouldCreateConsumerRecordWithTimestamp PASSED

org.apache.kafka.streams.test.ConsumerRecordFactoryTest > shouldNotAllowToCreateTopicWithNullHeaders STARTED

org.apache.kafka.streams.test.ConsumerRecordFactoryTest > shouldNotAllowToCreateTopicWithNullHeaders PASSED

org.apache.kafka.streams.test.ConsumerRecordFactoryTest > shouldNotAllowToCreateTopicWithNullTopicNameWithDefaultTimestamp STARTED

org.apache.kafka.streams.test.ConsumerRecordFactoryTest > shouldNotAllowToCreateTopicWithNullTopicNameWithDefaultTimestamp PASSED

org.apache.kafka.streams.test.ConsumerRecordFactoryTest > shouldRequireCustomTopicNameIfNotDefaultFactoryTopicName STARTED

org.apache.kafka.streams.test.ConsumerRecordFactoryTest > shouldRequireCustomTopicNameIfNotDefaultFactoryTopicName PASSED

org.apache.kafka.streams.test.ConsumerRecordFactoryTest > shouldRequireCustomTopicNameIfNotDefaultFactoryTopicNameWithNullKey STARTED

org.apache.kafka.streams.test.ConsumerRecordFactoryTest > shouldRequireCustomTopicNameIfNotDefaultFactoryTopicNameWithNullKey PASSED

org.apache.kafka.streams.test.ConsumerRecordFactoryTest > shouldCreateConsumerRecord STARTED

org.apache.kafka.streams.test.ConsumerRecordFactoryTest > shouldCreateConsumerRecord PASSED

org.apache.kafka.streams.test.ConsumerRecordFactoryTest > shouldCreateNullKeyConsumerRecord STARTED

org.apache.kafka.streams.test.ConsumerRecordFactoryTest > shouldCreateNullKeyConsumerRecord PASSED

org.apache.kafka.streams.test.ConsumerRecordFactoryTest > shouldCreateConsumerRecordWithOtherTopicName STARTED

org.apache.kafka.streams.test.ConsumerRecordFactoryTest > shouldCreateConsumerRecordWithOtherTopicName PASSED

org.apache.kafka.streams.test.ConsumerRecordFactoryTest > shouldAdvanceTime STARTED

org.apache.kafka.streams.test.ConsumerRecordFactoryTest > shouldAdvanceTime PASSED

org.apache.kafka.streams.test.ConsumerRecordFactoryTest > shouldNotAllowToCreateTopicWithNullTopicNameWithKeyValuePairs STARTED

org.apache.kafka.streams.test.ConsumerRecordFactoryTest > shouldNotAllowToCreateTopicWithNullTopicNameWithKeyValuePairs PASSED

org.apache.kafka.streams.test.ConsumerRecordFactoryTest > shouldRequireCustomTopicNameIfNotDefaultFactoryTopicNameWithKeyValuePairsAndCustomTimestamps STARTED

org.apache.kafka.streams.test.ConsumerRecordFactoryTest > shouldRequireCustomTopicNameIfNotDefaultFactoryTopicNameWithKeyValuePairsAndCustomTimestamps PASSED

org.apache.kafka.streams.test.ConsumerRecordFactoryTest > shouldRequireCustomTopicNameIfNotDefaultFactoryTopicNameWithKeyValuePairs STARTED

org.apache.kafka.streams.test.ConsumerRecordFactoryTest > shouldRequireCustomTopicNameIfNotDefaultFactoryTopicNameWithKeyValuePairs PASSED

org.apache.kafka.streams.test.ConsumerRecordFactoryTest > shouldCreateConsumerRecordWithOtherTopicNameAndTimestamp STARTED

org.apache.kafka.streams.test.ConsumerRecordFactoryTest > shouldCreateConsumerRecordWithOtherTopicNameAndTimestamp PASSED

org.apache.kafka.streams.test.ConsumerRecordFactoryTest > shouldNotAllowToCreateTopicWithNullTopicNameWithKeyValuePairsAndCustomTimestamps STARTED

org.apache.kafka.streams.test.ConsumerRecordFactoryTest > shouldNotAllowToCreateTopicWithNullTopicNameWithKeyValuePairsAndCustomTimestamps PASSED

org.apache.kafka.streams.test.ConsumerRecordFactoryTest > shouldNotAllowToCreateTopicWithNullTopicName STARTED

org.apache.kafka.streams.test.ConsumerRecordFactoryTest > shouldNotAllowToCreateTopicWithNullTopicName PASSED

org.apache.kafka.streams.test.ConsumerRecordFactoryTest > shouldCreateConsumerRecordsFromKeyValuePairsWithCustomTimestampAndIncrementsAndNotAdvanceTime STARTED

org.apache.kafka.streams.test.ConsumerRecordFactoryTest > shouldCreateConsumerRecordsFromKeyValuePairsWithCustomTimestampAndIncrementsAndNotAdvanceTime PASSED

org.apache.kafka.streams.test.ConsumerRecordFactoryTest > shouldCreateNullKeyConsumerRecordWithTimestampWithTimestamp STARTED

org.apache.kafka.streams.test.ConsumerRecordFactoryTest > shouldCreateNullKeyConsumerRecordWithTimestampWithTimestamp PASSED

org.apache.kafka.streams.test.ConsumerRecordFactoryTest > shouldRequireCustomTopicNameIfNotDefaultFactoryTopicNameWithNullKeyAndDefaultTimestamp STARTED

org.apache.kafka.streams.test.ConsumerRecordFactoryTest > shouldRequireCustomTopicNameIfNotDefaultFactoryTopicNameWithNullKeyAndDefaultTimestamp PASSED

org.apache.kafka.streams.test.ConsumerRecordFactoryTest > shouldCreateConsumerRecordsFromKeyValuePairsWithTimestampAndIncrements STARTED

org.apache.kafka.streams.test.ConsumerRecordFactoryTest > shouldCreateConsumerRecordsFromKeyValuePairsWithTimestampAndIncrements PASSED

org.apache.kafka.streams.MockTimeTest > shouldGetNanosAsMillis STARTED

org.apache.kafka.streams.MockTimeTest > shouldGetNanosAsMillis PASSED

org.apache.kafka.streams.MockTimeTest > shouldSetStartTime STARTED

org.apache.kafka.streams.MockTimeTest > shouldSetStartTime PASSED

org.apache.kafka.streams.MockTimeTest > shouldNotAllowNegativeSleep STARTED

org.apache.kafka.streams.MockTimeTest > shouldNotAllowNegativeSleep PASSED

org.apache.kafka.streams.MockTimeTest > shouldAdvanceTimeOnSleep STARTED

org.apache.kafka.streams.MockTimeTest > shouldAdvanceTimeOnSleep PASSED

org.apache.kafka.streams.internals.KeyValueStoreFacadeTest > shouldReturnIsOpen STARTED

org.apache.kafka.streams.internals.KeyValueStoreFacadeTest > shouldReturnIsOpen PASSED

org.apache.kafka.streams.internals.KeyValueStoreFacadeTest > shouldDeleteAndReturnPlainValue STARTED

org.apache.kafka.streams.internals.KeyValueStoreFacadeTest > shouldDeleteAndReturnPlainValue PASSED

org.apache.kafka.streams.internals.KeyValueStoreFacadeTest > shouldReturnName STARTED

org.apache.kafka.streams.internals.KeyValueStoreFacadeTest > shouldReturnName PASSED

org.apache.kafka.streams.internals.KeyValueStoreFacadeTest > shouldPutWithUnknownTimestamp STARTED

org.apache.kafka.streams.internals.KeyValueStoreFacadeTest > shouldPutWithUnknownTimestamp PASSED

org.apache.kafka.streams.internals.KeyValueStoreFacadeTest > shouldPutAllWithUnknownTimestamp STARTED

org.apache.kafka.streams.internals.KeyValueStoreFacadeTest > shouldPutAllWithUnknownTimestamp PASSED

org.apache.kafka.streams.internals.KeyValueStoreFacadeTest > shouldReturnIsPersistent STARTED

org.apache.kafka.streams.internals.KeyValueStoreFacadeTest > shouldReturnIsPersistent PASSED

org.apache.kafka.streams.internals.KeyValueStoreFacadeTest > shouldPutIfAbsentWithUnknownTimestamp STARTED

org.apache.kafka.streams.internals.KeyValueStoreFacadeTest > shouldPutIfAbsentWithUnknownTimestamp PASSED

org.apache.kafka.streams.internals.KeyValueStoreFacadeTest > shouldForwardClose STARTED

org.apache.kafka.streams.internals.KeyValueStoreFacadeTest > shouldForwardClose PASSED

org.apache.kafka.streams.internals.KeyValueStoreFacadeTest > shouldForwardFlush STARTED

org.apache.kafka.streams.internals.KeyValueStoreFacadeTest > shouldForwardFlush PASSED

org.apache.kafka.streams.internals.KeyValueStoreFacadeTest > shouldForwardInit STARTED

org.apache.kafka.streams.internals.KeyValueStoreFacadeTest > shouldForwardInit PASSED

> Task :streams:upgrade-system-tests-11:spotbugsMain NO-SOURCE
> Task :streams:upgrade-system-tests-11:test
> Task :streams:upgrade-system-tests-20:compileJava NO-SOURCE
> Task :streams:upgrade-system-tests-20:processResources NO-SOURCE
> Task :streams:upgrade-system-tests-20:classes UP-TO-DATE
> Task :streams:upgrade-system-tests-20:checkstyleMain NO-SOURCE
> Task :streams:upgrade-system-tests-20:compileTestJava
> Task :streams:upgrade-system-tests-20:processTestResources NO-SOURCE
> Task :streams:upgrade-system-tests-20:testClasses
> Task :streams:upgrade-system-tests-20:checkstyleTest
> Task :streams:upgrade-system-tests-20:spotbugsMain NO-SOURCE
> Task :streams:upgrade-system-tests-20:test
> Task :streams:upgrade-system-tests-21:compileJava NO-SOURCE
> Task :streams:upgrade-system-tests-21:processResources NO-SOURCE
> Task :streams:upgrade-system-tests-21:classes UP-TO-DATE
> Task :streams:upgrade-system-tests-21:checkstyleMain NO-SOURCE
> Task :streams:upgrade-system-tests-21:compileTestJava
> Task :streams:upgrade-system-tests-21:processTestResources NO-SOURCE
> Task :streams:upgrade-system-tests-21:testClasses
> Task :streams:upgrade-system-tests-21:checkstyleTest
> Task :streams:upgrade-system-tests-21:spotbugsMain NO-SOURCE
> Task :streams:upgrade-system-tests-21:test
> Task :streams:upgrade-system-tests-22:compileJava NO-SOURCE
> Task :streams:upgrade-system-tests-22:processResources NO-SOURCE
> Task :streams:upgrade-system-tests-22:classes UP-TO-DATE
> Task :streams:upgrade-system-tests-22:checkstyleMain NO-SOURCE
> Task :streams:upgrade-system-tests-22:compileTestJava
> Task :streams:upgrade-system-tests-22:processTestResources NO-SOURCE
> Task :streams:upgrade-system-tests-22:testClasses
> Task :streams:upgrade-system-tests-22:checkstyleTest
> Task :streams:upgrade-system-tests-22:spotbugsMain NO-SOURCE
> Task :streams:upgrade-system-tests-22:test
> Task :streams:upgrade-system-tests-23:compileJava NO-SOURCE
> Task :streams:upgrade-system-tests-23:processResources NO-SOURCE
> Task :streams:upgrade-system-tests-23:classes UP-TO-DATE
> Task :streams:upgrade-system-tests-23:checkstyleMain NO-SOURCE
> Task :streams:upgrade-system-tests-23:compileTestJava
> Task :streams:upgrade-system-tests-23:processTestResources NO-SOURCE
> Task :streams:upgrade-system-tests-23:testClasses
> Task :streams:upgrade-system-tests-23:checkstyleTest
> Task :streams:upgrade-system-tests-23:spotbugsMain NO-SOURCE
> Task :streams:upgrade-system-tests-23:test
> Task :streams:upgrade-system-tests-24:compileJava NO-SOURCE
> Task :streams:upgrade-system-tests-24:processResources NO-SOURCE
> Task :streams:upgrade-system-tests-24:classes UP-TO-DATE
> Task :streams:upgrade-system-tests-24:checkstyleMain NO-SOURCE
> Task :streams:upgrade-system-tests-24:compileTestJava
> Task :streams:upgrade-system-tests-24:processTestResources NO-SOURCE
> Task :streams:upgrade-system-tests-24:testClasses
> Task :streams:upgrade-system-tests-24:checkstyleTest
> Task :streams:upgrade-system-tests-24:spotbugsMain NO-SOURCE
> Task :streams:upgrade-system-tests-24:test
> Task :streams:upgrade-system-tests-25:compileJava NO-SOURCE
> Task :streams:upgrade-system-tests-25:processResources NO-SOURCE
> Task :streams:upgrade-system-tests-25:classes UP-TO-DATE
> Task :streams:upgrade-system-tests-25:checkstyleMain NO-SOURCE
> Task :streams:upgrade-system-tests-25:compileTestJava
> Task :streams:upgrade-system-tests-25:processTestResources NO-SOURCE
> Task :streams:upgrade-system-tests-25:testClasses
> Task :streams:upgrade-system-tests-25:checkstyleTest
> Task :streams:upgrade-system-tests-25:spotbugsMain NO-SOURCE
> Task :streams:upgrade-system-tests-25:test

FAILURE: Build failed with an exception.

* What went wrong:
Execution failed for task ':core:test'.
> There were failing tests. See the report at: file://<https://builds.apache.org/job/kafka-trunk-jdk11/ws/core/build/reports/tests/test/index.html>

* Try:
Run with --stacktrace option to get the stack trace. Run with --info or --debug option to get more log output. Run with --scan to get full insights.

* Get more help at https://help.gradle.org

Deprecated Gradle features were used in this build, making it incompatible with Gradle 7.0.
Use '--warning-mode all' to show the individual deprecation warnings.
See https://docs.gradle.org/6.5/userguide/command_line_interface.html#sec:command_line_warnings

BUILD FAILED in 1h 49m 26s
215 actionable tasks: 183 executed, 32 up-to-date
Build step 'Execute shell' marked build as failure
Recording test results
ERROR: No tool found matching GRADLE_4_10_2_HOME
Setting GRADLE_4_10_3_HOME=/home/jenkins/tools/gradle/4.10.3
ERROR: No tool found matching GRADLE_4_10_2_HOME
Setting GRADLE_4_10_3_HOME=/home/jenkins/tools/gradle/4.10.3
Not sending mail to unregistered user noreply@github.com

Build failed in Jenkins: kafka-trunk-jdk11 #1583

Posted by Apache Jenkins Server <je...@builds.apache.org>.
See <https://builds.apache.org/job/kafka-trunk-jdk11/1583/display/redirect?page=changes>

Changes:

[github] KAFKA-10141; Add more detail to log segment delete messages (#8850)


------------------------------------------
[...truncated 3.17 MB...]
org.apache.kafka.streams.TopologyTestDriverTest > shouldFeedStoreFromGlobalKTable[Eos enabled = false] PASSED

org.apache.kafka.streams.TopologyTestDriverTest > shouldCleanUpPersistentStateStoresOnClose[Eos enabled = false] STARTED

org.apache.kafka.streams.TopologyTestDriverTest > shouldCleanUpPersistentStateStoresOnClose[Eos enabled = false] PASSED

org.apache.kafka.streams.TopologyTestDriverTest > shouldThrowForUnknownTopicDeprecated[Eos enabled = false] STARTED

org.apache.kafka.streams.TopologyTestDriverTest > shouldThrowForUnknownTopicDeprecated[Eos enabled = false] PASSED

org.apache.kafka.streams.TopologyTestDriverTest > shouldThrowPatternNotValidForTopicNameException[Eos enabled = false] STARTED

org.apache.kafka.streams.TopologyTestDriverTest > shouldThrowPatternNotValidForTopicNameException[Eos enabled = false] PASSED

org.apache.kafka.streams.TopologyTestDriverTest > shouldEnqueueLaterOutputsAfterEarlierOnes[Eos enabled = false] STARTED

org.apache.kafka.streams.TopologyTestDriverTest > shouldEnqueueLaterOutputsAfterEarlierOnes[Eos enabled = false] PASSED

org.apache.kafka.streams.TopologyTestDriverTest > shouldUseSourceSpecificDeserializersDeprecated[Eos enabled = false] STARTED

org.apache.kafka.streams.TopologyTestDriverTest > shouldUseSourceSpecificDeserializersDeprecated[Eos enabled = false] PASSED

org.apache.kafka.streams.TopologyTestDriverTest > shouldPunctuateIfEvenTimeAdvances[Eos enabled = false] STARTED

org.apache.kafka.streams.TopologyTestDriverTest > shouldPunctuateIfEvenTimeAdvances[Eos enabled = false] PASSED

org.apache.kafka.streams.TopologyTestDriverTest > shouldInitProcessor[Eos enabled = false] STARTED

org.apache.kafka.streams.TopologyTestDriverTest > shouldInitProcessor[Eos enabled = false] PASSED

org.apache.kafka.streams.TopologyTestDriverTest > shouldThrowForUnknownTopic[Eos enabled = false] STARTED

org.apache.kafka.streams.TopologyTestDriverTest > shouldThrowForUnknownTopic[Eos enabled = false] PASSED

org.apache.kafka.streams.TopologyTestDriverTest > shouldPunctuateOnStreamsTime[Eos enabled = false] STARTED

org.apache.kafka.streams.TopologyTestDriverTest > shouldPunctuateOnStreamsTime[Eos enabled = false] PASSED

org.apache.kafka.streams.TopologyTestDriverTest > shouldCaptureGlobalTopicNameIfWrittenInto[Eos enabled = false] STARTED

org.apache.kafka.streams.TopologyTestDriverTest > shouldCaptureGlobalTopicNameIfWrittenInto[Eos enabled = false] PASSED

org.apache.kafka.streams.TopologyTestDriverTest > shouldThrowIfInMemoryBuiltInStoreIsAccessedWithUntypedMethod[Eos enabled = false] STARTED

org.apache.kafka.streams.TopologyTestDriverTest > shouldThrowIfInMemoryBuiltInStoreIsAccessedWithUntypedMethod[Eos enabled = false] PASSED

org.apache.kafka.streams.TopologyTestDriverTest > shouldProcessFromSourcesThatMatchMultiplePattern[Eos enabled = false] STARTED

org.apache.kafka.streams.TopologyTestDriverTest > shouldProcessFromSourcesThatMatchMultiplePattern[Eos enabled = false] PASSED

org.apache.kafka.streams.TopologyTestDriverTest > shouldPopulateGlobalStore[Eos enabled = false] STARTED

org.apache.kafka.streams.TopologyTestDriverTest > shouldPopulateGlobalStore[Eos enabled = false] PASSED

org.apache.kafka.streams.TopologyTestDriverTest > shouldThrowIfPersistentBuiltInStoreIsAccessedWithUntypedMethod[Eos enabled = false] STARTED

org.apache.kafka.streams.TopologyTestDriverTest > shouldThrowIfPersistentBuiltInStoreIsAccessedWithUntypedMethod[Eos enabled = false] PASSED

org.apache.kafka.streams.TopologyTestDriverTest > shouldAllowPrePopulatingStatesStoresWithCachingEnabled[Eos enabled = false] STARTED

org.apache.kafka.streams.TopologyTestDriverTest > shouldAllowPrePopulatingStatesStoresWithCachingEnabled[Eos enabled = false] PASSED

org.apache.kafka.streams.TopologyTestDriverTest > shouldReturnCorrectPersistentStoreTypeOnly[Eos enabled = false] STARTED

org.apache.kafka.streams.TopologyTestDriverTest > shouldReturnCorrectPersistentStoreTypeOnly[Eos enabled = false] PASSED

org.apache.kafka.streams.TopologyTestDriverTest > shouldRespectTaskIdling[Eos enabled = false] STARTED

org.apache.kafka.streams.TopologyTestDriverTest > shouldRespectTaskIdling[Eos enabled = false] PASSED

org.apache.kafka.streams.TopologyTestDriverTest > shouldUseSourceSpecificDeserializers[Eos enabled = false] STARTED

org.apache.kafka.streams.TopologyTestDriverTest > shouldUseSourceSpecificDeserializers[Eos enabled = false] PASSED

org.apache.kafka.streams.TopologyTestDriverTest > shouldReturnAllStores[Eos enabled = false] STARTED

org.apache.kafka.streams.TopologyTestDriverTest > shouldReturnAllStores[Eos enabled = false] PASSED

org.apache.kafka.streams.TopologyTestDriverTest > shouldNotCreateStateDirectoryForStatelessTopology[Eos enabled = false] STARTED

org.apache.kafka.streams.TopologyTestDriverTest > shouldNotCreateStateDirectoryForStatelessTopology[Eos enabled = false] PASSED

org.apache.kafka.streams.TopologyTestDriverTest > shouldApplyGlobalUpdatesCorrectlyInRecursiveTopologies[Eos enabled = false] STARTED

org.apache.kafka.streams.TopologyTestDriverTest > shouldApplyGlobalUpdatesCorrectlyInRecursiveTopologies[Eos enabled = false] PASSED

org.apache.kafka.streams.TopologyTestDriverTest > shouldReturnAllStoresNames[Eos enabled = false] STARTED

org.apache.kafka.streams.TopologyTestDriverTest > shouldReturnAllStoresNames[Eos enabled = false] PASSED

org.apache.kafka.streams.TopologyTestDriverTest > shouldPassRecordHeadersIntoSerializersAndDeserializers[Eos enabled = false] STARTED

org.apache.kafka.streams.TopologyTestDriverTest > shouldPassRecordHeadersIntoSerializersAndDeserializers[Eos enabled = false] PASSED

org.apache.kafka.streams.TopologyTestDriverTest > shouldProcessConsumerRecordList[Eos enabled = false] STARTED

org.apache.kafka.streams.TopologyTestDriverTest > shouldProcessConsumerRecordList[Eos enabled = false] PASSED

org.apache.kafka.streams.TopologyTestDriverTest > shouldUseSinkSpecificSerializers[Eos enabled = false] STARTED

org.apache.kafka.streams.TopologyTestDriverTest > shouldUseSinkSpecificSerializers[Eos enabled = false] PASSED

org.apache.kafka.streams.TopologyTestDriverTest > shouldFlushStoreForFirstInput[Eos enabled = false] STARTED

org.apache.kafka.streams.TopologyTestDriverTest > shouldFlushStoreForFirstInput[Eos enabled = false] PASSED

org.apache.kafka.streams.TopologyTestDriverTest > shouldProcessFromSourceThatMatchPattern[Eos enabled = false] STARTED

org.apache.kafka.streams.TopologyTestDriverTest > shouldProcessFromSourceThatMatchPattern[Eos enabled = false] PASSED

org.apache.kafka.streams.TopologyTestDriverTest > shouldCaptureSinkTopicNamesIfWrittenInto[Eos enabled = false] STARTED

org.apache.kafka.streams.TopologyTestDriverTest > shouldCaptureSinkTopicNamesIfWrittenInto[Eos enabled = false] PASSED

org.apache.kafka.streams.TopologyTestDriverTest > shouldUpdateStoreForNewKey[Eos enabled = false] STARTED

org.apache.kafka.streams.TopologyTestDriverTest > shouldUpdateStoreForNewKey[Eos enabled = false] PASSED

org.apache.kafka.streams.TopologyTestDriverTest > shouldSendRecordViaCorrectSourceTopicDeprecated[Eos enabled = false] STARTED

org.apache.kafka.streams.TopologyTestDriverTest > shouldSendRecordViaCorrectSourceTopicDeprecated[Eos enabled = false] PASSED

org.apache.kafka.streams.TopologyTestDriverTest > shouldPunctuateOnWallClockTime[Eos enabled = false] STARTED

org.apache.kafka.streams.TopologyTestDriverTest > shouldPunctuateOnWallClockTime[Eos enabled = false] PASSED

org.apache.kafka.streams.TopologyTestDriverTest > shouldSetRecordMetadata[Eos enabled = false] STARTED

org.apache.kafka.streams.TopologyTestDriverTest > shouldSetRecordMetadata[Eos enabled = false] PASSED

org.apache.kafka.streams.TopologyTestDriverTest > shouldNotUpdateStoreForLargerValue[Eos enabled = false] STARTED

org.apache.kafka.streams.TopologyTestDriverTest > shouldNotUpdateStoreForLargerValue[Eos enabled = false] PASSED

org.apache.kafka.streams.TopologyTestDriverTest > shouldReturnCorrectInMemoryStoreTypeOnly[Eos enabled = false] STARTED

org.apache.kafka.streams.TopologyTestDriverTest > shouldReturnCorrectInMemoryStoreTypeOnly[Eos enabled = false] PASSED

org.apache.kafka.streams.TopologyTestDriverTest > shouldThrowForMissingTime[Eos enabled = false] STARTED

org.apache.kafka.streams.TopologyTestDriverTest > shouldThrowForMissingTime[Eos enabled = false] PASSED

org.apache.kafka.streams.TopologyTestDriverTest > shouldCaptureInternalTopicNamesIfWrittenInto[Eos enabled = false] STARTED

org.apache.kafka.streams.TopologyTestDriverTest > shouldCaptureInternalTopicNamesIfWrittenInto[Eos enabled = false] PASSED

org.apache.kafka.streams.TopologyTestDriverTest > shouldPunctuateOnWallClockTimeDeprecated[Eos enabled = false] STARTED

org.apache.kafka.streams.TopologyTestDriverTest > shouldPunctuateOnWallClockTimeDeprecated[Eos enabled = false] PASSED

org.apache.kafka.streams.TopologyTestDriverTest > shouldProcessRecordForTopic[Eos enabled = false] STARTED

org.apache.kafka.streams.TopologyTestDriverTest > shouldProcessRecordForTopic[Eos enabled = false] PASSED

org.apache.kafka.streams.TopologyTestDriverTest > shouldForwardRecordsFromSubtopologyToSubtopology[Eos enabled = false] STARTED

org.apache.kafka.streams.TopologyTestDriverTest > shouldForwardRecordsFromSubtopologyToSubtopology[Eos enabled = false] PASSED

org.apache.kafka.streams.TopologyTestDriverTest > shouldNotUpdateStoreForSmallerValue[Eos enabled = false] STARTED

org.apache.kafka.streams.TopologyTestDriverTest > shouldNotUpdateStoreForSmallerValue[Eos enabled = false] PASSED

org.apache.kafka.streams.TopologyTestDriverTest > shouldCreateStateDirectoryForStatefulTopology[Eos enabled = false] STARTED

org.apache.kafka.streams.TopologyTestDriverTest > shouldCreateStateDirectoryForStatefulTopology[Eos enabled = false] PASSED

org.apache.kafka.streams.TopologyTestDriverTest > shouldPunctuateIfWallClockTimeAdvances[Eos enabled = false] STARTED

org.apache.kafka.streams.TopologyTestDriverTest > shouldPunctuateIfWallClockTimeAdvances[Eos enabled = false] PASSED

> Task :streams:upgrade-system-tests-20:testClasses
> Task :streams:upgrade-system-tests-20:checkstyleTest
> Task :streams:upgrade-system-tests-20:spotbugsMain NO-SOURCE
> Task :streams:upgrade-system-tests-20:test
> Task :streams:upgrade-system-tests-21:compileJava NO-SOURCE
> Task :streams:upgrade-system-tests-21:processResources NO-SOURCE
> Task :streams:upgrade-system-tests-21:classes UP-TO-DATE
> Task :streams:upgrade-system-tests-21:checkstyleMain NO-SOURCE
> Task :streams:upgrade-system-tests-21:compileTestJava
> Task :streams:upgrade-system-tests-21:processTestResources NO-SOURCE
> Task :streams:upgrade-system-tests-21:testClasses
> Task :streams:upgrade-system-tests-21:checkstyleTest
> Task :streams:upgrade-system-tests-21:spotbugsMain NO-SOURCE
> Task :streams:upgrade-system-tests-21:test
> Task :streams:upgrade-system-tests-22:compileJava NO-SOURCE
> Task :streams:upgrade-system-tests-22:processResources NO-SOURCE
> Task :streams:upgrade-system-tests-22:classes UP-TO-DATE
> Task :streams:upgrade-system-tests-22:checkstyleMain NO-SOURCE
> Task :streams:upgrade-system-tests-22:compileTestJava
> Task :streams:upgrade-system-tests-22:processTestResources NO-SOURCE
> Task :streams:upgrade-system-tests-22:testClasses
> Task :streams:upgrade-system-tests-22:checkstyleTest
> Task :streams:upgrade-system-tests-22:spotbugsMain NO-SOURCE
> Task :streams:upgrade-system-tests-22:test
> Task :streams:upgrade-system-tests-23:compileJava NO-SOURCE
> Task :streams:upgrade-system-tests-23:processResources NO-SOURCE
> Task :streams:upgrade-system-tests-23:classes UP-TO-DATE
> Task :streams:upgrade-system-tests-23:checkstyleMain NO-SOURCE
> Task :streams:upgrade-system-tests-23:compileTestJava
> Task :streams:upgrade-system-tests-23:processTestResources NO-SOURCE
> Task :streams:upgrade-system-tests-23:testClasses
> Task :streams:upgrade-system-tests-23:checkstyleTest
> Task :streams:upgrade-system-tests-23:spotbugsMain NO-SOURCE
> Task :streams:upgrade-system-tests-23:test
> Task :streams:upgrade-system-tests-24:compileJava NO-SOURCE
> Task :streams:upgrade-system-tests-24:processResources NO-SOURCE
> Task :streams:upgrade-system-tests-24:classes UP-TO-DATE
> Task :streams:upgrade-system-tests-24:checkstyleMain NO-SOURCE
> Task :streams:upgrade-system-tests-24:compileTestJava
> Task :streams:upgrade-system-tests-24:processTestResources NO-SOURCE
> Task :streams:upgrade-system-tests-24:testClasses
> Task :streams:upgrade-system-tests-24:checkstyleTest
> Task :streams:upgrade-system-tests-24:spotbugsMain NO-SOURCE
> Task :streams:upgrade-system-tests-24:test
> Task :streams:upgrade-system-tests-25:compileJava NO-SOURCE
> Task :streams:upgrade-system-tests-25:processResources NO-SOURCE
> Task :streams:upgrade-system-tests-25:classes UP-TO-DATE
> Task :streams:upgrade-system-tests-25:checkstyleMain NO-SOURCE
> Task :streams:upgrade-system-tests-25:compileTestJava
> Task :streams:upgrade-system-tests-25:processTestResources NO-SOURCE
> Task :streams:upgrade-system-tests-25:testClasses
> Task :streams:upgrade-system-tests-25:checkstyleTest
> Task :streams:upgrade-system-tests-25:spotbugsMain NO-SOURCE
> Task :streams:upgrade-system-tests-25:test

FAILURE: Build failed with an exception.

* What went wrong:
Execution failed for task ':connect:mirror:test'.
> There were failing tests. See the report at: file://<https://builds.apache.org/job/kafka-trunk-jdk11/ws/connect/mirror/build/reports/tests/test/index.html>

* Try:
Run with --stacktrace option to get the stack trace. Run with --info or --debug option to get more log output. Run with --scan to get full insights.

* Get more help at https://help.gradle.org

Deprecated Gradle features were used in this build, making it incompatible with Gradle 7.0.
Use '--warning-mode all' to show the individual deprecation warnings.
See https://docs.gradle.org/6.5/userguide/command_line_interface.html#sec:command_line_warnings

BUILD FAILED in 1h 52m 31s
215 actionable tasks: 183 executed, 32 up-to-date
Build step 'Execute shell' marked build as failure
Recording test results
ERROR: No tool found matching GRADLE_4_10_2_HOME
Setting GRADLE_4_10_3_HOME=/home/jenkins/tools/gradle/4.10.3
ERROR: No tool found matching GRADLE_4_10_2_HOME
Setting GRADLE_4_10_3_HOME=/home/jenkins/tools/gradle/4.10.3
Not sending mail to unregistered user noreply@github.com

Build failed in Jenkins: kafka-trunk-jdk11 #1582

Posted by Apache Jenkins Server <je...@builds.apache.org>.
See <https://builds.apache.org/job/kafka-trunk-jdk11/1582/display/redirect?page=changes>

Changes:

[github] KAFKA-10113; Specify fetch offsets correctly in `LogTruncationException`


------------------------------------------
[...truncated 3.18 MB...]
org.apache.kafka.streams.TopologyTestDriverTest > shouldProcessRecordForTopic[Eos enabled = false] STARTED

org.apache.kafka.streams.TopologyTestDriverTest > shouldProcessRecordForTopic[Eos enabled = false] PASSED

org.apache.kafka.streams.TopologyTestDriverTest > shouldForwardRecordsFromSubtopologyToSubtopology[Eos enabled = false] STARTED

org.apache.kafka.streams.TopologyTestDriverTest > shouldForwardRecordsFromSubtopologyToSubtopology[Eos enabled = false] PASSED

org.apache.kafka.streams.TopologyTestDriverTest > shouldNotUpdateStoreForSmallerValue[Eos enabled = false] STARTED

org.apache.kafka.streams.TopologyTestDriverTest > shouldNotUpdateStoreForSmallerValue[Eos enabled = false] PASSED

org.apache.kafka.streams.TopologyTestDriverTest > shouldCreateStateDirectoryForStatefulTopology[Eos enabled = false] STARTED

org.apache.kafka.streams.TopologyTestDriverTest > shouldCreateStateDirectoryForStatefulTopology[Eos enabled = false] PASSED

org.apache.kafka.streams.TopologyTestDriverTest > shouldPunctuateIfWallClockTimeAdvances[Eos enabled = false] STARTED

org.apache.kafka.streams.TopologyTestDriverTest > shouldPunctuateIfWallClockTimeAdvances[Eos enabled = false] PASSED

org.apache.kafka.streams.internals.WindowStoreFacadeTest > shouldReturnIsOpen STARTED

org.apache.kafka.streams.internals.WindowStoreFacadeTest > shouldReturnIsOpen PASSED

org.apache.kafka.streams.internals.WindowStoreFacadeTest > shouldReturnName STARTED

org.apache.kafka.streams.internals.WindowStoreFacadeTest > shouldReturnName PASSED

org.apache.kafka.streams.internals.WindowStoreFacadeTest > shouldPutWithUnknownTimestamp STARTED

org.apache.kafka.streams.internals.WindowStoreFacadeTest > shouldPutWithUnknownTimestamp PASSED

org.apache.kafka.streams.internals.WindowStoreFacadeTest > shouldPutWindowStartTimestampWithUnknownTimestamp STARTED

org.apache.kafka.streams.internals.WindowStoreFacadeTest > shouldPutWindowStartTimestampWithUnknownTimestamp PASSED

org.apache.kafka.streams.internals.WindowStoreFacadeTest > shouldReturnIsPersistent STARTED

org.apache.kafka.streams.internals.WindowStoreFacadeTest > shouldReturnIsPersistent PASSED

org.apache.kafka.streams.internals.WindowStoreFacadeTest > shouldForwardClose STARTED

org.apache.kafka.streams.internals.WindowStoreFacadeTest > shouldForwardClose PASSED

org.apache.kafka.streams.internals.WindowStoreFacadeTest > shouldForwardFlush STARTED

org.apache.kafka.streams.internals.WindowStoreFacadeTest > shouldForwardFlush PASSED

org.apache.kafka.streams.internals.WindowStoreFacadeTest > shouldForwardInit STARTED

org.apache.kafka.streams.internals.WindowStoreFacadeTest > shouldForwardInit PASSED

org.apache.kafka.streams.TestTopicsTest > testNonUsedOutputTopic STARTED

org.apache.kafka.streams.TestTopicsTest > testNonUsedOutputTopic PASSED

org.apache.kafka.streams.TestTopicsTest > testEmptyTopic STARTED

org.apache.kafka.streams.TestTopicsTest > testEmptyTopic PASSED

org.apache.kafka.streams.TestTopicsTest > testStartTimestamp STARTED

org.apache.kafka.streams.TestTopicsTest > testStartTimestamp PASSED

org.apache.kafka.streams.TestTopicsTest > testNegativeAdvance STARTED

org.apache.kafka.streams.TestTopicsTest > testNegativeAdvance PASSED

org.apache.kafka.streams.TestTopicsTest > shouldNotAllowToCreateWithNullDriver STARTED

org.apache.kafka.streams.TestTopicsTest > shouldNotAllowToCreateWithNullDriver PASSED

org.apache.kafka.streams.TestTopicsTest > testDuration STARTED

org.apache.kafka.streams.TestTopicsTest > testDuration PASSED

org.apache.kafka.streams.TestTopicsTest > testOutputToString STARTED

org.apache.kafka.streams.TestTopicsTest > testOutputToString PASSED

org.apache.kafka.streams.TestTopicsTest > testValue STARTED

org.apache.kafka.streams.TestTopicsTest > testValue PASSED

org.apache.kafka.streams.TestTopicsTest > testTimestampAutoAdvance STARTED

org.apache.kafka.streams.TestTopicsTest > testTimestampAutoAdvance PASSED

org.apache.kafka.streams.TestTopicsTest > testOutputWrongSerde STARTED

org.apache.kafka.streams.TestTopicsTest > testOutputWrongSerde PASSED

org.apache.kafka.streams.TestTopicsTest > shouldNotAllowToCreateOutputTopicWithNullTopicName STARTED

org.apache.kafka.streams.TestTopicsTest > shouldNotAllowToCreateOutputTopicWithNullTopicName PASSED

org.apache.kafka.streams.TestTopicsTest > testWrongSerde STARTED

org.apache.kafka.streams.TestTopicsTest > testWrongSerde PASSED

org.apache.kafka.streams.TestTopicsTest > testKeyValuesToMapWithNull STARTED

org.apache.kafka.streams.TestTopicsTest > testKeyValuesToMapWithNull PASSED

org.apache.kafka.streams.TestTopicsTest > testNonExistingOutputTopic STARTED

org.apache.kafka.streams.TestTopicsTest > testNonExistingOutputTopic PASSED

org.apache.kafka.streams.TestTopicsTest > testMultipleTopics STARTED

org.apache.kafka.streams.TestTopicsTest > testMultipleTopics PASSED

org.apache.kafka.streams.TestTopicsTest > testKeyValueList STARTED

org.apache.kafka.streams.TestTopicsTest > testKeyValueList PASSED

org.apache.kafka.streams.TestTopicsTest > shouldNotAllowToCreateOutputWithNullDriver STARTED

org.apache.kafka.streams.TestTopicsTest > shouldNotAllowToCreateOutputWithNullDriver PASSED

org.apache.kafka.streams.TestTopicsTest > testValueList STARTED

org.apache.kafka.streams.TestTopicsTest > testValueList PASSED

org.apache.kafka.streams.TestTopicsTest > testRecordList STARTED

org.apache.kafka.streams.TestTopicsTest > testRecordList PASSED

org.apache.kafka.streams.TestTopicsTest > testNonExistingInputTopic STARTED

org.apache.kafka.streams.TestTopicsTest > testNonExistingInputTopic PASSED

org.apache.kafka.streams.TestTopicsTest > testKeyValuesToMap STARTED

org.apache.kafka.streams.TestTopicsTest > testKeyValuesToMap PASSED

org.apache.kafka.streams.TestTopicsTest > testRecordsToList STARTED

org.apache.kafka.streams.TestTopicsTest > testRecordsToList PASSED

org.apache.kafka.streams.TestTopicsTest > testKeyValueListDuration STARTED

org.apache.kafka.streams.TestTopicsTest > testKeyValueListDuration PASSED

org.apache.kafka.streams.TestTopicsTest > testInputToString STARTED

org.apache.kafka.streams.TestTopicsTest > testInputToString PASSED

org.apache.kafka.streams.TestTopicsTest > testTimestamp STARTED

org.apache.kafka.streams.TestTopicsTest > testTimestamp PASSED

org.apache.kafka.streams.TestTopicsTest > testWithHeaders STARTED

org.apache.kafka.streams.TestTopicsTest > testWithHeaders PASSED

org.apache.kafka.streams.TestTopicsTest > testKeyValue STARTED

org.apache.kafka.streams.TestTopicsTest > testKeyValue PASSED

org.apache.kafka.streams.TestTopicsTest > shouldNotAllowToCreateTopicWithNullTopicName STARTED

org.apache.kafka.streams.TestTopicsTest > shouldNotAllowToCreateTopicWithNullTopicName PASSED

> Task :streams:upgrade-system-tests-20:compileJava NO-SOURCE
> Task :streams:upgrade-system-tests-20:processResources NO-SOURCE
> Task :streams:upgrade-system-tests-20:classes UP-TO-DATE
> Task :streams:upgrade-system-tests-20:checkstyleMain NO-SOURCE
> Task :streams:upgrade-system-tests-20:compileTestJava
> Task :streams:upgrade-system-tests-20:processTestResources NO-SOURCE
> Task :streams:upgrade-system-tests-20:testClasses
> Task :streams:upgrade-system-tests-20:checkstyleTest
> Task :streams:upgrade-system-tests-20:spotbugsMain NO-SOURCE
> Task :streams:upgrade-system-tests-20:test
> Task :streams:upgrade-system-tests-21:compileJava NO-SOURCE
> Task :streams:upgrade-system-tests-21:processResources NO-SOURCE
> Task :streams:upgrade-system-tests-21:classes UP-TO-DATE
> Task :streams:upgrade-system-tests-21:checkstyleMain NO-SOURCE
> Task :streams:upgrade-system-tests-21:compileTestJava
> Task :streams:upgrade-system-tests-21:processTestResources NO-SOURCE
> Task :streams:upgrade-system-tests-21:testClasses
> Task :streams:upgrade-system-tests-21:checkstyleTest
> Task :streams:upgrade-system-tests-21:spotbugsMain NO-SOURCE
> Task :streams:upgrade-system-tests-21:test
> Task :streams:upgrade-system-tests-22:compileJava NO-SOURCE
> Task :streams:upgrade-system-tests-22:processResources NO-SOURCE
> Task :streams:upgrade-system-tests-22:classes UP-TO-DATE
> Task :streams:upgrade-system-tests-22:checkstyleMain NO-SOURCE
> Task :streams:upgrade-system-tests-22:compileTestJava
> Task :streams:upgrade-system-tests-22:processTestResources NO-SOURCE
> Task :streams:upgrade-system-tests-22:testClasses
> Task :streams:upgrade-system-tests-22:checkstyleTest
> Task :streams:upgrade-system-tests-22:spotbugsMain NO-SOURCE
> Task :streams:upgrade-system-tests-22:test
> Task :streams:upgrade-system-tests-23:compileJava NO-SOURCE
> Task :streams:upgrade-system-tests-23:processResources NO-SOURCE
> Task :streams:upgrade-system-tests-23:classes UP-TO-DATE
> Task :streams:upgrade-system-tests-23:checkstyleMain NO-SOURCE
> Task :streams:upgrade-system-tests-23:compileTestJava
> Task :streams:upgrade-system-tests-23:processTestResources NO-SOURCE
> Task :streams:upgrade-system-tests-23:testClasses
> Task :streams:upgrade-system-tests-23:checkstyleTest
> Task :streams:upgrade-system-tests-23:spotbugsMain NO-SOURCE
> Task :streams:upgrade-system-tests-23:test
> Task :streams:upgrade-system-tests-24:compileJava NO-SOURCE
> Task :streams:upgrade-system-tests-24:processResources NO-SOURCE
> Task :streams:upgrade-system-tests-24:classes UP-TO-DATE
> Task :streams:upgrade-system-tests-24:checkstyleMain NO-SOURCE
> Task :streams:upgrade-system-tests-24:compileTestJava
> Task :streams:upgrade-system-tests-24:processTestResources NO-SOURCE
> Task :streams:upgrade-system-tests-24:testClasses
> Task :streams:upgrade-system-tests-24:checkstyleTest
> Task :streams:upgrade-system-tests-24:spotbugsMain NO-SOURCE
> Task :streams:upgrade-system-tests-24:test
> Task :streams:upgrade-system-tests-25:compileJava NO-SOURCE
> Task :streams:upgrade-system-tests-25:processResources NO-SOURCE
> Task :streams:upgrade-system-tests-25:classes UP-TO-DATE
> Task :streams:upgrade-system-tests-25:checkstyleMain NO-SOURCE
> Task :streams:upgrade-system-tests-25:compileTestJava
> Task :streams:upgrade-system-tests-25:processTestResources NO-SOURCE
> Task :streams:upgrade-system-tests-25:testClasses
> Task :streams:upgrade-system-tests-25:checkstyleTest
> Task :streams:upgrade-system-tests-25:spotbugsMain NO-SOURCE
> Task :streams:upgrade-system-tests-25:test

FAILURE: Build failed with an exception.

* What went wrong:
Execution failed for task ':connect:mirror:test'.
> There were failing tests. See the report at: file://<https://builds.apache.org/job/kafka-trunk-jdk11/ws/connect/mirror/build/reports/tests/test/index.html>

* Try:
Run with --stacktrace option to get the stack trace. Run with --info or --debug option to get more log output. Run with --scan to get full insights.

* Get more help at https://help.gradle.org

Deprecated Gradle features were used in this build, making it incompatible with Gradle 7.0.
Use '--warning-mode all' to show the individual deprecation warnings.
See https://docs.gradle.org/6.5/userguide/command_line_interface.html#sec:command_line_warnings

BUILD FAILED in 1h 54m 46s
215 actionable tasks: 183 executed, 32 up-to-date
Build step 'Execute shell' marked build as failure
Recording test results
ERROR: No tool found matching GRADLE_4_10_2_HOME
Setting GRADLE_4_10_3_HOME=/home/jenkins/tools/gradle/4.10.3
ERROR: No tool found matching GRADLE_4_10_2_HOME
Setting GRADLE_4_10_3_HOME=/home/jenkins/tools/gradle/4.10.3
Not sending mail to unregistered user noreply@github.com

Build failed in Jenkins: kafka-trunk-jdk11 #1581

Posted by Apache Jenkins Server <je...@builds.apache.org>.
See <https://builds.apache.org/job/kafka-trunk-jdk11/1581/display/redirect?page=changes>

Changes:

[github] KAFKA-10167: use the admin client to read end-offset (#8876)


------------------------------------------
[...truncated 6.35 MB...]
org.apache.kafka.streams.TestTopicsTest > testWithHeaders PASSED

org.apache.kafka.streams.TestTopicsTest > testKeyValue STARTED

org.apache.kafka.streams.TestTopicsTest > testKeyValue PASSED

org.apache.kafka.streams.TestTopicsTest > shouldNotAllowToCreateTopicWithNullTopicName STARTED

org.apache.kafka.streams.TestTopicsTest > shouldNotAllowToCreateTopicWithNullTopicName PASSED

org.apache.kafka.streams.test.ConsumerRecordFactoryTest > shouldCreateConsumerRecordsFromKeyValuePairs STARTED

org.apache.kafka.streams.test.ConsumerRecordFactoryTest > shouldCreateConsumerRecordsFromKeyValuePairs PASSED

org.apache.kafka.streams.test.ConsumerRecordFactoryTest > shouldNotAllowToCreateTopicWithNullTopicNameWithNullKeyAndDefaultTimestamp STARTED

org.apache.kafka.streams.test.ConsumerRecordFactoryTest > shouldNotAllowToCreateTopicWithNullTopicNameWithNullKeyAndDefaultTimestamp PASSED

org.apache.kafka.streams.test.ConsumerRecordFactoryTest > shouldRequireCustomTopicNameIfNotDefaultFactoryTopicNameWithDefaultTimestamp STARTED

org.apache.kafka.streams.test.ConsumerRecordFactoryTest > shouldRequireCustomTopicNameIfNotDefaultFactoryTopicNameWithDefaultTimestamp PASSED

org.apache.kafka.streams.test.ConsumerRecordFactoryTest > shouldNotAllowToCreateTopicWithNullTopicNameWithNullKey STARTED

org.apache.kafka.streams.test.ConsumerRecordFactoryTest > shouldNotAllowToCreateTopicWithNullTopicNameWithNullKey PASSED

org.apache.kafka.streams.test.ConsumerRecordFactoryTest > shouldCreateNullKeyConsumerRecordWithOtherTopicNameAndTimestampWithTimetamp STARTED

org.apache.kafka.streams.test.ConsumerRecordFactoryTest > shouldCreateNullKeyConsumerRecordWithOtherTopicNameAndTimestampWithTimetamp PASSED

org.apache.kafka.streams.test.ConsumerRecordFactoryTest > shouldCreateConsumerRecordWithTimestamp STARTED

org.apache.kafka.streams.test.ConsumerRecordFactoryTest > shouldCreateConsumerRecordWithTimestamp PASSED

org.apache.kafka.streams.test.ConsumerRecordFactoryTest > shouldNotAllowToCreateTopicWithNullHeaders STARTED

org.apache.kafka.streams.test.ConsumerRecordFactoryTest > shouldNotAllowToCreateTopicWithNullHeaders PASSED

org.apache.kafka.streams.test.ConsumerRecordFactoryTest > shouldNotAllowToCreateTopicWithNullTopicNameWithDefaultTimestamp STARTED

org.apache.kafka.streams.test.ConsumerRecordFactoryTest > shouldNotAllowToCreateTopicWithNullTopicNameWithDefaultTimestamp PASSED

org.apache.kafka.streams.test.ConsumerRecordFactoryTest > shouldRequireCustomTopicNameIfNotDefaultFactoryTopicName STARTED

org.apache.kafka.streams.test.ConsumerRecordFactoryTest > shouldRequireCustomTopicNameIfNotDefaultFactoryTopicName PASSED

org.apache.kafka.streams.test.ConsumerRecordFactoryTest > shouldRequireCustomTopicNameIfNotDefaultFactoryTopicNameWithNullKey STARTED

org.apache.kafka.streams.test.ConsumerRecordFactoryTest > shouldRequireCustomTopicNameIfNotDefaultFactoryTopicNameWithNullKey PASSED

org.apache.kafka.streams.test.ConsumerRecordFactoryTest > shouldCreateConsumerRecord STARTED

org.apache.kafka.streams.test.ConsumerRecordFactoryTest > shouldCreateConsumerRecord PASSED

org.apache.kafka.streams.test.ConsumerRecordFactoryTest > shouldCreateNullKeyConsumerRecord STARTED

org.apache.kafka.streams.test.ConsumerRecordFactoryTest > shouldCreateNullKeyConsumerRecord PASSED

org.apache.kafka.streams.test.ConsumerRecordFactoryTest > shouldCreateConsumerRecordWithOtherTopicName STARTED

org.apache.kafka.streams.test.ConsumerRecordFactoryTest > shouldCreateConsumerRecordWithOtherTopicName PASSED

org.apache.kafka.streams.test.ConsumerRecordFactoryTest > shouldAdvanceTime STARTED

org.apache.kafka.streams.test.ConsumerRecordFactoryTest > shouldAdvanceTime PASSED

org.apache.kafka.streams.test.ConsumerRecordFactoryTest > shouldNotAllowToCreateTopicWithNullTopicNameWithKeyValuePairs STARTED

org.apache.kafka.streams.test.ConsumerRecordFactoryTest > shouldNotAllowToCreateTopicWithNullTopicNameWithKeyValuePairs PASSED

org.apache.kafka.streams.test.ConsumerRecordFactoryTest > shouldRequireCustomTopicNameIfNotDefaultFactoryTopicNameWithKeyValuePairsAndCustomTimestamps STARTED

org.apache.kafka.streams.test.ConsumerRecordFactoryTest > shouldRequireCustomTopicNameIfNotDefaultFactoryTopicNameWithKeyValuePairsAndCustomTimestamps PASSED

org.apache.kafka.streams.test.ConsumerRecordFactoryTest > shouldRequireCustomTopicNameIfNotDefaultFactoryTopicNameWithKeyValuePairs STARTED

org.apache.kafka.streams.test.ConsumerRecordFactoryTest > shouldRequireCustomTopicNameIfNotDefaultFactoryTopicNameWithKeyValuePairs PASSED

org.apache.kafka.streams.test.ConsumerRecordFactoryTest > shouldCreateConsumerRecordWithOtherTopicNameAndTimestamp STARTED

org.apache.kafka.streams.test.ConsumerRecordFactoryTest > shouldCreateConsumerRecordWithOtherTopicNameAndTimestamp PASSED

org.apache.kafka.streams.test.ConsumerRecordFactoryTest > shouldNotAllowToCreateTopicWithNullTopicNameWithKeyValuePairsAndCustomTimestamps STARTED

org.apache.kafka.streams.test.ConsumerRecordFactoryTest > shouldNotAllowToCreateTopicWithNullTopicNameWithKeyValuePairsAndCustomTimestamps PASSED

org.apache.kafka.streams.test.ConsumerRecordFactoryTest > shouldNotAllowToCreateTopicWithNullTopicName STARTED

org.apache.kafka.streams.test.ConsumerRecordFactoryTest > shouldNotAllowToCreateTopicWithNullTopicName PASSED

org.apache.kafka.streams.test.ConsumerRecordFactoryTest > shouldCreateConsumerRecordsFromKeyValuePairsWithCustomTimestampAndIncrementsAndNotAdvanceTime STARTED

org.apache.kafka.streams.test.ConsumerRecordFactoryTest > shouldCreateConsumerRecordsFromKeyValuePairsWithCustomTimestampAndIncrementsAndNotAdvanceTime PASSED

org.apache.kafka.streams.test.ConsumerRecordFactoryTest > shouldCreateNullKeyConsumerRecordWithTimestampWithTimestamp STARTED

org.apache.kafka.streams.test.ConsumerRecordFactoryTest > shouldCreateNullKeyConsumerRecordWithTimestampWithTimestamp PASSED

org.apache.kafka.streams.test.ConsumerRecordFactoryTest > shouldRequireCustomTopicNameIfNotDefaultFactoryTopicNameWithNullKeyAndDefaultTimestamp STARTED

org.apache.kafka.streams.test.ConsumerRecordFactoryTest > shouldRequireCustomTopicNameIfNotDefaultFactoryTopicNameWithNullKeyAndDefaultTimestamp PASSED

org.apache.kafka.streams.test.ConsumerRecordFactoryTest > shouldCreateConsumerRecordsFromKeyValuePairsWithTimestampAndIncrements STARTED

org.apache.kafka.streams.test.ConsumerRecordFactoryTest > shouldCreateConsumerRecordsFromKeyValuePairsWithTimestampAndIncrements PASSED

org.apache.kafka.streams.MockTimeTest > shouldGetNanosAsMillis STARTED

org.apache.kafka.streams.MockTimeTest > shouldGetNanosAsMillis PASSED

org.apache.kafka.streams.MockTimeTest > shouldSetStartTime STARTED

org.apache.kafka.streams.MockTimeTest > shouldSetStartTime PASSED

org.apache.kafka.streams.MockTimeTest > shouldNotAllowNegativeSleep STARTED

org.apache.kafka.streams.MockTimeTest > shouldNotAllowNegativeSleep PASSED

org.apache.kafka.streams.MockTimeTest > shouldAdvanceTimeOnSleep STARTED

org.apache.kafka.streams.MockTimeTest > shouldAdvanceTimeOnSleep PASSED

org.apache.kafka.streams.internals.KeyValueStoreFacadeTest > shouldReturnIsOpen STARTED

org.apache.kafka.streams.internals.KeyValueStoreFacadeTest > shouldReturnIsOpen PASSED

org.apache.kafka.streams.internals.KeyValueStoreFacadeTest > shouldDeleteAndReturnPlainValue STARTED

org.apache.kafka.streams.internals.KeyValueStoreFacadeTest > shouldDeleteAndReturnPlainValue PASSED

org.apache.kafka.streams.internals.KeyValueStoreFacadeTest > shouldReturnName STARTED

org.apache.kafka.streams.internals.KeyValueStoreFacadeTest > shouldReturnName PASSED

org.apache.kafka.streams.internals.KeyValueStoreFacadeTest > shouldPutWithUnknownTimestamp STARTED

org.apache.kafka.streams.internals.KeyValueStoreFacadeTest > shouldPutWithUnknownTimestamp PASSED

org.apache.kafka.streams.internals.KeyValueStoreFacadeTest > shouldPutAllWithUnknownTimestamp STARTED

org.apache.kafka.streams.internals.KeyValueStoreFacadeTest > shouldPutAllWithUnknownTimestamp PASSED

org.apache.kafka.streams.internals.KeyValueStoreFacadeTest > shouldReturnIsPersistent STARTED

org.apache.kafka.streams.internals.KeyValueStoreFacadeTest > shouldReturnIsPersistent PASSED

org.apache.kafka.streams.internals.KeyValueStoreFacadeTest > shouldPutIfAbsentWithUnknownTimestamp STARTED

org.apache.kafka.streams.internals.KeyValueStoreFacadeTest > shouldPutIfAbsentWithUnknownTimestamp PASSED

org.apache.kafka.streams.internals.KeyValueStoreFacadeTest > shouldForwardClose STARTED

org.apache.kafka.streams.internals.KeyValueStoreFacadeTest > shouldForwardClose PASSED

org.apache.kafka.streams.internals.KeyValueStoreFacadeTest > shouldForwardFlush STARTED

org.apache.kafka.streams.internals.KeyValueStoreFacadeTest > shouldForwardFlush PASSED

org.apache.kafka.streams.internals.KeyValueStoreFacadeTest > shouldForwardInit STARTED

org.apache.kafka.streams.internals.KeyValueStoreFacadeTest > shouldForwardInit PASSED

> Task :streams:upgrade-system-tests-11:spotbugsMain NO-SOURCE
> Task :streams:upgrade-system-tests-11:test
> Task :streams:upgrade-system-tests-20:compileJava NO-SOURCE
> Task :streams:upgrade-system-tests-20:processResources NO-SOURCE
> Task :streams:upgrade-system-tests-20:classes UP-TO-DATE
> Task :streams:upgrade-system-tests-20:checkstyleMain NO-SOURCE
> Task :streams:upgrade-system-tests-20:compileTestJava
> Task :streams:upgrade-system-tests-20:processTestResources NO-SOURCE
> Task :streams:upgrade-system-tests-20:testClasses
> Task :streams:upgrade-system-tests-20:checkstyleTest
> Task :streams:upgrade-system-tests-20:spotbugsMain NO-SOURCE
> Task :streams:upgrade-system-tests-20:test
> Task :streams:upgrade-system-tests-21:compileJava NO-SOURCE
> Task :streams:upgrade-system-tests-21:processResources NO-SOURCE
> Task :streams:upgrade-system-tests-21:classes UP-TO-DATE
> Task :streams:upgrade-system-tests-21:checkstyleMain NO-SOURCE
> Task :streams:upgrade-system-tests-21:compileTestJava
> Task :streams:upgrade-system-tests-21:processTestResources NO-SOURCE
> Task :streams:upgrade-system-tests-21:testClasses
> Task :streams:upgrade-system-tests-21:checkstyleTest
> Task :streams:upgrade-system-tests-21:spotbugsMain NO-SOURCE
> Task :streams:upgrade-system-tests-21:test
> Task :streams:upgrade-system-tests-22:compileJava NO-SOURCE
> Task :streams:upgrade-system-tests-22:processResources NO-SOURCE
> Task :streams:upgrade-system-tests-22:classes UP-TO-DATE
> Task :streams:upgrade-system-tests-22:checkstyleMain NO-SOURCE
> Task :streams:upgrade-system-tests-22:compileTestJava
> Task :streams:upgrade-system-tests-22:processTestResources NO-SOURCE
> Task :streams:upgrade-system-tests-22:testClasses
> Task :streams:upgrade-system-tests-22:checkstyleTest
> Task :streams:upgrade-system-tests-22:spotbugsMain NO-SOURCE
> Task :streams:upgrade-system-tests-22:test
> Task :streams:upgrade-system-tests-23:compileJava NO-SOURCE
> Task :streams:upgrade-system-tests-23:processResources NO-SOURCE
> Task :streams:upgrade-system-tests-23:classes UP-TO-DATE
> Task :streams:upgrade-system-tests-23:checkstyleMain NO-SOURCE
> Task :streams:upgrade-system-tests-23:compileTestJava
> Task :streams:upgrade-system-tests-23:processTestResources NO-SOURCE
> Task :streams:upgrade-system-tests-23:testClasses
> Task :streams:upgrade-system-tests-23:checkstyleTest
> Task :streams:upgrade-system-tests-23:spotbugsMain NO-SOURCE
> Task :streams:upgrade-system-tests-23:test
> Task :streams:upgrade-system-tests-24:compileJava NO-SOURCE
> Task :streams:upgrade-system-tests-24:processResources NO-SOURCE
> Task :streams:upgrade-system-tests-24:classes UP-TO-DATE
> Task :streams:upgrade-system-tests-24:checkstyleMain NO-SOURCE
> Task :streams:upgrade-system-tests-24:compileTestJava
> Task :streams:upgrade-system-tests-24:processTestResources NO-SOURCE
> Task :streams:upgrade-system-tests-24:testClasses
> Task :streams:upgrade-system-tests-24:checkstyleTest
> Task :streams:upgrade-system-tests-24:spotbugsMain NO-SOURCE
> Task :streams:upgrade-system-tests-24:test
> Task :streams:upgrade-system-tests-25:compileJava NO-SOURCE
> Task :streams:upgrade-system-tests-25:processResources NO-SOURCE
> Task :streams:upgrade-system-tests-25:classes UP-TO-DATE
> Task :streams:upgrade-system-tests-25:checkstyleMain NO-SOURCE
> Task :streams:upgrade-system-tests-25:compileTestJava
> Task :streams:upgrade-system-tests-25:processTestResources NO-SOURCE
> Task :streams:upgrade-system-tests-25:testClasses
> Task :streams:upgrade-system-tests-25:checkstyleTest
> Task :streams:upgrade-system-tests-25:spotbugsMain NO-SOURCE
> Task :streams:upgrade-system-tests-25:test

FAILURE: Build failed with an exception.

* What went wrong:
Execution failed for task ':connect:mirror:test'.
> There were failing tests. See the report at: file://<https://builds.apache.org/job/kafka-trunk-jdk11/ws/connect/mirror/build/reports/tests/test/index.html>

* Try:
Run with --stacktrace option to get the stack trace. Run with --info or --debug option to get more log output. Run with --scan to get full insights.

* Get more help at https://help.gradle.org

Deprecated Gradle features were used in this build, making it incompatible with Gradle 7.0.
Use '--warning-mode all' to show the individual deprecation warnings.
See https://docs.gradle.org/6.5/userguide/command_line_interface.html#sec:command_line_warnings

BUILD FAILED in 2h 1m 39s
215 actionable tasks: 210 executed, 5 up-to-date
Build step 'Execute shell' marked build as failure
Recording test results
ERROR: No tool found matching GRADLE_4_10_2_HOME
Setting GRADLE_4_10_3_HOME=/home/jenkins/tools/gradle/4.10.3
ERROR: No tool found matching GRADLE_4_10_2_HOME
Setting GRADLE_4_10_3_HOME=/home/jenkins/tools/gradle/4.10.3
Not sending mail to unregistered user noreply@github.com

Build failed in Jenkins: kafka-trunk-jdk11 #1580

Posted by Apache Jenkins Server <je...@builds.apache.org>.
See <https://builds.apache.org/job/kafka-trunk-jdk11/1580/display/redirect?page=changes>

Changes:

[github] MINOR: Upgrade ducktape to 0.7.8 (#8879)


------------------------------------------
[...truncated 3.18 MB...]

org.apache.kafka.streams.test.ConsumerRecordFactoryTest > shouldCreateNullKeyConsumerRecord STARTED

org.apache.kafka.streams.test.ConsumerRecordFactoryTest > shouldCreateNullKeyConsumerRecord PASSED

org.apache.kafka.streams.test.ConsumerRecordFactoryTest > shouldCreateConsumerRecordWithOtherTopicName STARTED

org.apache.kafka.streams.test.ConsumerRecordFactoryTest > shouldCreateConsumerRecordWithOtherTopicName PASSED

org.apache.kafka.streams.test.ConsumerRecordFactoryTest > shouldAdvanceTime STARTED

org.apache.kafka.streams.test.ConsumerRecordFactoryTest > shouldAdvanceTime PASSED

org.apache.kafka.streams.test.ConsumerRecordFactoryTest > shouldNotAllowToCreateTopicWithNullTopicNameWithKeyValuePairs STARTED

org.apache.kafka.streams.test.ConsumerRecordFactoryTest > shouldNotAllowToCreateTopicWithNullTopicNameWithKeyValuePairs PASSED

org.apache.kafka.streams.test.ConsumerRecordFactoryTest > shouldRequireCustomTopicNameIfNotDefaultFactoryTopicNameWithKeyValuePairsAndCustomTimestamps STARTED

org.apache.kafka.streams.test.ConsumerRecordFactoryTest > shouldRequireCustomTopicNameIfNotDefaultFactoryTopicNameWithKeyValuePairsAndCustomTimestamps PASSED

org.apache.kafka.streams.test.ConsumerRecordFactoryTest > shouldRequireCustomTopicNameIfNotDefaultFactoryTopicNameWithKeyValuePairs STARTED

org.apache.kafka.streams.test.ConsumerRecordFactoryTest > shouldRequireCustomTopicNameIfNotDefaultFactoryTopicNameWithKeyValuePairs PASSED

org.apache.kafka.streams.test.ConsumerRecordFactoryTest > shouldCreateConsumerRecordWithOtherTopicNameAndTimestamp STARTED

org.apache.kafka.streams.test.ConsumerRecordFactoryTest > shouldCreateConsumerRecordWithOtherTopicNameAndTimestamp PASSED

org.apache.kafka.streams.test.ConsumerRecordFactoryTest > shouldNotAllowToCreateTopicWithNullTopicNameWithKeyValuePairsAndCustomTimestamps STARTED

org.apache.kafka.streams.test.ConsumerRecordFactoryTest > shouldNotAllowToCreateTopicWithNullTopicNameWithKeyValuePairsAndCustomTimestamps PASSED

org.apache.kafka.streams.test.ConsumerRecordFactoryTest > shouldNotAllowToCreateTopicWithNullTopicName STARTED

org.apache.kafka.streams.test.ConsumerRecordFactoryTest > shouldNotAllowToCreateTopicWithNullTopicName PASSED

org.apache.kafka.streams.test.ConsumerRecordFactoryTest > shouldCreateConsumerRecordsFromKeyValuePairsWithCustomTimestampAndIncrementsAndNotAdvanceTime STARTED

org.apache.kafka.streams.test.ConsumerRecordFactoryTest > shouldCreateConsumerRecordsFromKeyValuePairsWithCustomTimestampAndIncrementsAndNotAdvanceTime PASSED

org.apache.kafka.streams.test.ConsumerRecordFactoryTest > shouldCreateNullKeyConsumerRecordWithTimestampWithTimestamp STARTED

org.apache.kafka.streams.test.ConsumerRecordFactoryTest > shouldCreateNullKeyConsumerRecordWithTimestampWithTimestamp PASSED

org.apache.kafka.streams.test.ConsumerRecordFactoryTest > shouldRequireCustomTopicNameIfNotDefaultFactoryTopicNameWithNullKeyAndDefaultTimestamp STARTED

org.apache.kafka.streams.test.ConsumerRecordFactoryTest > shouldRequireCustomTopicNameIfNotDefaultFactoryTopicNameWithNullKeyAndDefaultTimestamp PASSED

org.apache.kafka.streams.test.ConsumerRecordFactoryTest > shouldCreateConsumerRecordsFromKeyValuePairsWithTimestampAndIncrements STARTED

org.apache.kafka.streams.test.ConsumerRecordFactoryTest > shouldCreateConsumerRecordsFromKeyValuePairsWithTimestampAndIncrements PASSED

org.apache.kafka.streams.MockTimeTest > shouldGetNanosAsMillis STARTED

org.apache.kafka.streams.MockTimeTest > shouldGetNanosAsMillis PASSED

org.apache.kafka.streams.MockTimeTest > shouldSetStartTime STARTED

org.apache.kafka.streams.MockTimeTest > shouldSetStartTime PASSED

org.apache.kafka.streams.MockTimeTest > shouldNotAllowNegativeSleep STARTED

org.apache.kafka.streams.MockTimeTest > shouldNotAllowNegativeSleep PASSED

org.apache.kafka.streams.MockTimeTest > shouldAdvanceTimeOnSleep STARTED

org.apache.kafka.streams.MockTimeTest > shouldAdvanceTimeOnSleep PASSED

org.apache.kafka.streams.internals.KeyValueStoreFacadeTest > shouldReturnIsOpen STARTED

org.apache.kafka.streams.internals.KeyValueStoreFacadeTest > shouldReturnIsOpen PASSED

org.apache.kafka.streams.internals.KeyValueStoreFacadeTest > shouldDeleteAndReturnPlainValue STARTED

org.apache.kafka.streams.internals.KeyValueStoreFacadeTest > shouldDeleteAndReturnPlainValue PASSED

org.apache.kafka.streams.internals.KeyValueStoreFacadeTest > shouldReturnName STARTED

org.apache.kafka.streams.internals.KeyValueStoreFacadeTest > shouldReturnName PASSED

org.apache.kafka.streams.internals.KeyValueStoreFacadeTest > shouldPutWithUnknownTimestamp STARTED

org.apache.kafka.streams.internals.KeyValueStoreFacadeTest > shouldPutWithUnknownTimestamp PASSED

org.apache.kafka.streams.internals.KeyValueStoreFacadeTest > shouldPutAllWithUnknownTimestamp STARTED

org.apache.kafka.streams.internals.KeyValueStoreFacadeTest > shouldPutAllWithUnknownTimestamp PASSED

org.apache.kafka.streams.internals.KeyValueStoreFacadeTest > shouldReturnIsPersistent STARTED

org.apache.kafka.streams.internals.KeyValueStoreFacadeTest > shouldReturnIsPersistent PASSED

org.apache.kafka.streams.internals.KeyValueStoreFacadeTest > shouldPutIfAbsentWithUnknownTimestamp STARTED

org.apache.kafka.streams.internals.KeyValueStoreFacadeTest > shouldPutIfAbsentWithUnknownTimestamp PASSED

org.apache.kafka.streams.internals.KeyValueStoreFacadeTest > shouldForwardClose STARTED

org.apache.kafka.streams.internals.KeyValueStoreFacadeTest > shouldForwardClose PASSED

org.apache.kafka.streams.internals.KeyValueStoreFacadeTest > shouldForwardFlush STARTED

org.apache.kafka.streams.internals.KeyValueStoreFacadeTest > shouldForwardFlush PASSED

org.apache.kafka.streams.internals.KeyValueStoreFacadeTest > shouldForwardInit STARTED

org.apache.kafka.streams.internals.KeyValueStoreFacadeTest > shouldForwardInit PASSED

> Task :streams:upgrade-system-tests-0101:spotbugsMain NO-SOURCE
> Task :streams:upgrade-system-tests-0101:test
> Task :streams:upgrade-system-tests-0102:compileJava NO-SOURCE
> Task :streams:upgrade-system-tests-0102:processResources NO-SOURCE
> Task :streams:upgrade-system-tests-0102:classes UP-TO-DATE
> Task :streams:upgrade-system-tests-0102:checkstyleMain NO-SOURCE
> Task :streams:upgrade-system-tests-0102:compileTestJava
> Task :streams:upgrade-system-tests-0102:processTestResources NO-SOURCE
> Task :streams:upgrade-system-tests-0102:testClasses
> Task :streams:upgrade-system-tests-0102:checkstyleTest
> Task :streams:upgrade-system-tests-0102:spotbugsMain NO-SOURCE
> Task :streams:upgrade-system-tests-0102:test
> Task :streams:upgrade-system-tests-0110:compileJava NO-SOURCE
> Task :streams:upgrade-system-tests-0110:processResources NO-SOURCE
> Task :streams:upgrade-system-tests-0110:classes UP-TO-DATE
> Task :streams:upgrade-system-tests-0110:checkstyleMain NO-SOURCE
> Task :streams:upgrade-system-tests-0110:compileTestJava
> Task :streams:upgrade-system-tests-0110:processTestResources NO-SOURCE
> Task :streams:upgrade-system-tests-0110:testClasses
> Task :streams:upgrade-system-tests-0110:checkstyleTest
> Task :streams:upgrade-system-tests-0110:spotbugsMain NO-SOURCE
> Task :streams:upgrade-system-tests-0110:test
> Task :streams:upgrade-system-tests-10:compileJava NO-SOURCE
> Task :streams:upgrade-system-tests-10:processResources NO-SOURCE
> Task :streams:upgrade-system-tests-10:classes UP-TO-DATE
> Task :streams:upgrade-system-tests-10:checkstyleMain NO-SOURCE
> Task :streams:upgrade-system-tests-10:compileTestJava
> Task :streams:upgrade-system-tests-10:processTestResources NO-SOURCE
> Task :streams:upgrade-system-tests-10:testClasses
> Task :streams:upgrade-system-tests-10:checkstyleTest
> Task :streams:upgrade-system-tests-10:spotbugsMain NO-SOURCE
> Task :streams:upgrade-system-tests-10:test
> Task :streams:upgrade-system-tests-11:compileJava NO-SOURCE
> Task :streams:upgrade-system-tests-11:processResources NO-SOURCE
> Task :streams:upgrade-system-tests-11:classes UP-TO-DATE
> Task :streams:upgrade-system-tests-11:checkstyleMain NO-SOURCE
> Task :streams:upgrade-system-tests-11:compileTestJava
> Task :streams:upgrade-system-tests-11:processTestResources NO-SOURCE
> Task :streams:upgrade-system-tests-11:testClasses
> Task :streams:upgrade-system-tests-11:checkstyleTest
> Task :streams:upgrade-system-tests-11:spotbugsMain NO-SOURCE
> Task :streams:upgrade-system-tests-11:test
> Task :streams:upgrade-system-tests-20:compileJava NO-SOURCE
> Task :streams:upgrade-system-tests-20:processResources NO-SOURCE
> Task :streams:upgrade-system-tests-20:classes UP-TO-DATE
> Task :streams:upgrade-system-tests-20:checkstyleMain NO-SOURCE
> Task :streams:upgrade-system-tests-20:compileTestJava
> Task :streams:upgrade-system-tests-20:processTestResources NO-SOURCE
> Task :streams:upgrade-system-tests-20:testClasses
> Task :streams:upgrade-system-tests-20:checkstyleTest
> Task :streams:upgrade-system-tests-20:spotbugsMain NO-SOURCE
> Task :streams:upgrade-system-tests-20:test
> Task :streams:upgrade-system-tests-21:compileJava NO-SOURCE
> Task :streams:upgrade-system-tests-21:processResources NO-SOURCE
> Task :streams:upgrade-system-tests-21:classes UP-TO-DATE
> Task :streams:upgrade-system-tests-21:checkstyleMain NO-SOURCE
> Task :streams:upgrade-system-tests-21:compileTestJava
> Task :streams:upgrade-system-tests-21:processTestResources NO-SOURCE
> Task :streams:upgrade-system-tests-21:testClasses
> Task :streams:upgrade-system-tests-21:checkstyleTest
> Task :streams:upgrade-system-tests-21:spotbugsMain NO-SOURCE
> Task :streams:upgrade-system-tests-21:test
> Task :streams:upgrade-system-tests-22:compileJava NO-SOURCE
> Task :streams:upgrade-system-tests-22:processResources NO-SOURCE
> Task :streams:upgrade-system-tests-22:classes UP-TO-DATE
> Task :streams:upgrade-system-tests-22:checkstyleMain NO-SOURCE
> Task :streams:upgrade-system-tests-22:compileTestJava
> Task :streams:upgrade-system-tests-22:processTestResources NO-SOURCE
> Task :streams:upgrade-system-tests-22:testClasses
> Task :streams:upgrade-system-tests-22:checkstyleTest
> Task :streams:upgrade-system-tests-22:spotbugsMain NO-SOURCE
> Task :streams:upgrade-system-tests-22:test
> Task :streams:upgrade-system-tests-23:compileJava NO-SOURCE
> Task :streams:upgrade-system-tests-23:processResources NO-SOURCE
> Task :streams:upgrade-system-tests-23:classes UP-TO-DATE
> Task :streams:upgrade-system-tests-23:checkstyleMain NO-SOURCE
> Task :streams:upgrade-system-tests-23:compileTestJava
> Task :streams:upgrade-system-tests-23:processTestResources NO-SOURCE
> Task :streams:upgrade-system-tests-23:testClasses
> Task :streams:upgrade-system-tests-23:checkstyleTest
> Task :streams:upgrade-system-tests-23:spotbugsMain NO-SOURCE
> Task :streams:upgrade-system-tests-23:test
> Task :streams:upgrade-system-tests-24:compileJava NO-SOURCE
> Task :streams:upgrade-system-tests-24:processResources NO-SOURCE
> Task :streams:upgrade-system-tests-24:classes UP-TO-DATE
> Task :streams:upgrade-system-tests-24:checkstyleMain NO-SOURCE
> Task :streams:upgrade-system-tests-24:compileTestJava
> Task :streams:upgrade-system-tests-24:processTestResources NO-SOURCE
> Task :streams:upgrade-system-tests-24:testClasses
> Task :streams:upgrade-system-tests-24:checkstyleTest
> Task :streams:upgrade-system-tests-24:spotbugsMain NO-SOURCE
> Task :streams:upgrade-system-tests-24:test
> Task :streams:upgrade-system-tests-25:compileJava NO-SOURCE
> Task :streams:upgrade-system-tests-25:processResources NO-SOURCE
> Task :streams:upgrade-system-tests-25:classes UP-TO-DATE
> Task :streams:upgrade-system-tests-25:checkstyleMain NO-SOURCE
> Task :streams:upgrade-system-tests-25:compileTestJava
> Task :streams:upgrade-system-tests-25:processTestResources NO-SOURCE
> Task :streams:upgrade-system-tests-25:testClasses
> Task :streams:upgrade-system-tests-25:checkstyleTest
> Task :streams:upgrade-system-tests-25:spotbugsMain NO-SOURCE
> Task :streams:upgrade-system-tests-25:test

FAILURE: Build completed with 2 failures.

1: Task failed with an exception.
-----------
* What went wrong:
Execution failed for task ':streams:test'.
> There were failing tests. See the report at: file://<https://builds.apache.org/job/kafka-trunk-jdk11/ws/streams/build/reports/tests/test/index.html>

* Try:
Run with --stacktrace option to get the stack trace. Run with --info or --debug option to get more log output. Run with --scan to get full insights.
==============================================================================

2: Task failed with an exception.
-----------
* What went wrong:
Execution failed for task ':connect:mirror:test'.
> There were failing tests. See the report at: file://<https://builds.apache.org/job/kafka-trunk-jdk11/ws/connect/mirror/build/reports/tests/test/index.html>

* Try:
Run with --stacktrace option to get the stack trace. Run with --info or --debug option to get more log output. Run with --scan to get full insights.
==============================================================================

* Get more help at https://help.gradle.org

Deprecated Gradle features were used in this build, making it incompatible with Gradle 7.0.
Use '--warning-mode all' to show the individual deprecation warnings.
See https://docs.gradle.org/6.5/userguide/command_line_interface.html#sec:command_line_warnings

BUILD FAILED in 2h 26m 32s
215 actionable tasks: 183 executed, 32 up-to-date
Build step 'Execute shell' marked build as failure
Recording test results
ERROR: No tool found matching GRADLE_4_10_2_HOME
Setting GRADLE_4_10_3_HOME=/home/jenkins/tools/gradle/4.10.3
ERROR: No tool found matching GRADLE_4_10_2_HOME
Setting GRADLE_4_10_3_HOME=/home/jenkins/tools/gradle/4.10.3
Not sending mail to unregistered user noreply@github.com

Build failed in Jenkins: kafka-trunk-jdk11 #1579

Posted by Apache Jenkins Server <je...@builds.apache.org>.
See <https://builds.apache.org/job/kafka-trunk-jdk11/1579/display/redirect?page=changes>

Changes:

[github] KAFKA-9896: fix flaky StandbyTaskEOSIntegrationTest (#8883)

[github] KAFKA-10123; Fix incorrect value for AWAIT_RESET#hasPosition (#8841)


------------------------------------------
[...truncated 3.18 MB...]

org.apache.kafka.streams.TopologyTestDriverTest > shouldUseSourceSpecificDeserializers[Eos enabled = false] STARTED

org.apache.kafka.streams.TopologyTestDriverTest > shouldUseSourceSpecificDeserializers[Eos enabled = false] PASSED

org.apache.kafka.streams.TopologyTestDriverTest > shouldReturnAllStores[Eos enabled = false] STARTED

org.apache.kafka.streams.TopologyTestDriverTest > shouldReturnAllStores[Eos enabled = false] PASSED

org.apache.kafka.streams.TopologyTestDriverTest > shouldNotCreateStateDirectoryForStatelessTopology[Eos enabled = false] STARTED

org.apache.kafka.streams.TopologyTestDriverTest > shouldNotCreateStateDirectoryForStatelessTopology[Eos enabled = false] PASSED

org.apache.kafka.streams.TopologyTestDriverTest > shouldApplyGlobalUpdatesCorrectlyInRecursiveTopologies[Eos enabled = false] STARTED

org.apache.kafka.streams.TopologyTestDriverTest > shouldApplyGlobalUpdatesCorrectlyInRecursiveTopologies[Eos enabled = false] PASSED

org.apache.kafka.streams.TopologyTestDriverTest > shouldReturnAllStoresNames[Eos enabled = false] STARTED

org.apache.kafka.streams.TopologyTestDriverTest > shouldReturnAllStoresNames[Eos enabled = false] PASSED

org.apache.kafka.streams.TopologyTestDriverTest > shouldPassRecordHeadersIntoSerializersAndDeserializers[Eos enabled = false] STARTED

org.apache.kafka.streams.TopologyTestDriverTest > shouldPassRecordHeadersIntoSerializersAndDeserializers[Eos enabled = false] PASSED

org.apache.kafka.streams.TopologyTestDriverTest > shouldProcessConsumerRecordList[Eos enabled = false] STARTED

org.apache.kafka.streams.TopologyTestDriverTest > shouldProcessConsumerRecordList[Eos enabled = false] PASSED

org.apache.kafka.streams.TopologyTestDriverTest > shouldUseSinkSpecificSerializers[Eos enabled = false] STARTED

org.apache.kafka.streams.TopologyTestDriverTest > shouldUseSinkSpecificSerializers[Eos enabled = false] PASSED

org.apache.kafka.streams.TopologyTestDriverTest > shouldFlushStoreForFirstInput[Eos enabled = false] STARTED

org.apache.kafka.streams.TopologyTestDriverTest > shouldFlushStoreForFirstInput[Eos enabled = false] PASSED

org.apache.kafka.streams.TopologyTestDriverTest > shouldProcessFromSourceThatMatchPattern[Eos enabled = false] STARTED

org.apache.kafka.streams.TopologyTestDriverTest > shouldProcessFromSourceThatMatchPattern[Eos enabled = false] PASSED

org.apache.kafka.streams.TopologyTestDriverTest > shouldCaptureSinkTopicNamesIfWrittenInto[Eos enabled = false] STARTED

org.apache.kafka.streams.TopologyTestDriverTest > shouldCaptureSinkTopicNamesIfWrittenInto[Eos enabled = false] PASSED

org.apache.kafka.streams.TopologyTestDriverTest > shouldUpdateStoreForNewKey[Eos enabled = false] STARTED

org.apache.kafka.streams.TopologyTestDriverTest > shouldUpdateStoreForNewKey[Eos enabled = false] PASSED

org.apache.kafka.streams.TopologyTestDriverTest > shouldSendRecordViaCorrectSourceTopicDeprecated[Eos enabled = false] STARTED

org.apache.kafka.streams.TopologyTestDriverTest > shouldSendRecordViaCorrectSourceTopicDeprecated[Eos enabled = false] PASSED

org.apache.kafka.streams.TopologyTestDriverTest > shouldPunctuateOnWallClockTime[Eos enabled = false] STARTED

org.apache.kafka.streams.TopologyTestDriverTest > shouldPunctuateOnWallClockTime[Eos enabled = false] PASSED

org.apache.kafka.streams.TopologyTestDriverTest > shouldSetRecordMetadata[Eos enabled = false] STARTED

org.apache.kafka.streams.TopologyTestDriverTest > shouldSetRecordMetadata[Eos enabled = false] PASSED

org.apache.kafka.streams.TopologyTestDriverTest > shouldNotUpdateStoreForLargerValue[Eos enabled = false] STARTED

org.apache.kafka.streams.TopologyTestDriverTest > shouldNotUpdateStoreForLargerValue[Eos enabled = false] PASSED

org.apache.kafka.streams.TopologyTestDriverTest > shouldReturnCorrectInMemoryStoreTypeOnly[Eos enabled = false] STARTED

org.apache.kafka.streams.TopologyTestDriverTest > shouldReturnCorrectInMemoryStoreTypeOnly[Eos enabled = false] PASSED

org.apache.kafka.streams.TopologyTestDriverTest > shouldThrowForMissingTime[Eos enabled = false] STARTED

org.apache.kafka.streams.TopologyTestDriverTest > shouldThrowForMissingTime[Eos enabled = false] PASSED

org.apache.kafka.streams.TopologyTestDriverTest > shouldCaptureInternalTopicNamesIfWrittenInto[Eos enabled = false] STARTED

org.apache.kafka.streams.TopologyTestDriverTest > shouldCaptureInternalTopicNamesIfWrittenInto[Eos enabled = false] PASSED

org.apache.kafka.streams.TopologyTestDriverTest > shouldPunctuateOnWallClockTimeDeprecated[Eos enabled = false] STARTED

org.apache.kafka.streams.TopologyTestDriverTest > shouldPunctuateOnWallClockTimeDeprecated[Eos enabled = false] PASSED

org.apache.kafka.streams.TopologyTestDriverTest > shouldProcessRecordForTopic[Eos enabled = false] STARTED

org.apache.kafka.streams.TopologyTestDriverTest > shouldProcessRecordForTopic[Eos enabled = false] PASSED

org.apache.kafka.streams.TopologyTestDriverTest > shouldForwardRecordsFromSubtopologyToSubtopology[Eos enabled = false] STARTED

org.apache.kafka.streams.TopologyTestDriverTest > shouldForwardRecordsFromSubtopologyToSubtopology[Eos enabled = false] PASSED

org.apache.kafka.streams.TopologyTestDriverTest > shouldNotUpdateStoreForSmallerValue[Eos enabled = false] STARTED

org.apache.kafka.streams.TopologyTestDriverTest > shouldNotUpdateStoreForSmallerValue[Eos enabled = false] PASSED

org.apache.kafka.streams.TopologyTestDriverTest > shouldCreateStateDirectoryForStatefulTopology[Eos enabled = false] STARTED

org.apache.kafka.streams.TopologyTestDriverTest > shouldCreateStateDirectoryForStatefulTopology[Eos enabled = false] PASSED

org.apache.kafka.streams.TopologyTestDriverTest > shouldPunctuateIfWallClockTimeAdvances[Eos enabled = false] STARTED

org.apache.kafka.streams.TopologyTestDriverTest > shouldPunctuateIfWallClockTimeAdvances[Eos enabled = false] PASSED

> Task :streams:upgrade-system-tests-0101:compileJava NO-SOURCE
> Task :streams:upgrade-system-tests-0101:processResources NO-SOURCE
> Task :streams:upgrade-system-tests-0101:classes UP-TO-DATE
> Task :streams:upgrade-system-tests-0101:checkstyleMain NO-SOURCE
> Task :streams:upgrade-system-tests-0101:compileTestJava
> Task :streams:upgrade-system-tests-0101:processTestResources NO-SOURCE
> Task :streams:upgrade-system-tests-0101:testClasses
> Task :streams:upgrade-system-tests-0101:checkstyleTest
> Task :streams:upgrade-system-tests-0101:spotbugsMain NO-SOURCE
> Task :streams:upgrade-system-tests-0101:test
> Task :streams:upgrade-system-tests-0102:compileJava NO-SOURCE
> Task :streams:upgrade-system-tests-0102:processResources NO-SOURCE
> Task :streams:upgrade-system-tests-0102:classes UP-TO-DATE
> Task :streams:upgrade-system-tests-0102:checkstyleMain NO-SOURCE
> Task :streams:upgrade-system-tests-0102:compileTestJava
> Task :streams:upgrade-system-tests-0102:processTestResources NO-SOURCE
> Task :streams:upgrade-system-tests-0102:testClasses
> Task :streams:upgrade-system-tests-0102:checkstyleTest
> Task :streams:upgrade-system-tests-0102:spotbugsMain NO-SOURCE
> Task :streams:upgrade-system-tests-0102:test
> Task :streams:upgrade-system-tests-0110:compileJava NO-SOURCE
> Task :streams:upgrade-system-tests-0110:processResources NO-SOURCE
> Task :streams:upgrade-system-tests-0110:classes UP-TO-DATE
> Task :streams:upgrade-system-tests-0110:checkstyleMain NO-SOURCE
> Task :streams:upgrade-system-tests-0110:compileTestJava
> Task :streams:upgrade-system-tests-0110:processTestResources NO-SOURCE
> Task :streams:upgrade-system-tests-0110:testClasses
> Task :streams:upgrade-system-tests-0110:checkstyleTest
> Task :streams:upgrade-system-tests-0110:spotbugsMain NO-SOURCE
> Task :streams:upgrade-system-tests-0110:test
> Task :streams:upgrade-system-tests-10:compileJava NO-SOURCE
> Task :streams:upgrade-system-tests-10:processResources NO-SOURCE
> Task :streams:upgrade-system-tests-10:classes UP-TO-DATE
> Task :streams:upgrade-system-tests-10:checkstyleMain NO-SOURCE
> Task :streams:upgrade-system-tests-10:compileTestJava
> Task :streams:upgrade-system-tests-10:processTestResources NO-SOURCE
> Task :streams:upgrade-system-tests-10:testClasses
> Task :streams:upgrade-system-tests-10:checkstyleTest
> Task :streams:upgrade-system-tests-10:spotbugsMain NO-SOURCE
> Task :streams:upgrade-system-tests-10:test
> Task :streams:upgrade-system-tests-11:compileJava NO-SOURCE
> Task :streams:upgrade-system-tests-11:processResources NO-SOURCE
> Task :streams:upgrade-system-tests-11:classes UP-TO-DATE
> Task :streams:upgrade-system-tests-11:checkstyleMain NO-SOURCE
> Task :streams:upgrade-system-tests-11:compileTestJava
> Task :streams:upgrade-system-tests-11:processTestResources NO-SOURCE
> Task :streams:upgrade-system-tests-11:testClasses
> Task :streams:upgrade-system-tests-11:checkstyleTest
> Task :streams:upgrade-system-tests-11:spotbugsMain NO-SOURCE
> Task :streams:upgrade-system-tests-11:test
> Task :streams:upgrade-system-tests-20:compileJava NO-SOURCE
> Task :streams:upgrade-system-tests-20:processResources NO-SOURCE
> Task :streams:upgrade-system-tests-20:classes UP-TO-DATE
> Task :streams:upgrade-system-tests-20:checkstyleMain NO-SOURCE
> Task :streams:upgrade-system-tests-20:compileTestJava
> Task :streams:upgrade-system-tests-20:processTestResources NO-SOURCE
> Task :streams:upgrade-system-tests-20:testClasses
> Task :streams:upgrade-system-tests-20:checkstyleTest
> Task :streams:upgrade-system-tests-20:spotbugsMain NO-SOURCE
> Task :streams:upgrade-system-tests-20:test
> Task :streams:upgrade-system-tests-21:compileJava NO-SOURCE
> Task :streams:upgrade-system-tests-21:processResources NO-SOURCE
> Task :streams:upgrade-system-tests-21:classes UP-TO-DATE
> Task :streams:upgrade-system-tests-21:checkstyleMain NO-SOURCE
> Task :streams:upgrade-system-tests-21:compileTestJava
> Task :streams:upgrade-system-tests-21:processTestResources NO-SOURCE
> Task :streams:upgrade-system-tests-21:testClasses
> Task :streams:upgrade-system-tests-21:checkstyleTest
> Task :streams:upgrade-system-tests-21:spotbugsMain NO-SOURCE
> Task :streams:upgrade-system-tests-21:test
> Task :streams:upgrade-system-tests-22:compileJava NO-SOURCE
> Task :streams:upgrade-system-tests-22:processResources NO-SOURCE
> Task :streams:upgrade-system-tests-22:classes UP-TO-DATE
> Task :streams:upgrade-system-tests-22:checkstyleMain NO-SOURCE
> Task :streams:upgrade-system-tests-22:compileTestJava
> Task :streams:upgrade-system-tests-22:processTestResources NO-SOURCE
> Task :streams:upgrade-system-tests-22:testClasses
> Task :streams:upgrade-system-tests-22:checkstyleTest
> Task :streams:upgrade-system-tests-22:spotbugsMain NO-SOURCE
> Task :streams:upgrade-system-tests-22:test
> Task :streams:upgrade-system-tests-23:compileJava NO-SOURCE
> Task :streams:upgrade-system-tests-23:processResources NO-SOURCE
> Task :streams:upgrade-system-tests-23:classes UP-TO-DATE
> Task :streams:upgrade-system-tests-23:checkstyleMain NO-SOURCE
> Task :streams:upgrade-system-tests-23:compileTestJava
> Task :streams:upgrade-system-tests-23:processTestResources NO-SOURCE
> Task :streams:upgrade-system-tests-23:testClasses
> Task :streams:upgrade-system-tests-23:checkstyleTest
> Task :streams:upgrade-system-tests-23:spotbugsMain NO-SOURCE
> Task :streams:upgrade-system-tests-23:test
> Task :streams:upgrade-system-tests-24:compileJava NO-SOURCE
> Task :streams:upgrade-system-tests-24:processResources NO-SOURCE
> Task :streams:upgrade-system-tests-24:classes UP-TO-DATE
> Task :streams:upgrade-system-tests-24:checkstyleMain NO-SOURCE
> Task :streams:upgrade-system-tests-24:compileTestJava
> Task :streams:upgrade-system-tests-24:processTestResources NO-SOURCE
> Task :streams:upgrade-system-tests-24:testClasses
> Task :streams:upgrade-system-tests-24:checkstyleTest
> Task :streams:upgrade-system-tests-24:spotbugsMain NO-SOURCE
> Task :streams:upgrade-system-tests-24:test
> Task :streams:upgrade-system-tests-25:compileJava NO-SOURCE
> Task :streams:upgrade-system-tests-25:processResources NO-SOURCE
> Task :streams:upgrade-system-tests-25:classes UP-TO-DATE
> Task :streams:upgrade-system-tests-25:checkstyleMain NO-SOURCE
> Task :streams:upgrade-system-tests-25:compileTestJava
> Task :streams:upgrade-system-tests-25:processTestResources NO-SOURCE
> Task :streams:upgrade-system-tests-25:testClasses
> Task :streams:upgrade-system-tests-25:checkstyleTest
> Task :streams:upgrade-system-tests-25:spotbugsMain NO-SOURCE
> Task :streams:upgrade-system-tests-25:test

FAILURE: Build completed with 2 failures.

1: Task failed with an exception.
-----------
* What went wrong:
Execution failed for task ':connect:mirror:test'.
> There were failing tests. See the report at: file://<https://builds.apache.org/job/kafka-trunk-jdk11/ws/connect/mirror/build/reports/tests/test/index.html>

* Try:
Run with --stacktrace option to get the stack trace. Run with --info or --debug option to get more log output. Run with --scan to get full insights.
==============================================================================

2: Task failed with an exception.
-----------
* What went wrong:
Execution failed for task ':connect:runtime:test'.
> There were failing tests. See the report at: file://<https://builds.apache.org/job/kafka-trunk-jdk11/ws/connect/runtime/build/reports/tests/test/index.html>

* Try:
Run with --stacktrace option to get the stack trace. Run with --info or --debug option to get more log output. Run with --scan to get full insights.
==============================================================================

* Get more help at https://help.gradle.org

Deprecated Gradle features were used in this build, making it incompatible with Gradle 7.0.
Use '--warning-mode all' to show the individual deprecation warnings.
See https://docs.gradle.org/6.5/userguide/command_line_interface.html#sec:command_line_warnings

BUILD FAILED in 2h 4m 42s
215 actionable tasks: 183 executed, 32 up-to-date
Build step 'Execute shell' marked build as failure
Recording test results
ERROR: No tool found matching GRADLE_4_10_2_HOME
Setting GRADLE_4_10_3_HOME=/home/jenkins/tools/gradle/4.10.3
ERROR: No tool found matching GRADLE_4_10_2_HOME
Setting GRADLE_4_10_3_HOME=/home/jenkins/tools/gradle/4.10.3
Not sending mail to unregistered user noreply@github.com

Build failed in Jenkins: kafka-trunk-jdk11 #1578

Posted by Apache Jenkins Server <je...@builds.apache.org>.
See <https://builds.apache.org/job/kafka-trunk-jdk11/1578/display/redirect?page=changes>

Changes:

[github] MINOR: clean up unused checkstyle suppressions for Streams (#8861)


------------------------------------------
[...truncated 3.17 MB...]

org.apache.kafka.streams.TopologyTestDriverTest > shouldPopulateGlobalStore[Eos enabled = false] PASSED

org.apache.kafka.streams.TopologyTestDriverTest > shouldThrowIfPersistentBuiltInStoreIsAccessedWithUntypedMethod[Eos enabled = false] STARTED

org.apache.kafka.streams.TopologyTestDriverTest > shouldThrowIfPersistentBuiltInStoreIsAccessedWithUntypedMethod[Eos enabled = false] PASSED

org.apache.kafka.streams.TopologyTestDriverTest > shouldAllowPrePopulatingStatesStoresWithCachingEnabled[Eos enabled = false] STARTED

org.apache.kafka.streams.TopologyTestDriverTest > shouldAllowPrePopulatingStatesStoresWithCachingEnabled[Eos enabled = false] PASSED

org.apache.kafka.streams.TopologyTestDriverTest > shouldReturnCorrectPersistentStoreTypeOnly[Eos enabled = false] STARTED

org.apache.kafka.streams.TopologyTestDriverTest > shouldReturnCorrectPersistentStoreTypeOnly[Eos enabled = false] PASSED

org.apache.kafka.streams.TopologyTestDriverTest > shouldRespectTaskIdling[Eos enabled = false] STARTED

org.apache.kafka.streams.TopologyTestDriverTest > shouldRespectTaskIdling[Eos enabled = false] PASSED

org.apache.kafka.streams.TopologyTestDriverTest > shouldUseSourceSpecificDeserializers[Eos enabled = false] STARTED

org.apache.kafka.streams.TopologyTestDriverTest > shouldUseSourceSpecificDeserializers[Eos enabled = false] PASSED

org.apache.kafka.streams.TopologyTestDriverTest > shouldReturnAllStores[Eos enabled = false] STARTED

org.apache.kafka.streams.TopologyTestDriverTest > shouldReturnAllStores[Eos enabled = false] PASSED

org.apache.kafka.streams.TopologyTestDriverTest > shouldNotCreateStateDirectoryForStatelessTopology[Eos enabled = false] STARTED

org.apache.kafka.streams.TopologyTestDriverTest > shouldNotCreateStateDirectoryForStatelessTopology[Eos enabled = false] PASSED

org.apache.kafka.streams.TopologyTestDriverTest > shouldApplyGlobalUpdatesCorrectlyInRecursiveTopologies[Eos enabled = false] STARTED

org.apache.kafka.streams.TopologyTestDriverTest > shouldApplyGlobalUpdatesCorrectlyInRecursiveTopologies[Eos enabled = false] PASSED

org.apache.kafka.streams.TopologyTestDriverTest > shouldReturnAllStoresNames[Eos enabled = false] STARTED

org.apache.kafka.streams.TopologyTestDriverTest > shouldReturnAllStoresNames[Eos enabled = false] PASSED

org.apache.kafka.streams.TopologyTestDriverTest > shouldPassRecordHeadersIntoSerializersAndDeserializers[Eos enabled = false] STARTED

org.apache.kafka.streams.TopologyTestDriverTest > shouldPassRecordHeadersIntoSerializersAndDeserializers[Eos enabled = false] PASSED

org.apache.kafka.streams.TopologyTestDriverTest > shouldProcessConsumerRecordList[Eos enabled = false] STARTED

org.apache.kafka.streams.TopologyTestDriverTest > shouldProcessConsumerRecordList[Eos enabled = false] PASSED

org.apache.kafka.streams.TopologyTestDriverTest > shouldUseSinkSpecificSerializers[Eos enabled = false] STARTED

org.apache.kafka.streams.TopologyTestDriverTest > shouldUseSinkSpecificSerializers[Eos enabled = false] PASSED

org.apache.kafka.streams.TopologyTestDriverTest > shouldFlushStoreForFirstInput[Eos enabled = false] STARTED

org.apache.kafka.streams.TopologyTestDriverTest > shouldFlushStoreForFirstInput[Eos enabled = false] PASSED

org.apache.kafka.streams.TopologyTestDriverTest > shouldProcessFromSourceThatMatchPattern[Eos enabled = false] STARTED

org.apache.kafka.streams.TopologyTestDriverTest > shouldProcessFromSourceThatMatchPattern[Eos enabled = false] PASSED

org.apache.kafka.streams.TopologyTestDriverTest > shouldCaptureSinkTopicNamesIfWrittenInto[Eos enabled = false] STARTED

org.apache.kafka.streams.TopologyTestDriverTest > shouldCaptureSinkTopicNamesIfWrittenInto[Eos enabled = false] PASSED

org.apache.kafka.streams.TopologyTestDriverTest > shouldUpdateStoreForNewKey[Eos enabled = false] STARTED

org.apache.kafka.streams.TopologyTestDriverTest > shouldUpdateStoreForNewKey[Eos enabled = false] PASSED

org.apache.kafka.streams.TopologyTestDriverTest > shouldSendRecordViaCorrectSourceTopicDeprecated[Eos enabled = false] STARTED

org.apache.kafka.streams.TopologyTestDriverTest > shouldSendRecordViaCorrectSourceTopicDeprecated[Eos enabled = false] PASSED

org.apache.kafka.streams.TopologyTestDriverTest > shouldPunctuateOnWallClockTime[Eos enabled = false] STARTED

org.apache.kafka.streams.TopologyTestDriverTest > shouldPunctuateOnWallClockTime[Eos enabled = false] PASSED

org.apache.kafka.streams.TopologyTestDriverTest > shouldSetRecordMetadata[Eos enabled = false] STARTED

org.apache.kafka.streams.TopologyTestDriverTest > shouldSetRecordMetadata[Eos enabled = false] PASSED

org.apache.kafka.streams.TopologyTestDriverTest > shouldNotUpdateStoreForLargerValue[Eos enabled = false] STARTED

org.apache.kafka.streams.TopologyTestDriverTest > shouldNotUpdateStoreForLargerValue[Eos enabled = false] PASSED

org.apache.kafka.streams.TopologyTestDriverTest > shouldReturnCorrectInMemoryStoreTypeOnly[Eos enabled = false] STARTED

org.apache.kafka.streams.TopologyTestDriverTest > shouldReturnCorrectInMemoryStoreTypeOnly[Eos enabled = false] PASSED

org.apache.kafka.streams.TopologyTestDriverTest > shouldThrowForMissingTime[Eos enabled = false] STARTED

org.apache.kafka.streams.TopologyTestDriverTest > shouldThrowForMissingTime[Eos enabled = false] PASSED

org.apache.kafka.streams.TopologyTestDriverTest > shouldCaptureInternalTopicNamesIfWrittenInto[Eos enabled = false] STARTED

org.apache.kafka.streams.TopologyTestDriverTest > shouldCaptureInternalTopicNamesIfWrittenInto[Eos enabled = false] PASSED

org.apache.kafka.streams.TopologyTestDriverTest > shouldPunctuateOnWallClockTimeDeprecated[Eos enabled = false] STARTED

org.apache.kafka.streams.TopologyTestDriverTest > shouldPunctuateOnWallClockTimeDeprecated[Eos enabled = false] PASSED

org.apache.kafka.streams.TopologyTestDriverTest > shouldProcessRecordForTopic[Eos enabled = false] STARTED

org.apache.kafka.streams.TopologyTestDriverTest > shouldProcessRecordForTopic[Eos enabled = false] PASSED

org.apache.kafka.streams.TopologyTestDriverTest > shouldForwardRecordsFromSubtopologyToSubtopology[Eos enabled = false] STARTED

org.apache.kafka.streams.TopologyTestDriverTest > shouldForwardRecordsFromSubtopologyToSubtopology[Eos enabled = false] PASSED

org.apache.kafka.streams.TopologyTestDriverTest > shouldNotUpdateStoreForSmallerValue[Eos enabled = false] STARTED

org.apache.kafka.streams.TopologyTestDriverTest > shouldNotUpdateStoreForSmallerValue[Eos enabled = false] PASSED

org.apache.kafka.streams.TopologyTestDriverTest > shouldCreateStateDirectoryForStatefulTopology[Eos enabled = false] STARTED

org.apache.kafka.streams.TopologyTestDriverTest > shouldCreateStateDirectoryForStatefulTopology[Eos enabled = false] PASSED

org.apache.kafka.streams.TopologyTestDriverTest > shouldPunctuateIfWallClockTimeAdvances[Eos enabled = false] STARTED

org.apache.kafka.streams.TopologyTestDriverTest > shouldPunctuateIfWallClockTimeAdvances[Eos enabled = false] PASSED

> Task :streams:upgrade-system-tests-0101:processTestResources NO-SOURCE
> Task :streams:upgrade-system-tests-0101:testClasses
> Task :streams:upgrade-system-tests-0101:checkstyleTest
> Task :streams:upgrade-system-tests-0101:spotbugsMain NO-SOURCE
> Task :streams:upgrade-system-tests-0101:test
> Task :streams:upgrade-system-tests-0102:compileJava NO-SOURCE
> Task :streams:upgrade-system-tests-0102:processResources NO-SOURCE
> Task :streams:upgrade-system-tests-0102:classes UP-TO-DATE
> Task :streams:upgrade-system-tests-0102:checkstyleMain NO-SOURCE
> Task :streams:upgrade-system-tests-0102:compileTestJava
> Task :streams:upgrade-system-tests-0102:processTestResources NO-SOURCE
> Task :streams:upgrade-system-tests-0102:testClasses
> Task :streams:upgrade-system-tests-0102:checkstyleTest
> Task :streams:upgrade-system-tests-0102:spotbugsMain NO-SOURCE
> Task :streams:upgrade-system-tests-0102:test
> Task :streams:upgrade-system-tests-0110:compileJava NO-SOURCE
> Task :streams:upgrade-system-tests-0110:processResources NO-SOURCE
> Task :streams:upgrade-system-tests-0110:classes UP-TO-DATE
> Task :streams:upgrade-system-tests-0110:checkstyleMain NO-SOURCE
> Task :streams:upgrade-system-tests-0110:compileTestJava
> Task :streams:upgrade-system-tests-0110:processTestResources NO-SOURCE
> Task :streams:upgrade-system-tests-0110:testClasses
> Task :streams:upgrade-system-tests-0110:checkstyleTest
> Task :streams:upgrade-system-tests-0110:spotbugsMain NO-SOURCE
> Task :streams:upgrade-system-tests-0110:test
> Task :streams:upgrade-system-tests-10:compileJava NO-SOURCE
> Task :streams:upgrade-system-tests-10:processResources NO-SOURCE
> Task :streams:upgrade-system-tests-10:classes UP-TO-DATE
> Task :streams:upgrade-system-tests-10:checkstyleMain NO-SOURCE
> Task :streams:upgrade-system-tests-10:compileTestJava
> Task :streams:upgrade-system-tests-10:processTestResources NO-SOURCE
> Task :streams:upgrade-system-tests-10:testClasses
> Task :streams:upgrade-system-tests-10:checkstyleTest
> Task :streams:upgrade-system-tests-10:spotbugsMain NO-SOURCE
> Task :streams:upgrade-system-tests-10:test
> Task :streams:upgrade-system-tests-11:compileJava NO-SOURCE
> Task :streams:upgrade-system-tests-11:processResources NO-SOURCE
> Task :streams:upgrade-system-tests-11:classes UP-TO-DATE
> Task :streams:upgrade-system-tests-11:checkstyleMain NO-SOURCE
> Task :streams:upgrade-system-tests-11:compileTestJava
> Task :streams:upgrade-system-tests-11:processTestResources NO-SOURCE
> Task :streams:upgrade-system-tests-11:testClasses
> Task :streams:upgrade-system-tests-11:checkstyleTest
> Task :streams:upgrade-system-tests-11:spotbugsMain NO-SOURCE
> Task :streams:upgrade-system-tests-11:test
> Task :streams:upgrade-system-tests-20:compileJava NO-SOURCE
> Task :streams:upgrade-system-tests-20:processResources NO-SOURCE
> Task :streams:upgrade-system-tests-20:classes UP-TO-DATE
> Task :streams:upgrade-system-tests-20:checkstyleMain NO-SOURCE
> Task :streams:upgrade-system-tests-20:compileTestJava
> Task :streams:upgrade-system-tests-20:processTestResources NO-SOURCE
> Task :streams:upgrade-system-tests-20:testClasses
> Task :streams:upgrade-system-tests-20:checkstyleTest
> Task :streams:upgrade-system-tests-20:spotbugsMain NO-SOURCE
> Task :streams:upgrade-system-tests-20:test
> Task :streams:upgrade-system-tests-21:compileJava NO-SOURCE
> Task :streams:upgrade-system-tests-21:processResources NO-SOURCE
> Task :streams:upgrade-system-tests-21:classes UP-TO-DATE
> Task :streams:upgrade-system-tests-21:checkstyleMain NO-SOURCE
> Task :streams:upgrade-system-tests-21:compileTestJava
> Task :streams:upgrade-system-tests-21:processTestResources NO-SOURCE
> Task :streams:upgrade-system-tests-21:testClasses
> Task :streams:upgrade-system-tests-21:checkstyleTest
> Task :streams:upgrade-system-tests-21:spotbugsMain NO-SOURCE
> Task :streams:upgrade-system-tests-21:test
> Task :streams:upgrade-system-tests-22:compileJava NO-SOURCE
> Task :streams:upgrade-system-tests-22:processResources NO-SOURCE
> Task :streams:upgrade-system-tests-22:classes UP-TO-DATE
> Task :streams:upgrade-system-tests-22:checkstyleMain NO-SOURCE
> Task :streams:upgrade-system-tests-22:compileTestJava
> Task :streams:upgrade-system-tests-22:processTestResources NO-SOURCE
> Task :streams:upgrade-system-tests-22:testClasses
> Task :streams:upgrade-system-tests-22:checkstyleTest
> Task :streams:upgrade-system-tests-22:spotbugsMain NO-SOURCE
> Task :streams:upgrade-system-tests-22:test
> Task :streams:upgrade-system-tests-23:compileJava NO-SOURCE
> Task :streams:upgrade-system-tests-23:processResources NO-SOURCE
> Task :streams:upgrade-system-tests-23:classes UP-TO-DATE
> Task :streams:upgrade-system-tests-23:checkstyleMain NO-SOURCE
> Task :streams:upgrade-system-tests-23:compileTestJava
> Task :streams:upgrade-system-tests-23:processTestResources NO-SOURCE
> Task :streams:upgrade-system-tests-23:testClasses
> Task :streams:upgrade-system-tests-23:checkstyleTest
> Task :streams:upgrade-system-tests-23:spotbugsMain NO-SOURCE
> Task :streams:upgrade-system-tests-23:test
> Task :streams:upgrade-system-tests-24:compileJava NO-SOURCE
> Task :streams:upgrade-system-tests-24:processResources NO-SOURCE
> Task :streams:upgrade-system-tests-24:classes UP-TO-DATE
> Task :streams:upgrade-system-tests-24:checkstyleMain NO-SOURCE
> Task :streams:upgrade-system-tests-24:compileTestJava
> Task :streams:upgrade-system-tests-24:processTestResources NO-SOURCE
> Task :streams:upgrade-system-tests-24:testClasses
> Task :streams:upgrade-system-tests-24:checkstyleTest
> Task :streams:upgrade-system-tests-24:spotbugsMain NO-SOURCE
> Task :streams:upgrade-system-tests-24:test
> Task :streams:upgrade-system-tests-25:compileJava NO-SOURCE
> Task :streams:upgrade-system-tests-25:processResources NO-SOURCE
> Task :streams:upgrade-system-tests-25:classes UP-TO-DATE
> Task :streams:upgrade-system-tests-25:checkstyleMain NO-SOURCE
> Task :streams:upgrade-system-tests-25:compileTestJava
> Task :streams:upgrade-system-tests-25:processTestResources NO-SOURCE
> Task :streams:upgrade-system-tests-25:testClasses
> Task :streams:upgrade-system-tests-25:checkstyleTest
> Task :streams:upgrade-system-tests-25:spotbugsMain NO-SOURCE
> Task :streams:upgrade-system-tests-25:test

FAILURE: Build failed with an exception.

* What went wrong:
Execution failed for task ':connect:mirror:test'.
> There were failing tests. See the report at: file://<https://builds.apache.org/job/kafka-trunk-jdk11/ws/connect/mirror/build/reports/tests/test/index.html>

* Try:
Run with --stacktrace option to get the stack trace. Run with --info or --debug option to get more log output. Run with --scan to get full insights.

* Get more help at https://help.gradle.org

Deprecated Gradle features were used in this build, making it incompatible with Gradle 7.0.
Use '--warning-mode all' to show the individual deprecation warnings.
See https://docs.gradle.org/6.5/userguide/command_line_interface.html#sec:command_line_warnings

BUILD FAILED in 1h 57m 58s
215 actionable tasks: 183 executed, 32 up-to-date
Build step 'Execute shell' marked build as failure
Recording test results
ERROR: No tool found matching GRADLE_4_10_2_HOME
Setting GRADLE_4_10_3_HOME=/home/jenkins/tools/gradle/4.10.3
ERROR: No tool found matching GRADLE_4_10_2_HOME
Setting GRADLE_4_10_3_HOME=/home/jenkins/tools/gradle/4.10.3
Not sending mail to unregistered user noreply@github.com

Build failed in Jenkins: kafka-trunk-jdk11 #1577

Posted by Apache Jenkins Server <je...@builds.apache.org>.
See <https://builds.apache.org/job/kafka-trunk-jdk11/1577/display/redirect?page=changes>

Changes:

[github] MINOR: reuse toConfigObject(Map) to generate Config (#8889)


------------------------------------------
[...truncated 6.35 MB...]
org.apache.kafka.streams.test.OutputVerifierTest > shouldPassIfKeyAndValueAndTimestampIsEqualForCompareKeyValueTimestampWithProducerRecord STARTED

org.apache.kafka.streams.test.OutputVerifierTest > shouldPassIfKeyAndValueAndTimestampIsEqualForCompareKeyValueTimestampWithProducerRecord PASSED

org.apache.kafka.streams.test.OutputVerifierTest > shouldPassIfValueIsEqualWithNullForCompareValue STARTED

org.apache.kafka.streams.test.OutputVerifierTest > shouldPassIfValueIsEqualWithNullForCompareValue PASSED

org.apache.kafka.streams.test.OutputVerifierTest > shouldPassIfValueAndTimestampIsEqualWithNullForCompareValueTimestamp STARTED

org.apache.kafka.streams.test.OutputVerifierTest > shouldPassIfValueAndTimestampIsEqualWithNullForCompareValueTimestamp PASSED

org.apache.kafka.streams.test.OutputVerifierTest > shouldFailIfValueIsDifferentWithNullForCompareValueTimestampWithProducerRecord STARTED

org.apache.kafka.streams.test.OutputVerifierTest > shouldFailIfValueIsDifferentWithNullForCompareValueTimestampWithProducerRecord PASSED

org.apache.kafka.streams.test.OutputVerifierTest > shouldFailIfValueIsDifferentWithNullForCompareValueWithProducerRecord STARTED

org.apache.kafka.streams.test.OutputVerifierTest > shouldFailIfValueIsDifferentWithNullForCompareValueWithProducerRecord PASSED

org.apache.kafka.streams.test.OutputVerifierTest > shouldFailIfKeyIsDifferentWithNullReversForCompareKeyValueTimestampWithProducerRecord STARTED

org.apache.kafka.streams.test.OutputVerifierTest > shouldFailIfKeyIsDifferentWithNullReversForCompareKeyValueTimestampWithProducerRecord PASSED

org.apache.kafka.streams.test.OutputVerifierTest > shouldFailIfKeyIsDifferentWithNullReversForCompareKeyValue STARTED

org.apache.kafka.streams.test.OutputVerifierTest > shouldFailIfKeyIsDifferentWithNullReversForCompareKeyValue PASSED

org.apache.kafka.streams.test.OutputVerifierTest > shouldPassIfKeyAndValueIsEqualForCompareKeyValueWithProducerRecord STARTED

org.apache.kafka.streams.test.OutputVerifierTest > shouldPassIfKeyAndValueIsEqualForCompareKeyValueWithProducerRecord PASSED

org.apache.kafka.streams.test.OutputVerifierTest > shouldFailIfValueIsDifferentForCompareKeyValueWithProducerRecord STARTED

org.apache.kafka.streams.test.OutputVerifierTest > shouldFailIfValueIsDifferentForCompareKeyValueWithProducerRecord PASSED

org.apache.kafka.streams.test.OutputVerifierTest > shouldFailIfValueIsDifferentForCompareValueTimestamp STARTED

org.apache.kafka.streams.test.OutputVerifierTest > shouldFailIfValueIsDifferentForCompareValueTimestamp PASSED

org.apache.kafka.streams.test.OutputVerifierTest > shouldNotAllowNullProducerRecordForCompareValue STARTED

org.apache.kafka.streams.test.OutputVerifierTest > shouldNotAllowNullProducerRecordForCompareValue PASSED

org.apache.kafka.streams.test.OutputVerifierTest > shouldFailIfValueIsDifferentWithNullForCompareValueTimestamp STARTED

org.apache.kafka.streams.test.OutputVerifierTest > shouldFailIfValueIsDifferentWithNullForCompareValueTimestamp PASSED

org.apache.kafka.streams.test.OutputVerifierTest > shouldFailIfKeyIsDifferentForCompareKeyValueTimestamp STARTED

org.apache.kafka.streams.test.OutputVerifierTest > shouldFailIfKeyIsDifferentForCompareKeyValueTimestamp PASSED

org.apache.kafka.streams.test.OutputVerifierTest > shouldFailIfKeyIsDifferentForCompareKeyValueTimestampWithProducerRecord STARTED

org.apache.kafka.streams.test.OutputVerifierTest > shouldFailIfKeyIsDifferentForCompareKeyValueTimestampWithProducerRecord PASSED

org.apache.kafka.streams.test.OutputVerifierTest > shouldPassIfValueIsEqualWithNullForCompareValueWithProducerRecord STARTED

org.apache.kafka.streams.test.OutputVerifierTest > shouldPassIfValueIsEqualWithNullForCompareValueWithProducerRecord PASSED

org.apache.kafka.streams.test.OutputVerifierTest > shouldFailIfValueIsDifferentWithNullReverseForCompareValueTimestamp STARTED

org.apache.kafka.streams.test.OutputVerifierTest > shouldFailIfValueIsDifferentWithNullReverseForCompareValueTimestamp PASSED

org.apache.kafka.streams.test.OutputVerifierTest > shouldFailIfValueIsDifferentWithNullReverseForCompareValue STARTED

org.apache.kafka.streams.test.OutputVerifierTest > shouldFailIfValueIsDifferentWithNullReverseForCompareValue PASSED

org.apache.kafka.streams.test.OutputVerifierTest > shouldFailIfTimestampIsDifferentForCompareValueTimestamp STARTED

org.apache.kafka.streams.test.OutputVerifierTest > shouldFailIfTimestampIsDifferentForCompareValueTimestamp PASSED

org.apache.kafka.streams.test.OutputVerifierTest > shouldPassIfKeyAndValueAndTimestampIsEqualWithNullForCompareKeyValueTimestampWithProducerRecord STARTED

org.apache.kafka.streams.test.OutputVerifierTest > shouldPassIfKeyAndValueAndTimestampIsEqualWithNullForCompareKeyValueTimestampWithProducerRecord PASSED

org.apache.kafka.streams.test.OutputVerifierTest > shouldFailIfValueIsDifferentWithNullForCompareKeyValueWithProducerRecord STARTED

org.apache.kafka.streams.test.OutputVerifierTest > shouldFailIfValueIsDifferentWithNullForCompareKeyValueWithProducerRecord PASSED

org.apache.kafka.streams.test.OutputVerifierTest > shouldFailIfValueIsDifferentForCompareKeyValueTimestampWithProducerRecord STARTED

org.apache.kafka.streams.test.OutputVerifierTest > shouldFailIfValueIsDifferentForCompareKeyValueTimestampWithProducerRecord PASSED

org.apache.kafka.streams.test.OutputVerifierTest > shouldNotAllowNullProducerRecordWithExpectedRecordForCompareValueTimestamp STARTED

org.apache.kafka.streams.test.OutputVerifierTest > shouldNotAllowNullProducerRecordWithExpectedRecordForCompareValueTimestamp PASSED

org.apache.kafka.streams.test.OutputVerifierTest > shouldNotAllowNullExpectedRecordForCompareValue STARTED

org.apache.kafka.streams.test.OutputVerifierTest > shouldNotAllowNullExpectedRecordForCompareValue PASSED

org.apache.kafka.streams.test.OutputVerifierTest > shouldFailIfValueIsDifferentWithNullReversForCompareKeyValueTimestampWithProducerRecord STARTED

org.apache.kafka.streams.test.OutputVerifierTest > shouldFailIfValueIsDifferentWithNullReversForCompareKeyValueTimestampWithProducerRecord PASSED

org.apache.kafka.streams.test.OutputVerifierTest > shouldNotAllowNullProducerRecordForCompareKeyValue STARTED

org.apache.kafka.streams.test.OutputVerifierTest > shouldNotAllowNullProducerRecordForCompareKeyValue PASSED

org.apache.kafka.streams.test.OutputVerifierTest > shouldFailIfValueIsDifferentWithNullReversForCompareKeyValueWithProducerRecord STARTED

org.apache.kafka.streams.test.OutputVerifierTest > shouldFailIfValueIsDifferentWithNullReversForCompareKeyValueWithProducerRecord PASSED

org.apache.kafka.streams.test.OutputVerifierTest > shouldPassIfKeyAndValueAndTimestampIsEqualForCompareKeyValueTimestamp STARTED

org.apache.kafka.streams.test.OutputVerifierTest > shouldPassIfKeyAndValueAndTimestampIsEqualForCompareKeyValueTimestamp PASSED

org.apache.kafka.streams.test.OutputVerifierTest > shouldFailIfValueIsDifferentWithNullForCompareKeyValueTimestampWithProducerRecord STARTED

org.apache.kafka.streams.test.OutputVerifierTest > shouldFailIfValueIsDifferentWithNullForCompareKeyValueTimestampWithProducerRecord PASSED

org.apache.kafka.streams.test.OutputVerifierTest > shouldFailIfKeyIsDifferentWithNullReversForCompareKeyValueWithProducerRecord STARTED

org.apache.kafka.streams.test.OutputVerifierTest > shouldFailIfKeyIsDifferentWithNullReversForCompareKeyValueWithProducerRecord PASSED

org.apache.kafka.streams.test.OutputVerifierTest > shouldPassIfKeyAndValueIsEqualWithNullForCompareKeyValueWithProducerRecord STARTED

org.apache.kafka.streams.test.OutputVerifierTest > shouldPassIfKeyAndValueIsEqualWithNullForCompareKeyValueWithProducerRecord PASSED

org.apache.kafka.streams.test.OutputVerifierTest > shouldFailIfKeyIsDifferentWithNullForCompareKeyValueTimestampWithProducerRecord STARTED

org.apache.kafka.streams.test.OutputVerifierTest > shouldFailIfKeyIsDifferentWithNullForCompareKeyValueTimestampWithProducerRecord PASSED

org.apache.kafka.streams.test.OutputVerifierTest > shouldFailIfValueIsDifferentForCompareKeyValueTimestamp STARTED

org.apache.kafka.streams.test.OutputVerifierTest > shouldFailIfValueIsDifferentForCompareKeyValueTimestamp PASSED

org.apache.kafka.streams.test.OutputVerifierTest > shouldPassIfValueAndTimestampIsEqualForCompareValueTimestampWithProducerRecord STARTED

org.apache.kafka.streams.test.OutputVerifierTest > shouldPassIfValueAndTimestampIsEqualForCompareValueTimestampWithProducerRecord PASSED

org.apache.kafka.streams.test.OutputVerifierTest > shouldFailIfValueIsDifferentWithNullReversForCompareKeyValueTimestamp STARTED

org.apache.kafka.streams.test.OutputVerifierTest > shouldFailIfValueIsDifferentWithNullReversForCompareKeyValueTimestamp PASSED

org.apache.kafka.streams.test.OutputVerifierTest > shouldFailIfValueIsDifferentWithNullReverseForCompareValueTimestampWithProducerRecord STARTED

org.apache.kafka.streams.test.OutputVerifierTest > shouldFailIfValueIsDifferentWithNullReverseForCompareValueTimestampWithProducerRecord PASSED

org.apache.kafka.streams.test.TestRecordTest > testConsumerRecord STARTED

org.apache.kafka.streams.test.TestRecordTest > testConsumerRecord PASSED

org.apache.kafka.streams.test.TestRecordTest > testToString STARTED

org.apache.kafka.streams.test.TestRecordTest > testToString PASSED

org.apache.kafka.streams.test.TestRecordTest > testInvalidRecords STARTED

org.apache.kafka.streams.test.TestRecordTest > testInvalidRecords PASSED

org.apache.kafka.streams.test.TestRecordTest > testPartialConstructorEquals STARTED

org.apache.kafka.streams.test.TestRecordTest > testPartialConstructorEquals PASSED

org.apache.kafka.streams.test.TestRecordTest > testMultiFieldMatcher STARTED

org.apache.kafka.streams.test.TestRecordTest > testMultiFieldMatcher PASSED

org.apache.kafka.streams.test.TestRecordTest > testFields STARTED

org.apache.kafka.streams.test.TestRecordTest > testFields PASSED

org.apache.kafka.streams.test.TestRecordTest > testProducerRecord STARTED

org.apache.kafka.streams.test.TestRecordTest > testProducerRecord PASSED

org.apache.kafka.streams.test.TestRecordTest > testEqualsAndHashCode STARTED

org.apache.kafka.streams.test.TestRecordTest > testEqualsAndHashCode PASSED

> Task :streams:upgrade-system-tests-20:spotbugsMain NO-SOURCE
> Task :streams:upgrade-system-tests-20:test
> Task :streams:upgrade-system-tests-21:compileJava NO-SOURCE
> Task :streams:upgrade-system-tests-21:processResources NO-SOURCE
> Task :streams:upgrade-system-tests-21:classes UP-TO-DATE
> Task :streams:upgrade-system-tests-21:checkstyleMain NO-SOURCE
> Task :streams:upgrade-system-tests-21:compileTestJava
> Task :streams:upgrade-system-tests-21:processTestResources NO-SOURCE
> Task :streams:upgrade-system-tests-21:testClasses
> Task :streams:upgrade-system-tests-21:checkstyleTest
> Task :streams:upgrade-system-tests-21:spotbugsMain NO-SOURCE
> Task :streams:upgrade-system-tests-21:test
> Task :streams:upgrade-system-tests-22:compileJava NO-SOURCE
> Task :streams:upgrade-system-tests-22:processResources NO-SOURCE
> Task :streams:upgrade-system-tests-22:classes UP-TO-DATE
> Task :streams:upgrade-system-tests-22:checkstyleMain NO-SOURCE
> Task :streams:upgrade-system-tests-22:compileTestJava
> Task :streams:upgrade-system-tests-22:processTestResources NO-SOURCE
> Task :streams:upgrade-system-tests-22:testClasses
> Task :streams:upgrade-system-tests-22:checkstyleTest
> Task :streams:upgrade-system-tests-22:spotbugsMain NO-SOURCE
> Task :streams:upgrade-system-tests-22:test
> Task :streams:upgrade-system-tests-23:compileJava NO-SOURCE
> Task :streams:upgrade-system-tests-23:processResources NO-SOURCE
> Task :streams:upgrade-system-tests-23:classes UP-TO-DATE
> Task :streams:upgrade-system-tests-23:checkstyleMain NO-SOURCE
> Task :streams:upgrade-system-tests-23:compileTestJava
> Task :streams:upgrade-system-tests-23:processTestResources NO-SOURCE
> Task :streams:upgrade-system-tests-23:testClasses
> Task :streams:upgrade-system-tests-23:checkstyleTest
> Task :streams:upgrade-system-tests-23:spotbugsMain NO-SOURCE
> Task :streams:upgrade-system-tests-23:test
> Task :streams:upgrade-system-tests-24:compileJava NO-SOURCE
> Task :streams:upgrade-system-tests-24:processResources NO-SOURCE
> Task :streams:upgrade-system-tests-24:classes UP-TO-DATE
> Task :streams:upgrade-system-tests-24:checkstyleMain NO-SOURCE
> Task :streams:upgrade-system-tests-24:compileTestJava
> Task :streams:upgrade-system-tests-24:processTestResources NO-SOURCE
> Task :streams:upgrade-system-tests-24:testClasses
> Task :streams:upgrade-system-tests-24:checkstyleTest
> Task :streams:upgrade-system-tests-24:spotbugsMain NO-SOURCE
> Task :streams:upgrade-system-tests-24:test
> Task :streams:upgrade-system-tests-25:compileJava NO-SOURCE
> Task :streams:upgrade-system-tests-25:processResources NO-SOURCE
> Task :streams:upgrade-system-tests-25:classes UP-TO-DATE
> Task :streams:upgrade-system-tests-25:checkstyleMain NO-SOURCE
> Task :streams:upgrade-system-tests-25:compileTestJava
> Task :streams:upgrade-system-tests-25:processTestResources NO-SOURCE
> Task :streams:upgrade-system-tests-25:testClasses
> Task :streams:upgrade-system-tests-25:checkstyleTest
> Task :streams:upgrade-system-tests-25:spotbugsMain NO-SOURCE
> Task :streams:upgrade-system-tests-25:test

FAILURE: Build failed with an exception.

* What went wrong:
Execution failed for task ':clients:test'.
> There were failing tests. See the report at: file://<https://builds.apache.org/job/kafka-trunk-jdk11/ws/clients/build/reports/tests/test/index.html>

* Try:
Run with --stacktrace option to get the stack trace. Run with --info or --debug option to get more log output. Run with --scan to get full insights.

* Get more help at https://help.gradle.org

Deprecated Gradle features were used in this build, making it incompatible with Gradle 7.0.
Use '--warning-mode all' to show the individual deprecation warnings.
See https://docs.gradle.org/6.5/userguide/command_line_interface.html#sec:command_line_warnings

BUILD FAILED in 1h 46m 33s
215 actionable tasks: 210 executed, 5 up-to-date
Build step 'Execute shell' marked build as failure
Recording test results
ERROR: No tool found matching GRADLE_4_10_2_HOME
Setting GRADLE_4_10_3_HOME=/home/jenkins/tools/gradle/4.10.3
ERROR: No tool found matching GRADLE_4_10_2_HOME
Setting GRADLE_4_10_3_HOME=/home/jenkins/tools/gradle/4.10.3
Not sending mail to unregistered user noreply@github.com

Build failed in Jenkins: kafka-trunk-jdk11 #1576

Posted by Apache Jenkins Server <je...@builds.apache.org>.
See <https://builds.apache.org/job/kafka-trunk-jdk11/1576/display/redirect?page=changes>

Changes:

[github] KAFKA-10147 MockAdminClient#describeConfigs(Collection<ConfigResource>)

[github] MINOR: Fix flaky HighAvailabilityTaskAssignorIntegrationTest (#8884)

[github] MINOR: Upgrade jetty to 9.4.27.v20200227 and jersey to 2.31 (#8859)


------------------------------------------
[...truncated 3.18 MB...]

org.apache.kafka.streams.test.ConsumerRecordFactoryTest > shouldNotAllowToCreateTopicWithNullTopicNameWithNullKey PASSED

org.apache.kafka.streams.test.ConsumerRecordFactoryTest > shouldCreateNullKeyConsumerRecordWithOtherTopicNameAndTimestampWithTimetamp STARTED

org.apache.kafka.streams.test.ConsumerRecordFactoryTest > shouldCreateNullKeyConsumerRecordWithOtherTopicNameAndTimestampWithTimetamp PASSED

org.apache.kafka.streams.test.ConsumerRecordFactoryTest > shouldCreateConsumerRecordWithTimestamp STARTED

org.apache.kafka.streams.test.ConsumerRecordFactoryTest > shouldCreateConsumerRecordWithTimestamp PASSED

org.apache.kafka.streams.test.ConsumerRecordFactoryTest > shouldNotAllowToCreateTopicWithNullHeaders STARTED

org.apache.kafka.streams.test.ConsumerRecordFactoryTest > shouldNotAllowToCreateTopicWithNullHeaders PASSED

org.apache.kafka.streams.test.ConsumerRecordFactoryTest > shouldNotAllowToCreateTopicWithNullTopicNameWithDefaultTimestamp STARTED

org.apache.kafka.streams.test.ConsumerRecordFactoryTest > shouldNotAllowToCreateTopicWithNullTopicNameWithDefaultTimestamp PASSED

org.apache.kafka.streams.test.ConsumerRecordFactoryTest > shouldRequireCustomTopicNameIfNotDefaultFactoryTopicName STARTED

org.apache.kafka.streams.test.ConsumerRecordFactoryTest > shouldRequireCustomTopicNameIfNotDefaultFactoryTopicName PASSED

org.apache.kafka.streams.test.ConsumerRecordFactoryTest > shouldRequireCustomTopicNameIfNotDefaultFactoryTopicNameWithNullKey STARTED

org.apache.kafka.streams.test.ConsumerRecordFactoryTest > shouldRequireCustomTopicNameIfNotDefaultFactoryTopicNameWithNullKey PASSED

org.apache.kafka.streams.test.ConsumerRecordFactoryTest > shouldCreateConsumerRecord STARTED

org.apache.kafka.streams.test.ConsumerRecordFactoryTest > shouldCreateConsumerRecord PASSED

org.apache.kafka.streams.test.ConsumerRecordFactoryTest > shouldCreateNullKeyConsumerRecord STARTED

org.apache.kafka.streams.test.ConsumerRecordFactoryTest > shouldCreateNullKeyConsumerRecord PASSED

org.apache.kafka.streams.test.ConsumerRecordFactoryTest > shouldCreateConsumerRecordWithOtherTopicName STARTED

org.apache.kafka.streams.test.ConsumerRecordFactoryTest > shouldCreateConsumerRecordWithOtherTopicName PASSED

org.apache.kafka.streams.test.ConsumerRecordFactoryTest > shouldAdvanceTime STARTED

org.apache.kafka.streams.test.ConsumerRecordFactoryTest > shouldAdvanceTime PASSED

org.apache.kafka.streams.test.ConsumerRecordFactoryTest > shouldNotAllowToCreateTopicWithNullTopicNameWithKeyValuePairs STARTED

org.apache.kafka.streams.test.ConsumerRecordFactoryTest > shouldNotAllowToCreateTopicWithNullTopicNameWithKeyValuePairs PASSED

org.apache.kafka.streams.test.ConsumerRecordFactoryTest > shouldRequireCustomTopicNameIfNotDefaultFactoryTopicNameWithKeyValuePairsAndCustomTimestamps STARTED

org.apache.kafka.streams.test.ConsumerRecordFactoryTest > shouldRequireCustomTopicNameIfNotDefaultFactoryTopicNameWithKeyValuePairsAndCustomTimestamps PASSED

org.apache.kafka.streams.test.ConsumerRecordFactoryTest > shouldRequireCustomTopicNameIfNotDefaultFactoryTopicNameWithKeyValuePairs STARTED

org.apache.kafka.streams.test.ConsumerRecordFactoryTest > shouldRequireCustomTopicNameIfNotDefaultFactoryTopicNameWithKeyValuePairs PASSED

org.apache.kafka.streams.test.ConsumerRecordFactoryTest > shouldCreateConsumerRecordWithOtherTopicNameAndTimestamp STARTED

org.apache.kafka.streams.test.ConsumerRecordFactoryTest > shouldCreateConsumerRecordWithOtherTopicNameAndTimestamp PASSED

org.apache.kafka.streams.test.ConsumerRecordFactoryTest > shouldNotAllowToCreateTopicWithNullTopicNameWithKeyValuePairsAndCustomTimestamps STARTED

org.apache.kafka.streams.test.ConsumerRecordFactoryTest > shouldNotAllowToCreateTopicWithNullTopicNameWithKeyValuePairsAndCustomTimestamps PASSED

org.apache.kafka.streams.test.ConsumerRecordFactoryTest > shouldNotAllowToCreateTopicWithNullTopicName STARTED

org.apache.kafka.streams.test.ConsumerRecordFactoryTest > shouldNotAllowToCreateTopicWithNullTopicName PASSED

org.apache.kafka.streams.test.ConsumerRecordFactoryTest > shouldCreateConsumerRecordsFromKeyValuePairsWithCustomTimestampAndIncrementsAndNotAdvanceTime STARTED

org.apache.kafka.streams.test.ConsumerRecordFactoryTest > shouldCreateConsumerRecordsFromKeyValuePairsWithCustomTimestampAndIncrementsAndNotAdvanceTime PASSED

org.apache.kafka.streams.test.ConsumerRecordFactoryTest > shouldCreateNullKeyConsumerRecordWithTimestampWithTimestamp STARTED

org.apache.kafka.streams.test.ConsumerRecordFactoryTest > shouldCreateNullKeyConsumerRecordWithTimestampWithTimestamp PASSED

org.apache.kafka.streams.test.ConsumerRecordFactoryTest > shouldRequireCustomTopicNameIfNotDefaultFactoryTopicNameWithNullKeyAndDefaultTimestamp STARTED

org.apache.kafka.streams.test.ConsumerRecordFactoryTest > shouldRequireCustomTopicNameIfNotDefaultFactoryTopicNameWithNullKeyAndDefaultTimestamp PASSED

org.apache.kafka.streams.test.ConsumerRecordFactoryTest > shouldCreateConsumerRecordsFromKeyValuePairsWithTimestampAndIncrements STARTED

org.apache.kafka.streams.test.ConsumerRecordFactoryTest > shouldCreateConsumerRecordsFromKeyValuePairsWithTimestampAndIncrements PASSED

org.apache.kafka.streams.MockTimeTest > shouldGetNanosAsMillis STARTED

org.apache.kafka.streams.MockTimeTest > shouldGetNanosAsMillis PASSED

org.apache.kafka.streams.MockTimeTest > shouldSetStartTime STARTED

org.apache.kafka.streams.MockTimeTest > shouldSetStartTime PASSED

org.apache.kafka.streams.MockTimeTest > shouldNotAllowNegativeSleep STARTED

org.apache.kafka.streams.MockTimeTest > shouldNotAllowNegativeSleep PASSED

org.apache.kafka.streams.MockTimeTest > shouldAdvanceTimeOnSleep STARTED

org.apache.kafka.streams.MockTimeTest > shouldAdvanceTimeOnSleep PASSED

org.apache.kafka.streams.internals.KeyValueStoreFacadeTest > shouldReturnIsOpen STARTED

org.apache.kafka.streams.internals.KeyValueStoreFacadeTest > shouldReturnIsOpen PASSED

org.apache.kafka.streams.internals.KeyValueStoreFacadeTest > shouldDeleteAndReturnPlainValue STARTED

org.apache.kafka.streams.internals.KeyValueStoreFacadeTest > shouldDeleteAndReturnPlainValue PASSED

org.apache.kafka.streams.internals.KeyValueStoreFacadeTest > shouldReturnName STARTED

org.apache.kafka.streams.internals.KeyValueStoreFacadeTest > shouldReturnName PASSED

org.apache.kafka.streams.internals.KeyValueStoreFacadeTest > shouldPutWithUnknownTimestamp STARTED

org.apache.kafka.streams.internals.KeyValueStoreFacadeTest > shouldPutWithUnknownTimestamp PASSED

org.apache.kafka.streams.internals.KeyValueStoreFacadeTest > shouldPutAllWithUnknownTimestamp STARTED

org.apache.kafka.streams.internals.KeyValueStoreFacadeTest > shouldPutAllWithUnknownTimestamp PASSED

org.apache.kafka.streams.internals.KeyValueStoreFacadeTest > shouldReturnIsPersistent STARTED

org.apache.kafka.streams.internals.KeyValueStoreFacadeTest > shouldReturnIsPersistent PASSED

org.apache.kafka.streams.internals.KeyValueStoreFacadeTest > shouldPutIfAbsentWithUnknownTimestamp STARTED

org.apache.kafka.streams.internals.KeyValueStoreFacadeTest > shouldPutIfAbsentWithUnknownTimestamp PASSED

org.apache.kafka.streams.internals.KeyValueStoreFacadeTest > shouldForwardClose STARTED

org.apache.kafka.streams.internals.KeyValueStoreFacadeTest > shouldForwardClose PASSED

org.apache.kafka.streams.internals.KeyValueStoreFacadeTest > shouldForwardFlush STARTED

org.apache.kafka.streams.internals.KeyValueStoreFacadeTest > shouldForwardFlush PASSED

org.apache.kafka.streams.internals.KeyValueStoreFacadeTest > shouldForwardInit STARTED

org.apache.kafka.streams.internals.KeyValueStoreFacadeTest > shouldForwardInit PASSED

> Task :streams:upgrade-system-tests-0110:processTestResources NO-SOURCE
> Task :streams:upgrade-system-tests-0110:testClasses
> Task :streams:upgrade-system-tests-0110:checkstyleTest
> Task :streams:upgrade-system-tests-0110:spotbugsMain NO-SOURCE
> Task :streams:upgrade-system-tests-0110:test
> Task :streams:upgrade-system-tests-10:compileJava NO-SOURCE
> Task :streams:upgrade-system-tests-10:processResources NO-SOURCE
> Task :streams:upgrade-system-tests-10:classes UP-TO-DATE
> Task :streams:upgrade-system-tests-10:checkstyleMain NO-SOURCE
> Task :streams:upgrade-system-tests-10:compileTestJava
> Task :streams:upgrade-system-tests-10:processTestResources NO-SOURCE
> Task :streams:upgrade-system-tests-10:testClasses
> Task :streams:upgrade-system-tests-10:checkstyleTest
> Task :streams:upgrade-system-tests-10:spotbugsMain NO-SOURCE
> Task :streams:upgrade-system-tests-10:test
> Task :streams:upgrade-system-tests-11:compileJava NO-SOURCE
> Task :streams:upgrade-system-tests-11:processResources NO-SOURCE
> Task :streams:upgrade-system-tests-11:classes UP-TO-DATE
> Task :streams:upgrade-system-tests-11:checkstyleMain NO-SOURCE
> Task :streams:upgrade-system-tests-11:compileTestJava
> Task :streams:upgrade-system-tests-11:processTestResources NO-SOURCE
> Task :streams:upgrade-system-tests-11:testClasses
> Task :streams:upgrade-system-tests-11:checkstyleTest
> Task :streams:upgrade-system-tests-11:spotbugsMain NO-SOURCE
> Task :streams:upgrade-system-tests-11:test
> Task :streams:upgrade-system-tests-20:compileJava NO-SOURCE
> Task :streams:upgrade-system-tests-20:processResources NO-SOURCE
> Task :streams:upgrade-system-tests-20:classes UP-TO-DATE
> Task :streams:upgrade-system-tests-20:checkstyleMain NO-SOURCE
> Task :streams:upgrade-system-tests-20:compileTestJava
> Task :streams:upgrade-system-tests-20:processTestResources NO-SOURCE
> Task :streams:upgrade-system-tests-20:testClasses
> Task :streams:upgrade-system-tests-20:checkstyleTest
> Task :streams:upgrade-system-tests-20:spotbugsMain NO-SOURCE
> Task :streams:upgrade-system-tests-20:test
> Task :streams:upgrade-system-tests-21:compileJava NO-SOURCE
> Task :streams:upgrade-system-tests-21:processResources NO-SOURCE
> Task :streams:upgrade-system-tests-21:classes UP-TO-DATE
> Task :streams:upgrade-system-tests-21:checkstyleMain NO-SOURCE
> Task :streams:upgrade-system-tests-21:compileTestJava
> Task :streams:upgrade-system-tests-21:processTestResources NO-SOURCE
> Task :streams:upgrade-system-tests-21:testClasses
> Task :streams:upgrade-system-tests-21:checkstyleTest
> Task :streams:upgrade-system-tests-21:spotbugsMain NO-SOURCE
> Task :streams:upgrade-system-tests-21:test
> Task :streams:upgrade-system-tests-22:compileJava NO-SOURCE
> Task :streams:upgrade-system-tests-22:processResources NO-SOURCE
> Task :streams:upgrade-system-tests-22:classes UP-TO-DATE
> Task :streams:upgrade-system-tests-22:checkstyleMain NO-SOURCE
> Task :streams:upgrade-system-tests-22:compileTestJava
> Task :streams:upgrade-system-tests-22:processTestResources NO-SOURCE
> Task :streams:upgrade-system-tests-22:testClasses
> Task :streams:upgrade-system-tests-22:checkstyleTest
> Task :streams:upgrade-system-tests-22:spotbugsMain NO-SOURCE
> Task :streams:upgrade-system-tests-22:test
> Task :streams:upgrade-system-tests-23:compileJava NO-SOURCE
> Task :streams:upgrade-system-tests-23:processResources NO-SOURCE
> Task :streams:upgrade-system-tests-23:classes UP-TO-DATE
> Task :streams:upgrade-system-tests-23:checkstyleMain NO-SOURCE
> Task :streams:upgrade-system-tests-23:compileTestJava
> Task :streams:upgrade-system-tests-23:processTestResources NO-SOURCE
> Task :streams:upgrade-system-tests-23:testClasses
> Task :streams:upgrade-system-tests-23:checkstyleTest
> Task :streams:upgrade-system-tests-23:spotbugsMain NO-SOURCE
> Task :streams:upgrade-system-tests-23:test
> Task :streams:upgrade-system-tests-24:compileJava NO-SOURCE
> Task :streams:upgrade-system-tests-24:processResources NO-SOURCE
> Task :streams:upgrade-system-tests-24:classes UP-TO-DATE
> Task :streams:upgrade-system-tests-24:checkstyleMain NO-SOURCE
> Task :streams:upgrade-system-tests-24:compileTestJava
> Task :streams:upgrade-system-tests-24:processTestResources NO-SOURCE
> Task :streams:upgrade-system-tests-24:testClasses
> Task :streams:upgrade-system-tests-24:checkstyleTest
> Task :streams:upgrade-system-tests-24:spotbugsMain NO-SOURCE
> Task :streams:upgrade-system-tests-24:test
> Task :streams:upgrade-system-tests-25:compileJava NO-SOURCE
> Task :streams:upgrade-system-tests-25:processResources NO-SOURCE
> Task :streams:upgrade-system-tests-25:classes UP-TO-DATE
> Task :streams:upgrade-system-tests-25:checkstyleMain NO-SOURCE
> Task :streams:upgrade-system-tests-25:compileTestJava
> Task :streams:upgrade-system-tests-25:processTestResources NO-SOURCE
> Task :streams:upgrade-system-tests-25:testClasses
> Task :streams:upgrade-system-tests-25:checkstyleTest
> Task :streams:upgrade-system-tests-25:spotbugsMain NO-SOURCE
> Task :streams:upgrade-system-tests-25:test

FAILURE: Build failed with an exception.

* What went wrong:
Execution failed for task ':connect:runtime:test'.
> There were failing tests. See the report at: file://<https://builds.apache.org/job/kafka-trunk-jdk11/ws/connect/runtime/build/reports/tests/test/index.html>

* Try:
Run with --stacktrace option to get the stack trace. Run with --info or --debug option to get more log output. Run with --scan to get full insights.

* Get more help at https://help.gradle.org

Deprecated Gradle features were used in this build, making it incompatible with Gradle 7.0.
Use '--warning-mode all' to show the individual deprecation warnings.
See https://docs.gradle.org/6.5/userguide/command_line_interface.html#sec:command_line_warnings

BUILD FAILED in 2h 9m 20s
215 actionable tasks: 183 executed, 32 up-to-date
Build step 'Execute shell' marked build as failure
Recording test results
ERROR: No tool found matching GRADLE_4_10_2_HOME
Setting GRADLE_4_10_3_HOME=/home/jenkins/tools/gradle/4.10.3
ERROR: No tool found matching GRADLE_4_10_2_HOME
Setting GRADLE_4_10_3_HOME=/home/jenkins/tools/gradle/4.10.3
Not sending mail to unregistered user noreply@github.com

Build failed in Jenkins: kafka-trunk-jdk11 #1575

Posted by Apache Jenkins Server <je...@builds.apache.org>.
See <https://builds.apache.org/job/kafka-trunk-jdk11/1575/display/redirect?page=changes>

Changes:

[github] KAFKA-10165: Remove Percentiles from e2e metrics (#8882)


------------------------------------------
[...truncated 3.17 MB...]

org.apache.kafka.streams.TopologyTestDriverTest > shouldPunctuateIfWallClockTimeAdvances[Eos enabled = true] PASSED

org.apache.kafka.streams.TopologyTestDriverTest > shouldCloseProcessor[Eos enabled = false] STARTED

org.apache.kafka.streams.TopologyTestDriverTest > shouldCloseProcessor[Eos enabled = false] PASSED

org.apache.kafka.streams.TopologyTestDriverTest > shouldFeedStoreFromGlobalKTable[Eos enabled = false] STARTED

org.apache.kafka.streams.TopologyTestDriverTest > shouldFeedStoreFromGlobalKTable[Eos enabled = false] PASSED

org.apache.kafka.streams.TopologyTestDriverTest > shouldCleanUpPersistentStateStoresOnClose[Eos enabled = false] STARTED

org.apache.kafka.streams.TopologyTestDriverTest > shouldCleanUpPersistentStateStoresOnClose[Eos enabled = false] PASSED

org.apache.kafka.streams.TopologyTestDriverTest > shouldThrowForUnknownTopicDeprecated[Eos enabled = false] STARTED

org.apache.kafka.streams.TopologyTestDriverTest > shouldThrowForUnknownTopicDeprecated[Eos enabled = false] PASSED

org.apache.kafka.streams.TopologyTestDriverTest > shouldThrowPatternNotValidForTopicNameException[Eos enabled = false] STARTED

org.apache.kafka.streams.TopologyTestDriverTest > shouldThrowPatternNotValidForTopicNameException[Eos enabled = false] PASSED

org.apache.kafka.streams.TopologyTestDriverTest > shouldEnqueueLaterOutputsAfterEarlierOnes[Eos enabled = false] STARTED

org.apache.kafka.streams.TopologyTestDriverTest > shouldEnqueueLaterOutputsAfterEarlierOnes[Eos enabled = false] PASSED

org.apache.kafka.streams.TopologyTestDriverTest > shouldUseSourceSpecificDeserializersDeprecated[Eos enabled = false] STARTED

org.apache.kafka.streams.TopologyTestDriverTest > shouldUseSourceSpecificDeserializersDeprecated[Eos enabled = false] PASSED

org.apache.kafka.streams.TopologyTestDriverTest > shouldPunctuateIfEvenTimeAdvances[Eos enabled = false] STARTED

org.apache.kafka.streams.TopologyTestDriverTest > shouldPunctuateIfEvenTimeAdvances[Eos enabled = false] PASSED

org.apache.kafka.streams.TopologyTestDriverTest > shouldInitProcessor[Eos enabled = false] STARTED

org.apache.kafka.streams.TopologyTestDriverTest > shouldInitProcessor[Eos enabled = false] PASSED

org.apache.kafka.streams.TopologyTestDriverTest > shouldThrowForUnknownTopic[Eos enabled = false] STARTED

org.apache.kafka.streams.TopologyTestDriverTest > shouldThrowForUnknownTopic[Eos enabled = false] PASSED

org.apache.kafka.streams.TopologyTestDriverTest > shouldPunctuateOnStreamsTime[Eos enabled = false] STARTED

org.apache.kafka.streams.TopologyTestDriverTest > shouldPunctuateOnStreamsTime[Eos enabled = false] PASSED

org.apache.kafka.streams.TopologyTestDriverTest > shouldCaptureGlobalTopicNameIfWrittenInto[Eos enabled = false] STARTED

org.apache.kafka.streams.TopologyTestDriverTest > shouldCaptureGlobalTopicNameIfWrittenInto[Eos enabled = false] PASSED

org.apache.kafka.streams.TopologyTestDriverTest > shouldThrowIfInMemoryBuiltInStoreIsAccessedWithUntypedMethod[Eos enabled = false] STARTED

org.apache.kafka.streams.TopologyTestDriverTest > shouldThrowIfInMemoryBuiltInStoreIsAccessedWithUntypedMethod[Eos enabled = false] PASSED

org.apache.kafka.streams.TopologyTestDriverTest > shouldProcessFromSourcesThatMatchMultiplePattern[Eos enabled = false] STARTED

org.apache.kafka.streams.TopologyTestDriverTest > shouldProcessFromSourcesThatMatchMultiplePattern[Eos enabled = false] PASSED

org.apache.kafka.streams.TopologyTestDriverTest > shouldPopulateGlobalStore[Eos enabled = false] STARTED

org.apache.kafka.streams.TopologyTestDriverTest > shouldPopulateGlobalStore[Eos enabled = false] PASSED

org.apache.kafka.streams.TopologyTestDriverTest > shouldThrowIfPersistentBuiltInStoreIsAccessedWithUntypedMethod[Eos enabled = false] STARTED

org.apache.kafka.streams.TopologyTestDriverTest > shouldThrowIfPersistentBuiltInStoreIsAccessedWithUntypedMethod[Eos enabled = false] PASSED

org.apache.kafka.streams.TopologyTestDriverTest > shouldAllowPrePopulatingStatesStoresWithCachingEnabled[Eos enabled = false] STARTED

org.apache.kafka.streams.TopologyTestDriverTest > shouldAllowPrePopulatingStatesStoresWithCachingEnabled[Eos enabled = false] PASSED

org.apache.kafka.streams.TopologyTestDriverTest > shouldReturnCorrectPersistentStoreTypeOnly[Eos enabled = false] STARTED

org.apache.kafka.streams.TopologyTestDriverTest > shouldReturnCorrectPersistentStoreTypeOnly[Eos enabled = false] PASSED

org.apache.kafka.streams.TopologyTestDriverTest > shouldRespectTaskIdling[Eos enabled = false] STARTED

org.apache.kafka.streams.TopologyTestDriverTest > shouldRespectTaskIdling[Eos enabled = false] PASSED

org.apache.kafka.streams.TopologyTestDriverTest > shouldUseSourceSpecificDeserializers[Eos enabled = false] STARTED

org.apache.kafka.streams.TopologyTestDriverTest > shouldUseSourceSpecificDeserializers[Eos enabled = false] PASSED

org.apache.kafka.streams.TopologyTestDriverTest > shouldReturnAllStores[Eos enabled = false] STARTED

org.apache.kafka.streams.TopologyTestDriverTest > shouldReturnAllStores[Eos enabled = false] PASSED

org.apache.kafka.streams.TopologyTestDriverTest > shouldNotCreateStateDirectoryForStatelessTopology[Eos enabled = false] STARTED

org.apache.kafka.streams.TopologyTestDriverTest > shouldNotCreateStateDirectoryForStatelessTopology[Eos enabled = false] PASSED

org.apache.kafka.streams.TopologyTestDriverTest > shouldApplyGlobalUpdatesCorrectlyInRecursiveTopologies[Eos enabled = false] STARTED

org.apache.kafka.streams.TopologyTestDriverTest > shouldApplyGlobalUpdatesCorrectlyInRecursiveTopologies[Eos enabled = false] PASSED

org.apache.kafka.streams.TopologyTestDriverTest > shouldReturnAllStoresNames[Eos enabled = false] STARTED

org.apache.kafka.streams.TopologyTestDriverTest > shouldReturnAllStoresNames[Eos enabled = false] PASSED

org.apache.kafka.streams.TopologyTestDriverTest > shouldPassRecordHeadersIntoSerializersAndDeserializers[Eos enabled = false] STARTED

org.apache.kafka.streams.TopologyTestDriverTest > shouldPassRecordHeadersIntoSerializersAndDeserializers[Eos enabled = false] PASSED

org.apache.kafka.streams.TopologyTestDriverTest > shouldProcessConsumerRecordList[Eos enabled = false] STARTED

org.apache.kafka.streams.TopologyTestDriverTest > shouldProcessConsumerRecordList[Eos enabled = false] PASSED

org.apache.kafka.streams.TopologyTestDriverTest > shouldUseSinkSpecificSerializers[Eos enabled = false] STARTED

org.apache.kafka.streams.TopologyTestDriverTest > shouldUseSinkSpecificSerializers[Eos enabled = false] PASSED

org.apache.kafka.streams.TopologyTestDriverTest > shouldFlushStoreForFirstInput[Eos enabled = false] STARTED

org.apache.kafka.streams.TopologyTestDriverTest > shouldFlushStoreForFirstInput[Eos enabled = false] PASSED

org.apache.kafka.streams.TopologyTestDriverTest > shouldProcessFromSourceThatMatchPattern[Eos enabled = false] STARTED

org.apache.kafka.streams.TopologyTestDriverTest > shouldProcessFromSourceThatMatchPattern[Eos enabled = false] PASSED

org.apache.kafka.streams.TopologyTestDriverTest > shouldCaptureSinkTopicNamesIfWrittenInto[Eos enabled = false] STARTED

org.apache.kafka.streams.TopologyTestDriverTest > shouldCaptureSinkTopicNamesIfWrittenInto[Eos enabled = false] PASSED

org.apache.kafka.streams.TopologyTestDriverTest > shouldUpdateStoreForNewKey[Eos enabled = false] STARTED

org.apache.kafka.streams.TopologyTestDriverTest > shouldUpdateStoreForNewKey[Eos enabled = false] PASSED

org.apache.kafka.streams.TopologyTestDriverTest > shouldSendRecordViaCorrectSourceTopicDeprecated[Eos enabled = false] STARTED

org.apache.kafka.streams.TopologyTestDriverTest > shouldSendRecordViaCorrectSourceTopicDeprecated[Eos enabled = false] PASSED

org.apache.kafka.streams.TopologyTestDriverTest > shouldPunctuateOnWallClockTime[Eos enabled = false] STARTED

org.apache.kafka.streams.TopologyTestDriverTest > shouldPunctuateOnWallClockTime[Eos enabled = false] PASSED

org.apache.kafka.streams.TopologyTestDriverTest > shouldSetRecordMetadata[Eos enabled = false] STARTED

org.apache.kafka.streams.TopologyTestDriverTest > shouldSetRecordMetadata[Eos enabled = false] PASSED

org.apache.kafka.streams.TopologyTestDriverTest > shouldNotUpdateStoreForLargerValue[Eos enabled = false] STARTED

org.apache.kafka.streams.TopologyTestDriverTest > shouldNotUpdateStoreForLargerValue[Eos enabled = false] PASSED

org.apache.kafka.streams.TopologyTestDriverTest > shouldReturnCorrectInMemoryStoreTypeOnly[Eos enabled = false] STARTED

org.apache.kafka.streams.TopologyTestDriverTest > shouldReturnCorrectInMemoryStoreTypeOnly[Eos enabled = false] PASSED

org.apache.kafka.streams.TopologyTestDriverTest > shouldThrowForMissingTime[Eos enabled = false] STARTED

org.apache.kafka.streams.TopologyTestDriverTest > shouldThrowForMissingTime[Eos enabled = false] PASSED

org.apache.kafka.streams.TopologyTestDriverTest > shouldCaptureInternalTopicNamesIfWrittenInto[Eos enabled = false] STARTED

org.apache.kafka.streams.TopologyTestDriverTest > shouldCaptureInternalTopicNamesIfWrittenInto[Eos enabled = false] PASSED

org.apache.kafka.streams.TopologyTestDriverTest > shouldPunctuateOnWallClockTimeDeprecated[Eos enabled = false] STARTED

org.apache.kafka.streams.TopologyTestDriverTest > shouldPunctuateOnWallClockTimeDeprecated[Eos enabled = false] PASSED

org.apache.kafka.streams.TopologyTestDriverTest > shouldProcessRecordForTopic[Eos enabled = false] STARTED

org.apache.kafka.streams.TopologyTestDriverTest > shouldProcessRecordForTopic[Eos enabled = false] PASSED

org.apache.kafka.streams.TopologyTestDriverTest > shouldForwardRecordsFromSubtopologyToSubtopology[Eos enabled = false] STARTED

org.apache.kafka.streams.TopologyTestDriverTest > shouldForwardRecordsFromSubtopologyToSubtopology[Eos enabled = false] PASSED

org.apache.kafka.streams.TopologyTestDriverTest > shouldNotUpdateStoreForSmallerValue[Eos enabled = false] STARTED

org.apache.kafka.streams.TopologyTestDriverTest > shouldNotUpdateStoreForSmallerValue[Eos enabled = false] PASSED

org.apache.kafka.streams.TopologyTestDriverTest > shouldCreateStateDirectoryForStatefulTopology[Eos enabled = false] STARTED

org.apache.kafka.streams.TopologyTestDriverTest > shouldCreateStateDirectoryForStatefulTopology[Eos enabled = false] PASSED

org.apache.kafka.streams.TopologyTestDriverTest > shouldPunctuateIfWallClockTimeAdvances[Eos enabled = false] STARTED

org.apache.kafka.streams.TopologyTestDriverTest > shouldPunctuateIfWallClockTimeAdvances[Eos enabled = false] PASSED

> Task :streams:upgrade-system-tests-21:processTestResources NO-SOURCE
> Task :streams:upgrade-system-tests-21:testClasses
> Task :streams:upgrade-system-tests-21:checkstyleTest
> Task :streams:upgrade-system-tests-21:spotbugsMain NO-SOURCE
> Task :streams:upgrade-system-tests-21:test
> Task :streams:upgrade-system-tests-22:compileJava NO-SOURCE
> Task :streams:upgrade-system-tests-22:processResources NO-SOURCE
> Task :streams:upgrade-system-tests-22:classes UP-TO-DATE
> Task :streams:upgrade-system-tests-22:checkstyleMain NO-SOURCE
> Task :streams:upgrade-system-tests-22:compileTestJava
> Task :streams:upgrade-system-tests-22:processTestResources NO-SOURCE
> Task :streams:upgrade-system-tests-22:testClasses
> Task :streams:upgrade-system-tests-22:checkstyleTest
> Task :streams:upgrade-system-tests-22:spotbugsMain NO-SOURCE
> Task :streams:upgrade-system-tests-22:test
> Task :streams:upgrade-system-tests-23:compileJava NO-SOURCE
> Task :streams:upgrade-system-tests-23:processResources NO-SOURCE
> Task :streams:upgrade-system-tests-23:classes UP-TO-DATE
> Task :streams:upgrade-system-tests-23:checkstyleMain NO-SOURCE
> Task :streams:upgrade-system-tests-23:compileTestJava
> Task :streams:upgrade-system-tests-23:processTestResources NO-SOURCE
> Task :streams:upgrade-system-tests-23:testClasses
> Task :streams:upgrade-system-tests-23:checkstyleTest
> Task :streams:upgrade-system-tests-23:spotbugsMain NO-SOURCE
> Task :streams:upgrade-system-tests-23:test
> Task :streams:upgrade-system-tests-24:compileJava NO-SOURCE
> Task :streams:upgrade-system-tests-24:processResources NO-SOURCE
> Task :streams:upgrade-system-tests-24:classes UP-TO-DATE
> Task :streams:upgrade-system-tests-24:checkstyleMain NO-SOURCE
> Task :streams:upgrade-system-tests-24:compileTestJava
> Task :streams:upgrade-system-tests-24:processTestResources NO-SOURCE
> Task :streams:upgrade-system-tests-24:testClasses
> Task :streams:upgrade-system-tests-24:checkstyleTest
> Task :streams:upgrade-system-tests-24:spotbugsMain NO-SOURCE
> Task :streams:upgrade-system-tests-24:test
> Task :streams:upgrade-system-tests-25:compileJava NO-SOURCE
> Task :streams:upgrade-system-tests-25:processResources NO-SOURCE
> Task :streams:upgrade-system-tests-25:classes UP-TO-DATE
> Task :streams:upgrade-system-tests-25:checkstyleMain NO-SOURCE
> Task :streams:upgrade-system-tests-25:compileTestJava
> Task :streams:upgrade-system-tests-25:processTestResources NO-SOURCE
> Task :streams:upgrade-system-tests-25:testClasses
> Task :streams:upgrade-system-tests-25:checkstyleTest
> Task :streams:upgrade-system-tests-25:spotbugsMain NO-SOURCE
> Task :streams:upgrade-system-tests-25:test

FAILURE: Build failed with an exception.

* What went wrong:
Execution failed for task ':core:test'.
> There were failing tests. See the report at: file://<https://builds.apache.org/job/kafka-trunk-jdk11/ws/core/build/reports/tests/test/index.html>

* Try:
Run with --stacktrace option to get the stack trace. Run with --info or --debug option to get more log output. Run with --scan to get full insights.

* Get more help at https://help.gradle.org

Deprecated Gradle features were used in this build, making it incompatible with Gradle 7.0.
Use '--warning-mode all' to show the individual deprecation warnings.
See https://docs.gradle.org/6.5/userguide/command_line_interface.html#sec:command_line_warnings

BUILD FAILED in 2h 1m 16s
215 actionable tasks: 183 executed, 32 up-to-date
Build step 'Execute shell' marked build as failure
Recording test results
ERROR: No tool found matching GRADLE_4_10_2_HOME
Setting GRADLE_4_10_3_HOME=/home/jenkins/tools/gradle/4.10.3
ERROR: No tool found matching GRADLE_4_10_2_HOME
Setting GRADLE_4_10_3_HOME=/home/jenkins/tools/gradle/4.10.3
Not sending mail to unregistered user noreply@github.com

Build failed in Jenkins: kafka-trunk-jdk11 #1574

Posted by Apache Jenkins Server <je...@builds.apache.org>.
See <https://builds.apache.org/job/kafka-trunk-jdk11/1574/display/redirect?page=changes>

Changes:

[github] KAFKA-10150: task state transitions/management and committing cleanup


------------------------------------------
[...truncated 3.17 MB...]

org.apache.kafka.streams.TopologyTestDriverTest > shouldCleanUpPersistentStateStoresOnClose[Eos enabled = false] STARTED

org.apache.kafka.streams.TopologyTestDriverTest > shouldCleanUpPersistentStateStoresOnClose[Eos enabled = false] PASSED

org.apache.kafka.streams.TopologyTestDriverTest > shouldThrowForUnknownTopicDeprecated[Eos enabled = false] STARTED

org.apache.kafka.streams.TopologyTestDriverTest > shouldThrowForUnknownTopicDeprecated[Eos enabled = false] PASSED

org.apache.kafka.streams.TopologyTestDriverTest > shouldThrowPatternNotValidForTopicNameException[Eos enabled = false] STARTED

org.apache.kafka.streams.TopologyTestDriverTest > shouldThrowPatternNotValidForTopicNameException[Eos enabled = false] PASSED

org.apache.kafka.streams.TopologyTestDriverTest > shouldEnqueueLaterOutputsAfterEarlierOnes[Eos enabled = false] STARTED

org.apache.kafka.streams.TopologyTestDriverTest > shouldEnqueueLaterOutputsAfterEarlierOnes[Eos enabled = false] PASSED

org.apache.kafka.streams.TopologyTestDriverTest > shouldUseSourceSpecificDeserializersDeprecated[Eos enabled = false] STARTED

org.apache.kafka.streams.TopologyTestDriverTest > shouldUseSourceSpecificDeserializersDeprecated[Eos enabled = false] PASSED

org.apache.kafka.streams.TopologyTestDriverTest > shouldPunctuateIfEvenTimeAdvances[Eos enabled = false] STARTED

org.apache.kafka.streams.TopologyTestDriverTest > shouldPunctuateIfEvenTimeAdvances[Eos enabled = false] PASSED

org.apache.kafka.streams.TopologyTestDriverTest > shouldInitProcessor[Eos enabled = false] STARTED

org.apache.kafka.streams.TopologyTestDriverTest > shouldInitProcessor[Eos enabled = false] PASSED

org.apache.kafka.streams.TopologyTestDriverTest > shouldThrowForUnknownTopic[Eos enabled = false] STARTED

org.apache.kafka.streams.TopologyTestDriverTest > shouldThrowForUnknownTopic[Eos enabled = false] PASSED

org.apache.kafka.streams.TopologyTestDriverTest > shouldPunctuateOnStreamsTime[Eos enabled = false] STARTED

org.apache.kafka.streams.TopologyTestDriverTest > shouldPunctuateOnStreamsTime[Eos enabled = false] PASSED

org.apache.kafka.streams.TopologyTestDriverTest > shouldCaptureGlobalTopicNameIfWrittenInto[Eos enabled = false] STARTED

org.apache.kafka.streams.TopologyTestDriverTest > shouldCaptureGlobalTopicNameIfWrittenInto[Eos enabled = false] PASSED

org.apache.kafka.streams.TopologyTestDriverTest > shouldThrowIfInMemoryBuiltInStoreIsAccessedWithUntypedMethod[Eos enabled = false] STARTED

org.apache.kafka.streams.TopologyTestDriverTest > shouldThrowIfInMemoryBuiltInStoreIsAccessedWithUntypedMethod[Eos enabled = false] PASSED

org.apache.kafka.streams.TopologyTestDriverTest > shouldProcessFromSourcesThatMatchMultiplePattern[Eos enabled = false] STARTED

org.apache.kafka.streams.TopologyTestDriverTest > shouldProcessFromSourcesThatMatchMultiplePattern[Eos enabled = false] PASSED

org.apache.kafka.streams.TopologyTestDriverTest > shouldPopulateGlobalStore[Eos enabled = false] STARTED

org.apache.kafka.streams.TopologyTestDriverTest > shouldPopulateGlobalStore[Eos enabled = false] PASSED

org.apache.kafka.streams.TopologyTestDriverTest > shouldThrowIfPersistentBuiltInStoreIsAccessedWithUntypedMethod[Eos enabled = false] STARTED

org.apache.kafka.streams.TopologyTestDriverTest > shouldThrowIfPersistentBuiltInStoreIsAccessedWithUntypedMethod[Eos enabled = false] PASSED

org.apache.kafka.streams.TopologyTestDriverTest > shouldAllowPrePopulatingStatesStoresWithCachingEnabled[Eos enabled = false] STARTED

org.apache.kafka.streams.TopologyTestDriverTest > shouldAllowPrePopulatingStatesStoresWithCachingEnabled[Eos enabled = false] PASSED

org.apache.kafka.streams.TopologyTestDriverTest > shouldReturnCorrectPersistentStoreTypeOnly[Eos enabled = false] STARTED

org.apache.kafka.streams.TopologyTestDriverTest > shouldReturnCorrectPersistentStoreTypeOnly[Eos enabled = false] PASSED

org.apache.kafka.streams.TopologyTestDriverTest > shouldRespectTaskIdling[Eos enabled = false] STARTED

org.apache.kafka.streams.TopologyTestDriverTest > shouldRespectTaskIdling[Eos enabled = false] PASSED

org.apache.kafka.streams.TopologyTestDriverTest > shouldUseSourceSpecificDeserializers[Eos enabled = false] STARTED

org.apache.kafka.streams.TopologyTestDriverTest > shouldUseSourceSpecificDeserializers[Eos enabled = false] PASSED

org.apache.kafka.streams.TopologyTestDriverTest > shouldReturnAllStores[Eos enabled = false] STARTED

org.apache.kafka.streams.TopologyTestDriverTest > shouldReturnAllStores[Eos enabled = false] PASSED

org.apache.kafka.streams.TopologyTestDriverTest > shouldNotCreateStateDirectoryForStatelessTopology[Eos enabled = false] STARTED

org.apache.kafka.streams.TopologyTestDriverTest > shouldNotCreateStateDirectoryForStatelessTopology[Eos enabled = false] PASSED

org.apache.kafka.streams.TopologyTestDriverTest > shouldApplyGlobalUpdatesCorrectlyInRecursiveTopologies[Eos enabled = false] STARTED

org.apache.kafka.streams.TopologyTestDriverTest > shouldApplyGlobalUpdatesCorrectlyInRecursiveTopologies[Eos enabled = false] PASSED

org.apache.kafka.streams.TopologyTestDriverTest > shouldReturnAllStoresNames[Eos enabled = false] STARTED

org.apache.kafka.streams.TopologyTestDriverTest > shouldReturnAllStoresNames[Eos enabled = false] PASSED

org.apache.kafka.streams.TopologyTestDriverTest > shouldPassRecordHeadersIntoSerializersAndDeserializers[Eos enabled = false] STARTED

org.apache.kafka.streams.TopologyTestDriverTest > shouldPassRecordHeadersIntoSerializersAndDeserializers[Eos enabled = false] PASSED

org.apache.kafka.streams.TopologyTestDriverTest > shouldProcessConsumerRecordList[Eos enabled = false] STARTED

org.apache.kafka.streams.TopologyTestDriverTest > shouldProcessConsumerRecordList[Eos enabled = false] PASSED

org.apache.kafka.streams.TopologyTestDriverTest > shouldUseSinkSpecificSerializers[Eos enabled = false] STARTED

org.apache.kafka.streams.TopologyTestDriverTest > shouldUseSinkSpecificSerializers[Eos enabled = false] PASSED

org.apache.kafka.streams.TopologyTestDriverTest > shouldFlushStoreForFirstInput[Eos enabled = false] STARTED

org.apache.kafka.streams.TopologyTestDriverTest > shouldFlushStoreForFirstInput[Eos enabled = false] PASSED

org.apache.kafka.streams.TopologyTestDriverTest > shouldProcessFromSourceThatMatchPattern[Eos enabled = false] STARTED

org.apache.kafka.streams.TopologyTestDriverTest > shouldProcessFromSourceThatMatchPattern[Eos enabled = false] PASSED

org.apache.kafka.streams.TopologyTestDriverTest > shouldCaptureSinkTopicNamesIfWrittenInto[Eos enabled = false] STARTED

org.apache.kafka.streams.TopologyTestDriverTest > shouldCaptureSinkTopicNamesIfWrittenInto[Eos enabled = false] PASSED

org.apache.kafka.streams.TopologyTestDriverTest > shouldUpdateStoreForNewKey[Eos enabled = false] STARTED

org.apache.kafka.streams.TopologyTestDriverTest > shouldUpdateStoreForNewKey[Eos enabled = false] PASSED

org.apache.kafka.streams.TopologyTestDriverTest > shouldSendRecordViaCorrectSourceTopicDeprecated[Eos enabled = false] STARTED

org.apache.kafka.streams.TopologyTestDriverTest > shouldSendRecordViaCorrectSourceTopicDeprecated[Eos enabled = false] PASSED

org.apache.kafka.streams.TopologyTestDriverTest > shouldPunctuateOnWallClockTime[Eos enabled = false] STARTED

org.apache.kafka.streams.TopologyTestDriverTest > shouldPunctuateOnWallClockTime[Eos enabled = false] PASSED

org.apache.kafka.streams.TopologyTestDriverTest > shouldSetRecordMetadata[Eos enabled = false] STARTED

org.apache.kafka.streams.TopologyTestDriverTest > shouldSetRecordMetadata[Eos enabled = false] PASSED

org.apache.kafka.streams.TopologyTestDriverTest > shouldNotUpdateStoreForLargerValue[Eos enabled = false] STARTED

org.apache.kafka.streams.TopologyTestDriverTest > shouldNotUpdateStoreForLargerValue[Eos enabled = false] PASSED

org.apache.kafka.streams.TopologyTestDriverTest > shouldReturnCorrectInMemoryStoreTypeOnly[Eos enabled = false] STARTED

org.apache.kafka.streams.TopologyTestDriverTest > shouldReturnCorrectInMemoryStoreTypeOnly[Eos enabled = false] PASSED

org.apache.kafka.streams.TopologyTestDriverTest > shouldThrowForMissingTime[Eos enabled = false] STARTED

org.apache.kafka.streams.TopologyTestDriverTest > shouldThrowForMissingTime[Eos enabled = false] PASSED

org.apache.kafka.streams.TopologyTestDriverTest > shouldCaptureInternalTopicNamesIfWrittenInto[Eos enabled = false] STARTED

org.apache.kafka.streams.TopologyTestDriverTest > shouldCaptureInternalTopicNamesIfWrittenInto[Eos enabled = false] PASSED

org.apache.kafka.streams.TopologyTestDriverTest > shouldPunctuateOnWallClockTimeDeprecated[Eos enabled = false] STARTED

org.apache.kafka.streams.TopologyTestDriverTest > shouldPunctuateOnWallClockTimeDeprecated[Eos enabled = false] PASSED

org.apache.kafka.streams.TopologyTestDriverTest > shouldProcessRecordForTopic[Eos enabled = false] STARTED

org.apache.kafka.streams.TopologyTestDriverTest > shouldProcessRecordForTopic[Eos enabled = false] PASSED

org.apache.kafka.streams.TopologyTestDriverTest > shouldForwardRecordsFromSubtopologyToSubtopology[Eos enabled = false] STARTED

org.apache.kafka.streams.TopologyTestDriverTest > shouldForwardRecordsFromSubtopologyToSubtopology[Eos enabled = false] PASSED

org.apache.kafka.streams.TopologyTestDriverTest > shouldNotUpdateStoreForSmallerValue[Eos enabled = false] STARTED

org.apache.kafka.streams.TopologyTestDriverTest > shouldNotUpdateStoreForSmallerValue[Eos enabled = false] PASSED

org.apache.kafka.streams.TopologyTestDriverTest > shouldCreateStateDirectoryForStatefulTopology[Eos enabled = false] STARTED

org.apache.kafka.streams.TopologyTestDriverTest > shouldCreateStateDirectoryForStatefulTopology[Eos enabled = false] PASSED

org.apache.kafka.streams.TopologyTestDriverTest > shouldPunctuateIfWallClockTimeAdvances[Eos enabled = false] STARTED

org.apache.kafka.streams.TopologyTestDriverTest > shouldPunctuateIfWallClockTimeAdvances[Eos enabled = false] PASSED

> Task :streams:upgrade-system-tests-20:processTestResources NO-SOURCE
> Task :streams:upgrade-system-tests-20:testClasses
> Task :streams:upgrade-system-tests-20:checkstyleTest
> Task :streams:upgrade-system-tests-20:spotbugsMain NO-SOURCE
> Task :streams:upgrade-system-tests-20:test
> Task :streams:upgrade-system-tests-21:compileJava NO-SOURCE
> Task :streams:upgrade-system-tests-21:processResources NO-SOURCE
> Task :streams:upgrade-system-tests-21:classes UP-TO-DATE
> Task :streams:upgrade-system-tests-21:checkstyleMain NO-SOURCE
> Task :streams:upgrade-system-tests-21:compileTestJava
> Task :streams:upgrade-system-tests-21:processTestResources NO-SOURCE
> Task :streams:upgrade-system-tests-21:testClasses
> Task :streams:upgrade-system-tests-21:checkstyleTest
> Task :streams:upgrade-system-tests-21:spotbugsMain NO-SOURCE
> Task :streams:upgrade-system-tests-21:test
> Task :streams:upgrade-system-tests-22:compileJava NO-SOURCE
> Task :streams:upgrade-system-tests-22:processResources NO-SOURCE
> Task :streams:upgrade-system-tests-22:classes UP-TO-DATE
> Task :streams:upgrade-system-tests-22:checkstyleMain NO-SOURCE
> Task :streams:upgrade-system-tests-22:compileTestJava
> Task :streams:upgrade-system-tests-22:processTestResources NO-SOURCE
> Task :streams:upgrade-system-tests-22:testClasses
> Task :streams:upgrade-system-tests-22:checkstyleTest
> Task :streams:upgrade-system-tests-22:spotbugsMain NO-SOURCE
> Task :streams:upgrade-system-tests-22:test
> Task :streams:upgrade-system-tests-23:compileJava NO-SOURCE
> Task :streams:upgrade-system-tests-23:processResources NO-SOURCE
> Task :streams:upgrade-system-tests-23:classes UP-TO-DATE
> Task :streams:upgrade-system-tests-23:checkstyleMain NO-SOURCE
> Task :streams:upgrade-system-tests-23:compileTestJava
> Task :streams:upgrade-system-tests-23:processTestResources NO-SOURCE
> Task :streams:upgrade-system-tests-23:testClasses
> Task :streams:upgrade-system-tests-23:checkstyleTest
> Task :streams:upgrade-system-tests-23:spotbugsMain NO-SOURCE
> Task :streams:upgrade-system-tests-23:test
> Task :streams:upgrade-system-tests-24:compileJava NO-SOURCE
> Task :streams:upgrade-system-tests-24:processResources NO-SOURCE
> Task :streams:upgrade-system-tests-24:classes UP-TO-DATE
> Task :streams:upgrade-system-tests-24:checkstyleMain NO-SOURCE
> Task :streams:upgrade-system-tests-24:compileTestJava
> Task :streams:upgrade-system-tests-24:processTestResources NO-SOURCE
> Task :streams:upgrade-system-tests-24:testClasses
> Task :streams:upgrade-system-tests-24:checkstyleTest
> Task :streams:upgrade-system-tests-24:spotbugsMain NO-SOURCE
> Task :streams:upgrade-system-tests-24:test
> Task :streams:upgrade-system-tests-25:compileJava NO-SOURCE
> Task :streams:upgrade-system-tests-25:processResources NO-SOURCE
> Task :streams:upgrade-system-tests-25:classes UP-TO-DATE
> Task :streams:upgrade-system-tests-25:checkstyleMain NO-SOURCE
> Task :streams:upgrade-system-tests-25:compileTestJava
> Task :streams:upgrade-system-tests-25:processTestResources NO-SOURCE
> Task :streams:upgrade-system-tests-25:testClasses
> Task :streams:upgrade-system-tests-25:checkstyleTest
> Task :streams:upgrade-system-tests-25:spotbugsMain NO-SOURCE
> Task :streams:upgrade-system-tests-25:test

FAILURE: Build failed with an exception.

* What went wrong:
Execution failed for task ':core:test'.
> There were failing tests. See the report at: file://<https://builds.apache.org/job/kafka-trunk-jdk11/ws/core/build/reports/tests/test/index.html>

* Try:
Run with --stacktrace option to get the stack trace. Run with --info or --debug option to get more log output. Run with --scan to get full insights.

* Get more help at https://help.gradle.org

Deprecated Gradle features were used in this build, making it incompatible with Gradle 7.0.
Use '--warning-mode all' to show the individual deprecation warnings.
See https://docs.gradle.org/6.5/userguide/command_line_interface.html#sec:command_line_warnings

BUILD FAILED in 1h 50m 58s
215 actionable tasks: 183 executed, 32 up-to-date
Build step 'Execute shell' marked build as failure
Recording test results
ERROR: No tool found matching GRADLE_4_10_2_HOME
Setting GRADLE_4_10_3_HOME=/home/jenkins/tools/gradle/4.10.3
ERROR: No tool found matching GRADLE_4_10_2_HOME
Setting GRADLE_4_10_3_HOME=/home/jenkins/tools/gradle/4.10.3
Not sending mail to unregistered user noreply@github.com

Build failed in Jenkins: kafka-trunk-jdk11 #1573

Posted by Apache Jenkins Server <je...@builds.apache.org>.
See <https://builds.apache.org/job/kafka-trunk-jdk11/1573/display/redirect?page=changes>

Changes:

[github] KAFKA-10169: Error message when transit to Aborting / AbortableError /


------------------------------------------
[...truncated 3.17 MB...]
org.apache.kafka.streams.TestTopicsTest > shouldNotAllowToCreateWithNullDriver STARTED

org.apache.kafka.streams.TestTopicsTest > shouldNotAllowToCreateWithNullDriver PASSED

org.apache.kafka.streams.TestTopicsTest > testDuration STARTED

org.apache.kafka.streams.TestTopicsTest > testDuration PASSED

org.apache.kafka.streams.TestTopicsTest > testOutputToString STARTED

org.apache.kafka.streams.TestTopicsTest > testOutputToString PASSED

org.apache.kafka.streams.TestTopicsTest > testValue STARTED

org.apache.kafka.streams.TestTopicsTest > testValue PASSED

org.apache.kafka.streams.TestTopicsTest > testTimestampAutoAdvance STARTED

org.apache.kafka.streams.TestTopicsTest > testTimestampAutoAdvance PASSED

org.apache.kafka.streams.TestTopicsTest > testOutputWrongSerde STARTED

org.apache.kafka.streams.TestTopicsTest > testOutputWrongSerde PASSED

org.apache.kafka.streams.TestTopicsTest > shouldNotAllowToCreateOutputTopicWithNullTopicName STARTED

org.apache.kafka.streams.TestTopicsTest > shouldNotAllowToCreateOutputTopicWithNullTopicName PASSED

org.apache.kafka.streams.TestTopicsTest > testWrongSerde STARTED

org.apache.kafka.streams.TestTopicsTest > testWrongSerde PASSED

org.apache.kafka.streams.TestTopicsTest > testKeyValuesToMapWithNull STARTED

org.apache.kafka.streams.TestTopicsTest > testKeyValuesToMapWithNull PASSED

org.apache.kafka.streams.TestTopicsTest > testNonExistingOutputTopic STARTED

org.apache.kafka.streams.TestTopicsTest > testNonExistingOutputTopic PASSED

org.apache.kafka.streams.TestTopicsTest > testMultipleTopics STARTED

org.apache.kafka.streams.TestTopicsTest > testMultipleTopics PASSED

org.apache.kafka.streams.TestTopicsTest > testKeyValueList STARTED

org.apache.kafka.streams.TestTopicsTest > testKeyValueList PASSED

org.apache.kafka.streams.TestTopicsTest > shouldNotAllowToCreateOutputWithNullDriver STARTED

org.apache.kafka.streams.TestTopicsTest > shouldNotAllowToCreateOutputWithNullDriver PASSED

org.apache.kafka.streams.TestTopicsTest > testValueList STARTED

org.apache.kafka.streams.TestTopicsTest > testValueList PASSED

org.apache.kafka.streams.TestTopicsTest > testRecordList STARTED

org.apache.kafka.streams.TestTopicsTest > testRecordList PASSED

org.apache.kafka.streams.TestTopicsTest > testNonExistingInputTopic STARTED

org.apache.kafka.streams.TestTopicsTest > testNonExistingInputTopic PASSED

org.apache.kafka.streams.TestTopicsTest > testKeyValuesToMap STARTED

org.apache.kafka.streams.TestTopicsTest > testKeyValuesToMap PASSED

org.apache.kafka.streams.TestTopicsTest > testRecordsToList STARTED

org.apache.kafka.streams.TestTopicsTest > testRecordsToList PASSED

org.apache.kafka.streams.TestTopicsTest > testKeyValueListDuration STARTED

org.apache.kafka.streams.TestTopicsTest > testKeyValueListDuration PASSED

org.apache.kafka.streams.TestTopicsTest > testInputToString STARTED

org.apache.kafka.streams.TestTopicsTest > testInputToString PASSED

org.apache.kafka.streams.TestTopicsTest > testTimestamp STARTED

org.apache.kafka.streams.TestTopicsTest > testTimestamp PASSED

org.apache.kafka.streams.TestTopicsTest > testWithHeaders STARTED

org.apache.kafka.streams.TestTopicsTest > testWithHeaders PASSED

org.apache.kafka.streams.TestTopicsTest > testKeyValue STARTED

org.apache.kafka.streams.TestTopicsTest > testKeyValue PASSED

org.apache.kafka.streams.TestTopicsTest > shouldNotAllowToCreateTopicWithNullTopicName STARTED

org.apache.kafka.streams.TestTopicsTest > shouldNotAllowToCreateTopicWithNullTopicName PASSED

> Task :streams:upgrade-system-tests-0100:processTestResources NO-SOURCE
> Task :streams:upgrade-system-tests-0100:testClasses
> Task :streams:upgrade-system-tests-0100:checkstyleTest
> Task :streams:upgrade-system-tests-0100:spotbugsMain NO-SOURCE
> Task :streams:upgrade-system-tests-0100:test
> Task :streams:upgrade-system-tests-0101:compileJava NO-SOURCE
> Task :streams:upgrade-system-tests-0101:processResources NO-SOURCE
> Task :streams:upgrade-system-tests-0101:classes UP-TO-DATE
> Task :streams:upgrade-system-tests-0101:checkstyleMain NO-SOURCE
> Task :streams:upgrade-system-tests-0101:compileTestJava
> Task :streams:upgrade-system-tests-0101:processTestResources NO-SOURCE
> Task :streams:upgrade-system-tests-0101:testClasses
> Task :streams:upgrade-system-tests-0101:checkstyleTest
> Task :streams:upgrade-system-tests-0101:spotbugsMain NO-SOURCE
> Task :streams:upgrade-system-tests-0101:test
> Task :streams:upgrade-system-tests-0102:compileJava NO-SOURCE
> Task :streams:upgrade-system-tests-0102:processResources NO-SOURCE
> Task :streams:upgrade-system-tests-0102:classes UP-TO-DATE
> Task :streams:upgrade-system-tests-0102:checkstyleMain NO-SOURCE
> Task :streams:upgrade-system-tests-0102:compileTestJava
> Task :streams:upgrade-system-tests-0102:processTestResources NO-SOURCE
> Task :streams:upgrade-system-tests-0102:testClasses
> Task :streams:upgrade-system-tests-0102:checkstyleTest
> Task :streams:upgrade-system-tests-0102:spotbugsMain NO-SOURCE
> Task :streams:upgrade-system-tests-0102:test
> Task :streams:upgrade-system-tests-0110:compileJava NO-SOURCE
> Task :streams:upgrade-system-tests-0110:processResources NO-SOURCE
> Task :streams:upgrade-system-tests-0110:classes UP-TO-DATE
> Task :streams:upgrade-system-tests-0110:checkstyleMain NO-SOURCE
> Task :streams:upgrade-system-tests-0110:compileTestJava
> Task :streams:upgrade-system-tests-0110:processTestResources NO-SOURCE
> Task :streams:upgrade-system-tests-0110:testClasses
> Task :streams:upgrade-system-tests-0110:checkstyleTest
> Task :streams:upgrade-system-tests-0110:spotbugsMain NO-SOURCE
> Task :streams:upgrade-system-tests-0110:test
> Task :streams:upgrade-system-tests-10:compileJava NO-SOURCE
> Task :streams:upgrade-system-tests-10:processResources NO-SOURCE
> Task :streams:upgrade-system-tests-10:classes UP-TO-DATE
> Task :streams:upgrade-system-tests-10:checkstyleMain NO-SOURCE
> Task :streams:upgrade-system-tests-10:compileTestJava
> Task :streams:upgrade-system-tests-10:processTestResources NO-SOURCE
> Task :streams:upgrade-system-tests-10:testClasses
> Task :streams:upgrade-system-tests-10:checkstyleTest
> Task :streams:upgrade-system-tests-10:spotbugsMain NO-SOURCE
> Task :streams:upgrade-system-tests-10:test
> Task :streams:upgrade-system-tests-11:compileJava NO-SOURCE
> Task :streams:upgrade-system-tests-11:processResources NO-SOURCE
> Task :streams:upgrade-system-tests-11:classes UP-TO-DATE
> Task :streams:upgrade-system-tests-11:checkstyleMain NO-SOURCE
> Task :streams:upgrade-system-tests-11:compileTestJava
> Task :streams:upgrade-system-tests-11:processTestResources NO-SOURCE
> Task :streams:upgrade-system-tests-11:testClasses
> Task :streams:upgrade-system-tests-11:checkstyleTest
> Task :streams:upgrade-system-tests-11:spotbugsMain NO-SOURCE
> Task :streams:upgrade-system-tests-11:test
> Task :streams:upgrade-system-tests-20:compileJava NO-SOURCE
> Task :streams:upgrade-system-tests-20:processResources NO-SOURCE
> Task :streams:upgrade-system-tests-20:classes UP-TO-DATE
> Task :streams:upgrade-system-tests-20:checkstyleMain NO-SOURCE
> Task :streams:upgrade-system-tests-20:compileTestJava
> Task :streams:upgrade-system-tests-20:processTestResources NO-SOURCE
> Task :streams:upgrade-system-tests-20:testClasses
> Task :streams:upgrade-system-tests-20:checkstyleTest
> Task :streams:upgrade-system-tests-20:spotbugsMain NO-SOURCE
> Task :streams:upgrade-system-tests-20:test
> Task :streams:upgrade-system-tests-21:compileJava NO-SOURCE
> Task :streams:upgrade-system-tests-21:processResources NO-SOURCE
> Task :streams:upgrade-system-tests-21:classes UP-TO-DATE
> Task :streams:upgrade-system-tests-21:checkstyleMain NO-SOURCE
> Task :streams:upgrade-system-tests-21:compileTestJava
> Task :streams:upgrade-system-tests-21:processTestResources NO-SOURCE
> Task :streams:upgrade-system-tests-21:testClasses
> Task :streams:upgrade-system-tests-21:checkstyleTest
> Task :streams:upgrade-system-tests-21:spotbugsMain NO-SOURCE
> Task :streams:upgrade-system-tests-21:test
> Task :streams:upgrade-system-tests-22:compileJava NO-SOURCE
> Task :streams:upgrade-system-tests-22:processResources NO-SOURCE
> Task :streams:upgrade-system-tests-22:classes UP-TO-DATE
> Task :streams:upgrade-system-tests-22:checkstyleMain NO-SOURCE
> Task :streams:upgrade-system-tests-22:compileTestJava
> Task :streams:upgrade-system-tests-22:processTestResources NO-SOURCE
> Task :streams:upgrade-system-tests-22:testClasses
> Task :streams:upgrade-system-tests-22:checkstyleTest
> Task :streams:upgrade-system-tests-22:spotbugsMain NO-SOURCE
> Task :streams:upgrade-system-tests-22:test
> Task :streams:upgrade-system-tests-23:compileJava NO-SOURCE
> Task :streams:upgrade-system-tests-23:processResources NO-SOURCE
> Task :streams:upgrade-system-tests-23:classes UP-TO-DATE
> Task :streams:upgrade-system-tests-23:checkstyleMain NO-SOURCE
> Task :streams:upgrade-system-tests-23:compileTestJava
> Task :streams:upgrade-system-tests-23:processTestResources NO-SOURCE
> Task :streams:upgrade-system-tests-23:testClasses
> Task :streams:upgrade-system-tests-23:checkstyleTest
> Task :streams:upgrade-system-tests-23:spotbugsMain NO-SOURCE
> Task :streams:upgrade-system-tests-23:test
> Task :streams:upgrade-system-tests-24:compileJava NO-SOURCE
> Task :streams:upgrade-system-tests-24:processResources NO-SOURCE
> Task :streams:upgrade-system-tests-24:classes UP-TO-DATE
> Task :streams:upgrade-system-tests-24:checkstyleMain NO-SOURCE
> Task :streams:upgrade-system-tests-24:compileTestJava
> Task :streams:upgrade-system-tests-24:processTestResources NO-SOURCE
> Task :streams:upgrade-system-tests-24:testClasses
> Task :streams:upgrade-system-tests-24:checkstyleTest
> Task :streams:upgrade-system-tests-24:spotbugsMain NO-SOURCE
> Task :streams:upgrade-system-tests-24:test
> Task :streams:upgrade-system-tests-25:compileJava NO-SOURCE
> Task :streams:upgrade-system-tests-25:processResources NO-SOURCE
> Task :streams:upgrade-system-tests-25:classes UP-TO-DATE
> Task :streams:upgrade-system-tests-25:checkstyleMain NO-SOURCE
> Task :streams:upgrade-system-tests-25:compileTestJava
> Task :streams:upgrade-system-tests-25:processTestResources NO-SOURCE
> Task :streams:upgrade-system-tests-25:testClasses
> Task :streams:upgrade-system-tests-25:checkstyleTest
> Task :streams:upgrade-system-tests-25:spotbugsMain NO-SOURCE
> Task :streams:upgrade-system-tests-25:test

FAILURE: Build completed with 2 failures.

1: Task failed with an exception.
-----------
* What went wrong:
Execution failed for task ':core:test'.
> There were failing tests. See the report at: file://<https://builds.apache.org/job/kafka-trunk-jdk11/ws/core/build/reports/tests/test/index.html>

* Try:
Run with --stacktrace option to get the stack trace. Run with --info or --debug option to get more log output. Run with --scan to get full insights.
==============================================================================

2: Task failed with an exception.
-----------
* What went wrong:
Execution failed for task ':connect:mirror:test'.
> There were failing tests. See the report at: file://<https://builds.apache.org/job/kafka-trunk-jdk11/ws/connect/mirror/build/reports/tests/test/index.html>

* Try:
Run with --stacktrace option to get the stack trace. Run with --info or --debug option to get more log output. Run with --scan to get full insights.
==============================================================================

* Get more help at https://help.gradle.org

Deprecated Gradle features were used in this build, making it incompatible with Gradle 7.0.
Use '--warning-mode all' to show the individual deprecation warnings.
See https://docs.gradle.org/6.5/userguide/command_line_interface.html#sec:command_line_warnings

BUILD FAILED in 1h 56m 6s
215 actionable tasks: 183 executed, 32 up-to-date
Build step 'Execute shell' marked build as failure
Recording test results
ERROR: No tool found matching GRADLE_4_10_2_HOME
Setting GRADLE_4_10_3_HOME=/home/jenkins/tools/gradle/4.10.3
ERROR: No tool found matching GRADLE_4_10_2_HOME
Setting GRADLE_4_10_3_HOME=/home/jenkins/tools/gradle/4.10.3
Not sending mail to unregistered user noreply@github.com

Build failed in Jenkins: kafka-trunk-jdk11 #1572

Posted by Apache Jenkins Server <je...@builds.apache.org>.
See <https://builds.apache.org/job/kafka-trunk-jdk11/1572/display/redirect?page=changes>

Changes:

[github] KAFKA-9974: Fix flaky test by removing unneeded asserts (#8646)


------------------------------------------
[...truncated 3.17 MB...]
org.apache.kafka.streams.TopologyTestDriverTest > shouldFeedStoreFromGlobalKTable[Eos enabled = false] STARTED

org.apache.kafka.streams.TopologyTestDriverTest > shouldFeedStoreFromGlobalKTable[Eos enabled = false] PASSED

org.apache.kafka.streams.TopologyTestDriverTest > shouldCleanUpPersistentStateStoresOnClose[Eos enabled = false] STARTED

org.apache.kafka.streams.TopologyTestDriverTest > shouldCleanUpPersistentStateStoresOnClose[Eos enabled = false] PASSED

org.apache.kafka.streams.TopologyTestDriverTest > shouldThrowForUnknownTopicDeprecated[Eos enabled = false] STARTED

org.apache.kafka.streams.TopologyTestDriverTest > shouldThrowForUnknownTopicDeprecated[Eos enabled = false] PASSED

org.apache.kafka.streams.TopologyTestDriverTest > shouldThrowPatternNotValidForTopicNameException[Eos enabled = false] STARTED

org.apache.kafka.streams.TopologyTestDriverTest > shouldThrowPatternNotValidForTopicNameException[Eos enabled = false] PASSED

org.apache.kafka.streams.TopologyTestDriverTest > shouldEnqueueLaterOutputsAfterEarlierOnes[Eos enabled = false] STARTED

org.apache.kafka.streams.TopologyTestDriverTest > shouldEnqueueLaterOutputsAfterEarlierOnes[Eos enabled = false] PASSED

org.apache.kafka.streams.TopologyTestDriverTest > shouldUseSourceSpecificDeserializersDeprecated[Eos enabled = false] STARTED

org.apache.kafka.streams.TopologyTestDriverTest > shouldUseSourceSpecificDeserializersDeprecated[Eos enabled = false] PASSED

org.apache.kafka.streams.TopologyTestDriverTest > shouldPunctuateIfEvenTimeAdvances[Eos enabled = false] STARTED

org.apache.kafka.streams.TopologyTestDriverTest > shouldPunctuateIfEvenTimeAdvances[Eos enabled = false] PASSED

org.apache.kafka.streams.TopologyTestDriverTest > shouldInitProcessor[Eos enabled = false] STARTED

org.apache.kafka.streams.TopologyTestDriverTest > shouldInitProcessor[Eos enabled = false] PASSED

org.apache.kafka.streams.TopologyTestDriverTest > shouldThrowForUnknownTopic[Eos enabled = false] STARTED

org.apache.kafka.streams.TopologyTestDriverTest > shouldThrowForUnknownTopic[Eos enabled = false] PASSED

org.apache.kafka.streams.TopologyTestDriverTest > shouldPunctuateOnStreamsTime[Eos enabled = false] STARTED

org.apache.kafka.streams.TopologyTestDriverTest > shouldPunctuateOnStreamsTime[Eos enabled = false] PASSED

org.apache.kafka.streams.TopologyTestDriverTest > shouldCaptureGlobalTopicNameIfWrittenInto[Eos enabled = false] STARTED

org.apache.kafka.streams.TopologyTestDriverTest > shouldCaptureGlobalTopicNameIfWrittenInto[Eos enabled = false] PASSED

org.apache.kafka.streams.TopologyTestDriverTest > shouldThrowIfInMemoryBuiltInStoreIsAccessedWithUntypedMethod[Eos enabled = false] STARTED

org.apache.kafka.streams.TopologyTestDriverTest > shouldThrowIfInMemoryBuiltInStoreIsAccessedWithUntypedMethod[Eos enabled = false] PASSED

org.apache.kafka.streams.TopologyTestDriverTest > shouldProcessFromSourcesThatMatchMultiplePattern[Eos enabled = false] STARTED

org.apache.kafka.streams.TopologyTestDriverTest > shouldProcessFromSourcesThatMatchMultiplePattern[Eos enabled = false] PASSED

org.apache.kafka.streams.TopologyTestDriverTest > shouldPopulateGlobalStore[Eos enabled = false] STARTED

org.apache.kafka.streams.TopologyTestDriverTest > shouldPopulateGlobalStore[Eos enabled = false] PASSED

org.apache.kafka.streams.TopologyTestDriverTest > shouldThrowIfPersistentBuiltInStoreIsAccessedWithUntypedMethod[Eos enabled = false] STARTED

org.apache.kafka.streams.TopologyTestDriverTest > shouldThrowIfPersistentBuiltInStoreIsAccessedWithUntypedMethod[Eos enabled = false] PASSED

org.apache.kafka.streams.TopologyTestDriverTest > shouldAllowPrePopulatingStatesStoresWithCachingEnabled[Eos enabled = false] STARTED

org.apache.kafka.streams.TopologyTestDriverTest > shouldAllowPrePopulatingStatesStoresWithCachingEnabled[Eos enabled = false] PASSED

org.apache.kafka.streams.TopologyTestDriverTest > shouldReturnCorrectPersistentStoreTypeOnly[Eos enabled = false] STARTED

org.apache.kafka.streams.TopologyTestDriverTest > shouldReturnCorrectPersistentStoreTypeOnly[Eos enabled = false] PASSED

org.apache.kafka.streams.TopologyTestDriverTest > shouldRespectTaskIdling[Eos enabled = false] STARTED

org.apache.kafka.streams.TopologyTestDriverTest > shouldRespectTaskIdling[Eos enabled = false] PASSED

org.apache.kafka.streams.TopologyTestDriverTest > shouldUseSourceSpecificDeserializers[Eos enabled = false] STARTED

org.apache.kafka.streams.TopologyTestDriverTest > shouldUseSourceSpecificDeserializers[Eos enabled = false] PASSED

org.apache.kafka.streams.TopologyTestDriverTest > shouldReturnAllStores[Eos enabled = false] STARTED

org.apache.kafka.streams.TopologyTestDriverTest > shouldReturnAllStores[Eos enabled = false] PASSED

org.apache.kafka.streams.TopologyTestDriverTest > shouldNotCreateStateDirectoryForStatelessTopology[Eos enabled = false] STARTED

org.apache.kafka.streams.TopologyTestDriverTest > shouldNotCreateStateDirectoryForStatelessTopology[Eos enabled = false] PASSED

org.apache.kafka.streams.TopologyTestDriverTest > shouldApplyGlobalUpdatesCorrectlyInRecursiveTopologies[Eos enabled = false] STARTED

org.apache.kafka.streams.TopologyTestDriverTest > shouldApplyGlobalUpdatesCorrectlyInRecursiveTopologies[Eos enabled = false] PASSED

org.apache.kafka.streams.TopologyTestDriverTest > shouldReturnAllStoresNames[Eos enabled = false] STARTED

org.apache.kafka.streams.TopologyTestDriverTest > shouldReturnAllStoresNames[Eos enabled = false] PASSED

org.apache.kafka.streams.TopologyTestDriverTest > shouldPassRecordHeadersIntoSerializersAndDeserializers[Eos enabled = false] STARTED

org.apache.kafka.streams.TopologyTestDriverTest > shouldPassRecordHeadersIntoSerializersAndDeserializers[Eos enabled = false] PASSED

org.apache.kafka.streams.TopologyTestDriverTest > shouldProcessConsumerRecordList[Eos enabled = false] STARTED

org.apache.kafka.streams.TopologyTestDriverTest > shouldProcessConsumerRecordList[Eos enabled = false] PASSED

org.apache.kafka.streams.TopologyTestDriverTest > shouldUseSinkSpecificSerializers[Eos enabled = false] STARTED

org.apache.kafka.streams.TopologyTestDriverTest > shouldUseSinkSpecificSerializers[Eos enabled = false] PASSED

org.apache.kafka.streams.TopologyTestDriverTest > shouldFlushStoreForFirstInput[Eos enabled = false] STARTED

org.apache.kafka.streams.TopologyTestDriverTest > shouldFlushStoreForFirstInput[Eos enabled = false] PASSED

org.apache.kafka.streams.TopologyTestDriverTest > shouldProcessFromSourceThatMatchPattern[Eos enabled = false] STARTED

org.apache.kafka.streams.TopologyTestDriverTest > shouldProcessFromSourceThatMatchPattern[Eos enabled = false] PASSED

org.apache.kafka.streams.TopologyTestDriverTest > shouldCaptureSinkTopicNamesIfWrittenInto[Eos enabled = false] STARTED

org.apache.kafka.streams.TopologyTestDriverTest > shouldCaptureSinkTopicNamesIfWrittenInto[Eos enabled = false] PASSED

org.apache.kafka.streams.TopologyTestDriverTest > shouldUpdateStoreForNewKey[Eos enabled = false] STARTED

org.apache.kafka.streams.TopologyTestDriverTest > shouldUpdateStoreForNewKey[Eos enabled = false] PASSED

org.apache.kafka.streams.TopologyTestDriverTest > shouldSendRecordViaCorrectSourceTopicDeprecated[Eos enabled = false] STARTED

org.apache.kafka.streams.TopologyTestDriverTest > shouldSendRecordViaCorrectSourceTopicDeprecated[Eos enabled = false] PASSED

org.apache.kafka.streams.TopologyTestDriverTest > shouldPunctuateOnWallClockTime[Eos enabled = false] STARTED

org.apache.kafka.streams.TopologyTestDriverTest > shouldPunctuateOnWallClockTime[Eos enabled = false] PASSED

org.apache.kafka.streams.TopologyTestDriverTest > shouldSetRecordMetadata[Eos enabled = false] STARTED

org.apache.kafka.streams.TopologyTestDriverTest > shouldSetRecordMetadata[Eos enabled = false] PASSED

org.apache.kafka.streams.TopologyTestDriverTest > shouldNotUpdateStoreForLargerValue[Eos enabled = false] STARTED

org.apache.kafka.streams.TopologyTestDriverTest > shouldNotUpdateStoreForLargerValue[Eos enabled = false] PASSED

org.apache.kafka.streams.TopologyTestDriverTest > shouldReturnCorrectInMemoryStoreTypeOnly[Eos enabled = false] STARTED

org.apache.kafka.streams.TopologyTestDriverTest > shouldReturnCorrectInMemoryStoreTypeOnly[Eos enabled = false] PASSED

org.apache.kafka.streams.TopologyTestDriverTest > shouldThrowForMissingTime[Eos enabled = false] STARTED

org.apache.kafka.streams.TopologyTestDriverTest > shouldThrowForMissingTime[Eos enabled = false] PASSED

org.apache.kafka.streams.TopologyTestDriverTest > shouldCaptureInternalTopicNamesIfWrittenInto[Eos enabled = false] STARTED

org.apache.kafka.streams.TopologyTestDriverTest > shouldCaptureInternalTopicNamesIfWrittenInto[Eos enabled = false] PASSED

org.apache.kafka.streams.TopologyTestDriverTest > shouldPunctuateOnWallClockTimeDeprecated[Eos enabled = false] STARTED

org.apache.kafka.streams.TopologyTestDriverTest > shouldPunctuateOnWallClockTimeDeprecated[Eos enabled = false] PASSED

org.apache.kafka.streams.TopologyTestDriverTest > shouldProcessRecordForTopic[Eos enabled = false] STARTED

org.apache.kafka.streams.TopologyTestDriverTest > shouldProcessRecordForTopic[Eos enabled = false] PASSED

org.apache.kafka.streams.TopologyTestDriverTest > shouldForwardRecordsFromSubtopologyToSubtopology[Eos enabled = false] STARTED

org.apache.kafka.streams.TopologyTestDriverTest > shouldForwardRecordsFromSubtopologyToSubtopology[Eos enabled = false] PASSED

org.apache.kafka.streams.TopologyTestDriverTest > shouldNotUpdateStoreForSmallerValue[Eos enabled = false] STARTED

org.apache.kafka.streams.TopologyTestDriverTest > shouldNotUpdateStoreForSmallerValue[Eos enabled = false] PASSED

org.apache.kafka.streams.TopologyTestDriverTest > shouldCreateStateDirectoryForStatefulTopology[Eos enabled = false] STARTED

org.apache.kafka.streams.TopologyTestDriverTest > shouldCreateStateDirectoryForStatefulTopology[Eos enabled = false] PASSED

org.apache.kafka.streams.TopologyTestDriverTest > shouldPunctuateIfWallClockTimeAdvances[Eos enabled = false] STARTED

org.apache.kafka.streams.TopologyTestDriverTest > shouldPunctuateIfWallClockTimeAdvances[Eos enabled = false] PASSED

> Task :streams:upgrade-system-tests-20:spotbugsMain NO-SOURCE
> Task :streams:upgrade-system-tests-20:test
> Task :streams:upgrade-system-tests-21:compileJava NO-SOURCE
> Task :streams:upgrade-system-tests-21:processResources NO-SOURCE
> Task :streams:upgrade-system-tests-21:classes UP-TO-DATE
> Task :streams:upgrade-system-tests-21:checkstyleMain NO-SOURCE
> Task :streams:upgrade-system-tests-21:compileTestJava
> Task :streams:upgrade-system-tests-21:processTestResources NO-SOURCE
> Task :streams:upgrade-system-tests-21:testClasses
> Task :streams:upgrade-system-tests-21:checkstyleTest
> Task :streams:upgrade-system-tests-21:spotbugsMain NO-SOURCE
> Task :streams:upgrade-system-tests-21:test
> Task :streams:upgrade-system-tests-22:compileJava NO-SOURCE
> Task :streams:upgrade-system-tests-22:processResources NO-SOURCE
> Task :streams:upgrade-system-tests-22:classes UP-TO-DATE
> Task :streams:upgrade-system-tests-22:checkstyleMain NO-SOURCE
> Task :streams:upgrade-system-tests-22:compileTestJava
> Task :streams:upgrade-system-tests-22:processTestResources NO-SOURCE
> Task :streams:upgrade-system-tests-22:testClasses
> Task :streams:upgrade-system-tests-22:checkstyleTest
> Task :streams:upgrade-system-tests-22:spotbugsMain NO-SOURCE
> Task :streams:upgrade-system-tests-22:test
> Task :streams:upgrade-system-tests-23:compileJava NO-SOURCE
> Task :streams:upgrade-system-tests-23:processResources NO-SOURCE
> Task :streams:upgrade-system-tests-23:classes UP-TO-DATE
> Task :streams:upgrade-system-tests-23:checkstyleMain NO-SOURCE
> Task :streams:upgrade-system-tests-23:compileTestJava
> Task :streams:upgrade-system-tests-23:processTestResources NO-SOURCE
> Task :streams:upgrade-system-tests-23:testClasses
> Task :streams:upgrade-system-tests-23:checkstyleTest
> Task :streams:upgrade-system-tests-23:spotbugsMain NO-SOURCE
> Task :streams:upgrade-system-tests-23:test
> Task :streams:upgrade-system-tests-24:compileJava NO-SOURCE
> Task :streams:upgrade-system-tests-24:processResources NO-SOURCE
> Task :streams:upgrade-system-tests-24:classes UP-TO-DATE
> Task :streams:upgrade-system-tests-24:checkstyleMain NO-SOURCE
> Task :streams:upgrade-system-tests-24:compileTestJava
> Task :streams:upgrade-system-tests-24:processTestResources NO-SOURCE
> Task :streams:upgrade-system-tests-24:testClasses
> Task :streams:upgrade-system-tests-24:checkstyleTest
> Task :streams:upgrade-system-tests-24:spotbugsMain NO-SOURCE
> Task :streams:upgrade-system-tests-24:test
> Task :streams:upgrade-system-tests-25:compileJava NO-SOURCE
> Task :streams:upgrade-system-tests-25:processResources NO-SOURCE
> Task :streams:upgrade-system-tests-25:classes UP-TO-DATE
> Task :streams:upgrade-system-tests-25:checkstyleMain NO-SOURCE
> Task :streams:upgrade-system-tests-25:compileTestJava
> Task :streams:upgrade-system-tests-25:processTestResources NO-SOURCE
> Task :streams:upgrade-system-tests-25:testClasses
> Task :streams:upgrade-system-tests-25:checkstyleTest
> Task :streams:upgrade-system-tests-25:spotbugsMain NO-SOURCE
> Task :streams:upgrade-system-tests-25:test

FAILURE: Build failed with an exception.

* What went wrong:
Execution failed for task ':core:test'.
> There were failing tests. See the report at: file://<https://builds.apache.org/job/kafka-trunk-jdk11/ws/core/build/reports/tests/test/index.html>

* Try:
Run with --stacktrace option to get the stack trace. Run with --info or --debug option to get more log output. Run with --scan to get full insights.

* Get more help at https://help.gradle.org

Deprecated Gradle features were used in this build, making it incompatible with Gradle 7.0.
Use '--warning-mode all' to show the individual deprecation warnings.
See https://docs.gradle.org/6.5/userguide/command_line_interface.html#sec:command_line_warnings

BUILD FAILED in 1h 54m 49s
215 actionable tasks: 183 executed, 32 up-to-date
Build step 'Execute shell' marked build as failure
Recording test results
ERROR: No tool found matching GRADLE_4_10_2_HOME
Setting GRADLE_4_10_3_HOME=/home/jenkins/tools/gradle/4.10.3
ERROR: No tool found matching GRADLE_4_10_2_HOME
Setting GRADLE_4_10_3_HOME=/home/jenkins/tools/gradle/4.10.3
Not sending mail to unregistered user noreply@github.com

Build failed in Jenkins: kafka-trunk-jdk11 #1571

Posted by Apache Jenkins Server <je...@builds.apache.org>.
See <https://builds.apache.org/job/kafka-trunk-jdk11/1571/display/redirect?page=changes>

Changes:

[github] MINOR: Documentation for KIP-585 (#8839)


------------------------------------------
[...truncated 3.17 MB...]
org.apache.kafka.streams.TopologyTestDriverTest > shouldRespectTaskIdling[Eos enabled = false] PASSED

org.apache.kafka.streams.TopologyTestDriverTest > shouldUseSourceSpecificDeserializers[Eos enabled = false] STARTED

org.apache.kafka.streams.TopologyTestDriverTest > shouldUseSourceSpecificDeserializers[Eos enabled = false] PASSED

org.apache.kafka.streams.TopologyTestDriverTest > shouldReturnAllStores[Eos enabled = false] STARTED

org.apache.kafka.streams.TopologyTestDriverTest > shouldReturnAllStores[Eos enabled = false] PASSED

org.apache.kafka.streams.TopologyTestDriverTest > shouldNotCreateStateDirectoryForStatelessTopology[Eos enabled = false] STARTED

org.apache.kafka.streams.TopologyTestDriverTest > shouldNotCreateStateDirectoryForStatelessTopology[Eos enabled = false] PASSED

org.apache.kafka.streams.TopologyTestDriverTest > shouldApplyGlobalUpdatesCorrectlyInRecursiveTopologies[Eos enabled = false] STARTED

org.apache.kafka.streams.TopologyTestDriverTest > shouldApplyGlobalUpdatesCorrectlyInRecursiveTopologies[Eos enabled = false] PASSED

org.apache.kafka.streams.TopologyTestDriverTest > shouldReturnAllStoresNames[Eos enabled = false] STARTED

org.apache.kafka.streams.TopologyTestDriverTest > shouldReturnAllStoresNames[Eos enabled = false] PASSED

org.apache.kafka.streams.TopologyTestDriverTest > shouldPassRecordHeadersIntoSerializersAndDeserializers[Eos enabled = false] STARTED

org.apache.kafka.streams.TopologyTestDriverTest > shouldPassRecordHeadersIntoSerializersAndDeserializers[Eos enabled = false] PASSED

org.apache.kafka.streams.TopologyTestDriverTest > shouldProcessConsumerRecordList[Eos enabled = false] STARTED

org.apache.kafka.streams.TopologyTestDriverTest > shouldProcessConsumerRecordList[Eos enabled = false] PASSED

org.apache.kafka.streams.TopologyTestDriverTest > shouldUseSinkSpecificSerializers[Eos enabled = false] STARTED

org.apache.kafka.streams.TopologyTestDriverTest > shouldUseSinkSpecificSerializers[Eos enabled = false] PASSED

org.apache.kafka.streams.TopologyTestDriverTest > shouldFlushStoreForFirstInput[Eos enabled = false] STARTED

org.apache.kafka.streams.TopologyTestDriverTest > shouldFlushStoreForFirstInput[Eos enabled = false] PASSED

org.apache.kafka.streams.TopologyTestDriverTest > shouldProcessFromSourceThatMatchPattern[Eos enabled = false] STARTED

org.apache.kafka.streams.TopologyTestDriverTest > shouldProcessFromSourceThatMatchPattern[Eos enabled = false] PASSED

org.apache.kafka.streams.TopologyTestDriverTest > shouldCaptureSinkTopicNamesIfWrittenInto[Eos enabled = false] STARTED

org.apache.kafka.streams.TopologyTestDriverTest > shouldCaptureSinkTopicNamesIfWrittenInto[Eos enabled = false] PASSED

org.apache.kafka.streams.TopologyTestDriverTest > shouldUpdateStoreForNewKey[Eos enabled = false] STARTED

org.apache.kafka.streams.TopologyTestDriverTest > shouldUpdateStoreForNewKey[Eos enabled = false] PASSED

org.apache.kafka.streams.TopologyTestDriverTest > shouldSendRecordViaCorrectSourceTopicDeprecated[Eos enabled = false] STARTED

org.apache.kafka.streams.TopologyTestDriverTest > shouldSendRecordViaCorrectSourceTopicDeprecated[Eos enabled = false] PASSED

org.apache.kafka.streams.TopologyTestDriverTest > shouldPunctuateOnWallClockTime[Eos enabled = false] STARTED

org.apache.kafka.streams.TopologyTestDriverTest > shouldPunctuateOnWallClockTime[Eos enabled = false] PASSED

org.apache.kafka.streams.TopologyTestDriverTest > shouldSetRecordMetadata[Eos enabled = false] STARTED

org.apache.kafka.streams.TopologyTestDriverTest > shouldSetRecordMetadata[Eos enabled = false] PASSED

org.apache.kafka.streams.TopologyTestDriverTest > shouldNotUpdateStoreForLargerValue[Eos enabled = false] STARTED

org.apache.kafka.streams.TopologyTestDriverTest > shouldNotUpdateStoreForLargerValue[Eos enabled = false] PASSED

org.apache.kafka.streams.TopologyTestDriverTest > shouldReturnCorrectInMemoryStoreTypeOnly[Eos enabled = false] STARTED

org.apache.kafka.streams.TopologyTestDriverTest > shouldReturnCorrectInMemoryStoreTypeOnly[Eos enabled = false] PASSED

org.apache.kafka.streams.TopologyTestDriverTest > shouldThrowForMissingTime[Eos enabled = false] STARTED

org.apache.kafka.streams.TopologyTestDriverTest > shouldThrowForMissingTime[Eos enabled = false] PASSED

org.apache.kafka.streams.TopologyTestDriverTest > shouldCaptureInternalTopicNamesIfWrittenInto[Eos enabled = false] STARTED

org.apache.kafka.streams.TopologyTestDriverTest > shouldCaptureInternalTopicNamesIfWrittenInto[Eos enabled = false] PASSED

org.apache.kafka.streams.TopologyTestDriverTest > shouldPunctuateOnWallClockTimeDeprecated[Eos enabled = false] STARTED

org.apache.kafka.streams.TopologyTestDriverTest > shouldPunctuateOnWallClockTimeDeprecated[Eos enabled = false] PASSED

org.apache.kafka.streams.TopologyTestDriverTest > shouldProcessRecordForTopic[Eos enabled = false] STARTED

org.apache.kafka.streams.TopologyTestDriverTest > shouldProcessRecordForTopic[Eos enabled = false] PASSED

org.apache.kafka.streams.TopologyTestDriverTest > shouldForwardRecordsFromSubtopologyToSubtopology[Eos enabled = false] STARTED

org.apache.kafka.streams.TopologyTestDriverTest > shouldForwardRecordsFromSubtopologyToSubtopology[Eos enabled = false] PASSED

org.apache.kafka.streams.TopologyTestDriverTest > shouldNotUpdateStoreForSmallerValue[Eos enabled = false] STARTED

org.apache.kafka.streams.TopologyTestDriverTest > shouldNotUpdateStoreForSmallerValue[Eos enabled = false] PASSED

org.apache.kafka.streams.TopologyTestDriverTest > shouldCreateStateDirectoryForStatefulTopology[Eos enabled = false] STARTED

org.apache.kafka.streams.TopologyTestDriverTest > shouldCreateStateDirectoryForStatefulTopology[Eos enabled = false] PASSED

org.apache.kafka.streams.TopologyTestDriverTest > shouldPunctuateIfWallClockTimeAdvances[Eos enabled = false] STARTED

org.apache.kafka.streams.TopologyTestDriverTest > shouldPunctuateIfWallClockTimeAdvances[Eos enabled = false] PASSED

> Task :streams:upgrade-system-tests-0101:processResources NO-SOURCE
> Task :streams:upgrade-system-tests-0101:classes UP-TO-DATE
> Task :streams:upgrade-system-tests-0101:checkstyleMain NO-SOURCE
> Task :streams:upgrade-system-tests-0101:compileTestJava
> Task :streams:upgrade-system-tests-0101:processTestResources NO-SOURCE
> Task :streams:upgrade-system-tests-0101:testClasses
> Task :streams:upgrade-system-tests-0101:checkstyleTest
> Task :streams:upgrade-system-tests-0101:spotbugsMain NO-SOURCE
> Task :streams:upgrade-system-tests-0101:test
> Task :streams:upgrade-system-tests-0102:compileJava NO-SOURCE
> Task :streams:upgrade-system-tests-0102:processResources NO-SOURCE
> Task :streams:upgrade-system-tests-0102:classes UP-TO-DATE
> Task :streams:upgrade-system-tests-0102:checkstyleMain NO-SOURCE
> Task :streams:upgrade-system-tests-0102:compileTestJava
> Task :streams:upgrade-system-tests-0102:processTestResources NO-SOURCE
> Task :streams:upgrade-system-tests-0102:testClasses
> Task :streams:upgrade-system-tests-0102:checkstyleTest
> Task :streams:upgrade-system-tests-0102:spotbugsMain NO-SOURCE
> Task :streams:upgrade-system-tests-0102:test
> Task :streams:upgrade-system-tests-0110:compileJava NO-SOURCE
> Task :streams:upgrade-system-tests-0110:processResources NO-SOURCE
> Task :streams:upgrade-system-tests-0110:classes UP-TO-DATE
> Task :streams:upgrade-system-tests-0110:checkstyleMain NO-SOURCE
> Task :streams:upgrade-system-tests-0110:compileTestJava
> Task :streams:upgrade-system-tests-0110:processTestResources NO-SOURCE
> Task :streams:upgrade-system-tests-0110:testClasses
> Task :streams:upgrade-system-tests-0110:checkstyleTest
> Task :streams:upgrade-system-tests-0110:spotbugsMain NO-SOURCE
> Task :streams:upgrade-system-tests-0110:test
> Task :streams:upgrade-system-tests-10:compileJava NO-SOURCE
> Task :streams:upgrade-system-tests-10:processResources NO-SOURCE
> Task :streams:upgrade-system-tests-10:classes UP-TO-DATE
> Task :streams:upgrade-system-tests-10:checkstyleMain NO-SOURCE
> Task :streams:upgrade-system-tests-10:compileTestJava
> Task :streams:upgrade-system-tests-10:processTestResources NO-SOURCE
> Task :streams:upgrade-system-tests-10:testClasses
> Task :streams:upgrade-system-tests-10:checkstyleTest
> Task :streams:upgrade-system-tests-10:spotbugsMain NO-SOURCE
> Task :streams:upgrade-system-tests-10:test
> Task :streams:upgrade-system-tests-11:compileJava NO-SOURCE
> Task :streams:upgrade-system-tests-11:processResources NO-SOURCE
> Task :streams:upgrade-system-tests-11:classes UP-TO-DATE
> Task :streams:upgrade-system-tests-11:checkstyleMain NO-SOURCE
> Task :streams:upgrade-system-tests-11:compileTestJava
> Task :streams:upgrade-system-tests-11:processTestResources NO-SOURCE
> Task :streams:upgrade-system-tests-11:testClasses
> Task :streams:upgrade-system-tests-11:checkstyleTest
> Task :streams:upgrade-system-tests-11:spotbugsMain NO-SOURCE
> Task :streams:upgrade-system-tests-11:test
> Task :streams:upgrade-system-tests-20:compileJava NO-SOURCE
> Task :streams:upgrade-system-tests-20:processResources NO-SOURCE
> Task :streams:upgrade-system-tests-20:classes UP-TO-DATE
> Task :streams:upgrade-system-tests-20:checkstyleMain NO-SOURCE
> Task :streams:upgrade-system-tests-20:compileTestJava
> Task :streams:upgrade-system-tests-20:processTestResources NO-SOURCE
> Task :streams:upgrade-system-tests-20:testClasses
> Task :streams:upgrade-system-tests-20:checkstyleTest
> Task :streams:upgrade-system-tests-20:spotbugsMain NO-SOURCE
> Task :streams:upgrade-system-tests-20:test
> Task :streams:upgrade-system-tests-21:compileJava NO-SOURCE
> Task :streams:upgrade-system-tests-21:processResources NO-SOURCE
> Task :streams:upgrade-system-tests-21:classes UP-TO-DATE
> Task :streams:upgrade-system-tests-21:checkstyleMain NO-SOURCE
> Task :streams:upgrade-system-tests-21:compileTestJava
> Task :streams:upgrade-system-tests-21:processTestResources NO-SOURCE
> Task :streams:upgrade-system-tests-21:testClasses
> Task :streams:upgrade-system-tests-21:checkstyleTest
> Task :streams:upgrade-system-tests-21:spotbugsMain NO-SOURCE
> Task :streams:upgrade-system-tests-21:test
> Task :streams:upgrade-system-tests-22:compileJava NO-SOURCE
> Task :streams:upgrade-system-tests-22:processResources NO-SOURCE
> Task :streams:upgrade-system-tests-22:classes UP-TO-DATE
> Task :streams:upgrade-system-tests-22:checkstyleMain NO-SOURCE
> Task :streams:upgrade-system-tests-22:compileTestJava
> Task :streams:upgrade-system-tests-22:processTestResources NO-SOURCE
> Task :streams:upgrade-system-tests-22:testClasses
> Task :streams:upgrade-system-tests-22:checkstyleTest
> Task :streams:upgrade-system-tests-22:spotbugsMain NO-SOURCE
> Task :streams:upgrade-system-tests-22:test
> Task :streams:upgrade-system-tests-23:compileJava NO-SOURCE
> Task :streams:upgrade-system-tests-23:processResources NO-SOURCE
> Task :streams:upgrade-system-tests-23:classes UP-TO-DATE
> Task :streams:upgrade-system-tests-23:checkstyleMain NO-SOURCE
> Task :streams:upgrade-system-tests-23:compileTestJava
> Task :streams:upgrade-system-tests-23:processTestResources NO-SOURCE
> Task :streams:upgrade-system-tests-23:testClasses
> Task :streams:upgrade-system-tests-23:checkstyleTest
> Task :streams:upgrade-system-tests-23:spotbugsMain NO-SOURCE
> Task :streams:upgrade-system-tests-23:test
> Task :streams:upgrade-system-tests-24:compileJava NO-SOURCE
> Task :streams:upgrade-system-tests-24:processResources NO-SOURCE
> Task :streams:upgrade-system-tests-24:classes UP-TO-DATE
> Task :streams:upgrade-system-tests-24:checkstyleMain NO-SOURCE
> Task :streams:upgrade-system-tests-24:compileTestJava
> Task :streams:upgrade-system-tests-24:processTestResources NO-SOURCE
> Task :streams:upgrade-system-tests-24:testClasses
> Task :streams:upgrade-system-tests-24:checkstyleTest
> Task :streams:upgrade-system-tests-24:spotbugsMain NO-SOURCE
> Task :streams:upgrade-system-tests-24:test
> Task :streams:upgrade-system-tests-25:compileJava NO-SOURCE
> Task :streams:upgrade-system-tests-25:processResources NO-SOURCE
> Task :streams:upgrade-system-tests-25:classes UP-TO-DATE
> Task :streams:upgrade-system-tests-25:checkstyleMain NO-SOURCE
> Task :streams:upgrade-system-tests-25:compileTestJava
> Task :streams:upgrade-system-tests-25:processTestResources NO-SOURCE
> Task :streams:upgrade-system-tests-25:testClasses
> Task :streams:upgrade-system-tests-25:checkstyleTest
> Task :streams:upgrade-system-tests-25:spotbugsMain NO-SOURCE
> Task :streams:upgrade-system-tests-25:test

FAILURE: Build completed with 2 failures.

1: Task failed with an exception.
-----------
* What went wrong:
Execution failed for task ':core:test'.
> There were failing tests. See the report at: file://<https://builds.apache.org/job/kafka-trunk-jdk11/ws/core/build/reports/tests/test/index.html>

* Try:
Run with --stacktrace option to get the stack trace. Run with --info or --debug option to get more log output. Run with --scan to get full insights.
==============================================================================

2: Task failed with an exception.
-----------
* What went wrong:
Execution failed for task ':connect:mirror:test'.
> There were failing tests. See the report at: file://<https://builds.apache.org/job/kafka-trunk-jdk11/ws/connect/mirror/build/reports/tests/test/index.html>

* Try:
Run with --stacktrace option to get the stack trace. Run with --info or --debug option to get more log output. Run with --scan to get full insights.
==============================================================================

* Get more help at https://help.gradle.org

Deprecated Gradle features were used in this build, making it incompatible with Gradle 7.0.
Use '--warning-mode all' to show the individual deprecation warnings.
See https://docs.gradle.org/6.5/userguide/command_line_interface.html#sec:command_line_warnings

BUILD FAILED in 2h 3m 59s
215 actionable tasks: 183 executed, 32 up-to-date
Build step 'Execute shell' marked build as failure
Recording test results
ERROR: No tool found matching GRADLE_4_10_2_HOME
Setting GRADLE_4_10_3_HOME=/home/jenkins/tools/gradle/4.10.3
ERROR: No tool found matching GRADLE_4_10_2_HOME
Setting GRADLE_4_10_3_HOME=/home/jenkins/tools/gradle/4.10.3
Not sending mail to unregistered user noreply@github.com

Build failed in Jenkins: kafka-trunk-jdk11 #1570

Posted by Apache Jenkins Server <je...@builds.apache.org>.
See <https://builds.apache.org/job/kafka-trunk-jdk11/1570/display/redirect?page=changes>

Changes:

[github] HOTFIX: checkstyle error in ProcessorStateManager (#8874)


------------------------------------------
[...truncated 1.89 MB...]

kafka.utils.json.JsonValueTest > testDecodeDouble PASSED

kafka.utils.json.JsonValueTest > testDecodeOption STARTED

kafka.utils.json.JsonValueTest > testDecodeOption PASSED

kafka.utils.json.JsonValueTest > testDecodeString STARTED

kafka.utils.json.JsonValueTest > testDecodeString PASSED

kafka.utils.json.JsonValueTest > testJsonValueToString STARTED

kafka.utils.json.JsonValueTest > testJsonValueToString PASSED

kafka.utils.json.JsonValueTest > testAsJsonObjectOption STARTED

kafka.utils.json.JsonValueTest > testAsJsonObjectOption PASSED

kafka.utils.json.JsonValueTest > testAsJsonArrayOption STARTED

kafka.utils.json.JsonValueTest > testAsJsonArrayOption PASSED

kafka.utils.json.JsonValueTest > testAsJsonArray STARTED

kafka.utils.json.JsonValueTest > testAsJsonArray PASSED

kafka.utils.json.JsonValueTest > testJsonValueHashCode STARTED

kafka.utils.json.JsonValueTest > testJsonValueHashCode PASSED

kafka.utils.json.JsonValueTest > testDecodeInt STARTED

kafka.utils.json.JsonValueTest > testDecodeInt PASSED

kafka.utils.json.JsonValueTest > testDecodeMap STARTED

kafka.utils.json.JsonValueTest > testDecodeMap PASSED

kafka.utils.json.JsonValueTest > testDecodeSeq STARTED

kafka.utils.json.JsonValueTest > testDecodeSeq PASSED

kafka.utils.json.JsonValueTest > testJsonObjectGet STARTED

kafka.utils.json.JsonValueTest > testJsonObjectGet PASSED

kafka.utils.json.JsonValueTest > testJsonValueEquals STARTED

kafka.utils.json.JsonValueTest > testJsonValueEquals PASSED

kafka.utils.json.JsonValueTest > testJsonArrayIterator STARTED

kafka.utils.json.JsonValueTest > testJsonArrayIterator PASSED

kafka.utils.json.JsonValueTest > testJsonObjectApply STARTED

kafka.utils.json.JsonValueTest > testJsonObjectApply PASSED

kafka.utils.json.JsonValueTest > testDecodeBoolean STARTED

kafka.utils.json.JsonValueTest > testDecodeBoolean PASSED

kafka.utils.timer.TimerTaskListTest > testAll STARTED

kafka.utils.timer.TimerTaskListTest > testAll PASSED

kafka.utils.ShutdownableThreadTest > testShutdownWhenCalledAfterThreadStart STARTED

kafka.utils.ShutdownableThreadTest > testShutdownWhenCalledAfterThreadStart PASSED

kafka.utils.CommandLineUtilsTest > testParseEmptyArg STARTED

kafka.utils.CommandLineUtilsTest > testParseEmptyArg PASSED

kafka.utils.CommandLineUtilsTest > testMaybeMergeOptionsOverwriteExisting STARTED

kafka.utils.CommandLineUtilsTest > testMaybeMergeOptionsOverwriteExisting PASSED

kafka.utils.CommandLineUtilsTest > testParseSingleArg STARTED

kafka.utils.CommandLineUtilsTest > testParseSingleArg PASSED

kafka.utils.CommandLineUtilsTest > testParseArgs STARTED

kafka.utils.CommandLineUtilsTest > testParseArgs PASSED

kafka.utils.CommandLineUtilsTest > testParseArgsWithMultipleDelimiters STARTED

kafka.utils.CommandLineUtilsTest > testParseArgsWithMultipleDelimiters PASSED

kafka.utils.CommandLineUtilsTest > testMaybeMergeOptionsDefaultValueIfNotExist STARTED

kafka.utils.CommandLineUtilsTest > testMaybeMergeOptionsDefaultValueIfNotExist PASSED

kafka.utils.CommandLineUtilsTest > testParseEmptyArgWithNoDelimiter STARTED

kafka.utils.CommandLineUtilsTest > testParseEmptyArgWithNoDelimiter PASSED

kafka.utils.CommandLineUtilsTest > testMaybeMergeOptionsDefaultOverwriteExisting STARTED

kafka.utils.CommandLineUtilsTest > testMaybeMergeOptionsDefaultOverwriteExisting PASSED

kafka.utils.CommandLineUtilsTest > testParseEmptyArgAsValid STARTED

kafka.utils.CommandLineUtilsTest > testParseEmptyArgAsValid PASSED

kafka.utils.CommandLineUtilsTest > testMaybeMergeOptionsNotOverwriteExisting STARTED

kafka.utils.CommandLineUtilsTest > testMaybeMergeOptionsNotOverwriteExisting PASSED

kafka.tools.CustomDeserializerTest > checkDeserializerTopicIsNotNull STARTED

kafka.tools.CustomDeserializerTest > checkDeserializerTopicIsNotNull PASSED

kafka.tools.CustomDeserializerTest > checkFormatterCallDeserializerWithHeaders STARTED

kafka.tools.CustomDeserializerTest > checkFormatterCallDeserializerWithHeaders PASSED

kafka.tools.ConsumerPerformanceTest > testDetailedHeaderMatchBody STARTED

kafka.tools.ConsumerPerformanceTest > testDetailedHeaderMatchBody PASSED

kafka.tools.ConsumerPerformanceTest > testConfigWithUnrecognizedOption STARTED

kafka.tools.ConsumerPerformanceTest > testConfigWithUnrecognizedOption PASSED

kafka.tools.ConsumerPerformanceTest > testBrokerListOverride STARTED

kafka.tools.ConsumerPerformanceTest > testBrokerListOverride PASSED

kafka.tools.ConsumerPerformanceTest > testConfigBootStrapServer STARTED

kafka.tools.ConsumerPerformanceTest > testConfigBootStrapServer PASSED

kafka.tools.ConsumerPerformanceTest > testConfigBrokerList STARTED

kafka.tools.ConsumerPerformanceTest > testConfigBrokerList PASSED

kafka.tools.ConsumerPerformanceTest > testNonDetailedHeaderMatchBody STARTED

kafka.tools.ConsumerPerformanceTest > testNonDetailedHeaderMatchBody PASSED

kafka.tools.ReplicaVerificationToolTest > testReplicaBufferVerifyChecksum STARTED

kafka.tools.ReplicaVerificationToolTest > testReplicaBufferVerifyChecksum PASSED

kafka.tools.DumpLogSegmentsTest > testPrintDataLog STARTED

kafka.tools.DumpLogSegmentsTest > testPrintDataLog PASSED

kafka.tools.DumpLogSegmentsTest > testDumpIndexMismatches STARTED

kafka.tools.DumpLogSegmentsTest > testDumpIndexMismatches PASSED

kafka.tools.DumpLogSegmentsTest > testDumpTimeIndexErrors STARTED

kafka.tools.DumpLogSegmentsTest > testDumpTimeIndexErrors PASSED

kafka.metrics.KafkaTimerTest > testKafkaTimer STARTED

kafka.metrics.KafkaTimerTest > testKafkaTimer PASSED

kafka.zookeeper.ZooKeeperClientTest > testZNodeChangeHandlerForDataChange STARTED

kafka.zookeeper.ZooKeeperClientTest > testZNodeChangeHandlerForDataChange PASSED

kafka.zookeeper.ZooKeeperClientTest > testZooKeeperSessionStateMetric STARTED

kafka.zookeeper.ZooKeeperClientTest > testZooKeeperSessionStateMetric PASSED

kafka.zookeeper.ZooKeeperClientTest > testExceptionInBeforeInitializingSession STARTED

kafka.zookeeper.ZooKeeperClientTest > testExceptionInBeforeInitializingSession PASSED

kafka.zookeeper.ZooKeeperClientTest > testGetChildrenExistingZNode STARTED

kafka.zookeeper.ZooKeeperClientTest > testGetChildrenExistingZNode PASSED

kafka.zookeeper.ZooKeeperClientTest > testConnection STARTED

kafka.zookeeper.ZooKeeperClientTest > testConnection PASSED

kafka.zookeeper.ZooKeeperClientTest > testZNodeChangeHandlerForCreation STARTED

kafka.zookeeper.ZooKeeperClientTest > testZNodeChangeHandlerForCreation PASSED

kafka.zookeeper.ZooKeeperClientTest > testGetAclExistingZNode STARTED

kafka.zookeeper.ZooKeeperClientTest > testGetAclExistingZNode PASSED

kafka.zookeeper.ZooKeeperClientTest > testSessionExpiryDuringClose STARTED

kafka.zookeeper.ZooKeeperClientTest > testSessionExpiryDuringClose PASSED

kafka.zookeeper.ZooKeeperClientTest > testSetAclNonExistentZNode STARTED

kafka.zookeeper.ZooKeeperClientTest > testSetAclNonExistentZNode PASSED

kafka.zookeeper.ZooKeeperClientTest > testConnectionLossRequestTermination STARTED

kafka.zookeeper.ZooKeeperClientTest > testConnectionLossRequestTermination PASSED

kafka.zookeeper.ZooKeeperClientTest > testExistsNonExistentZNode STARTED

kafka.zookeeper.ZooKeeperClientTest > testExistsNonExistentZNode PASSED

kafka.zookeeper.ZooKeeperClientTest > testGetDataNonExistentZNode STARTED

kafka.zookeeper.ZooKeeperClientTest > testGetDataNonExistentZNode PASSED

kafka.zookeeper.ZooKeeperClientTest > testConnectionTimeout STARTED

kafka.zookeeper.ZooKeeperClientTest > testConnectionTimeout PASSED

kafka.zookeeper.ZooKeeperClientTest > testBlockOnRequestCompletionFromStateChangeHandler STARTED
ERROR: No tool found matching GRADLE_4_10_2_HOME
ERROR: Could not install GRADLE_4_10_3_HOME
java.lang.NullPointerException
ERROR: No tool found matching GRADLE_4_10_2_HOME
ERROR: Could not install GRADLE_4_10_3_HOME
java.lang.NullPointerException
ERROR: No tool found matching GRADLE_4_10_2_HOME
ERROR: Could not install GRADLE_4_10_3_HOME
java.lang.NullPointerException
ERROR: No tool found matching GRADLE_4_10_2_HOME
ERROR: Could not install GRADLE_4_10_3_HOME
java.lang.NullPointerException
ERROR: No tool found matching GRADLE_4_10_2_HOME
ERROR: Could not install GRADLE_4_10_3_HOME
java.lang.NullPointerException
ERROR: No tool found matching GRADLE_4_10_2_HOME
ERROR: Could not install GRADLE_4_10_3_HOME
java.lang.NullPointerException
ERROR: No tool found matching GRADLE_4_10_2_HOME
ERROR: Could not install GRADLE_4_10_3_HOME
java.lang.NullPointerException
Build timed out (after 480 minutes). Marking the build as failed.
Build was aborted
Recording test results
ERROR: No tool found matching GRADLE_4_10_2_HOME
Setting GRADLE_4_10_3_HOME=/home/jenkins/tools/gradle/4.10.3
ERROR: No tool found matching GRADLE_4_10_2_HOME
Setting GRADLE_4_10_3_HOME=/home/jenkins/tools/gradle/4.10.3
Not sending mail to unregistered user noreply@github.com

kafka.zookeeper.ZooKeeperClientTest > testBlockOnRequestCompletionFromStateChangeHandler SKIPPED

2777 tests completed, 1 failed, 8 skipped