You are viewing a plain text version of this content. The canonical link for it is here.
Posted to dev@lucene.apache.org by Policeman Jenkins Server <je...@thetaphi.de> on 2018/08/23 23:56:23 UTC

[JENKINS] Lucene-Solr-master-Linux (64bit/jdk1.8.0_172) - Build # 22732 - Still Unstable!

Build: https://jenkins.thetaphi.de/job/Lucene-Solr-master-Linux/22732/
Java: 64bit/jdk1.8.0_172 -XX:-UseCompressedOops -XX:+UseConcMarkSweepGC

4 tests failed.
FAILED:  org.apache.solr.handler.export.TestExportWriter.testMultipleSorts

Error Message:


Stack Trace:
java.lang.AssertionError
	at __randomizedtesting.SeedInfo.seed([FBDB2884CBB0889D:D2E9E06DE2A595BB]:0)
	at org.junit.Assert.fail(Assert.java:92)
	at org.junit.Assert.assertTrue(Assert.java:43)
	at org.junit.Assert.assertTrue(Assert.java:54)
	at org.apache.solr.handler.export.TestExportWriter.validateSort(TestExportWriter.java:697)
	at org.apache.solr.handler.export.TestExportWriter.testMultipleSorts(TestExportWriter.java:637)
	at sun.reflect.NativeMethodAccessorImpl.invoke0(Native Method)
	at sun.reflect.NativeMethodAccessorImpl.invoke(NativeMethodAccessorImpl.java:62)
	at sun.reflect.DelegatingMethodAccessorImpl.invoke(DelegatingMethodAccessorImpl.java:43)
	at java.lang.reflect.Method.invoke(Method.java:498)
	at com.carrotsearch.randomizedtesting.RandomizedRunner.invoke(RandomizedRunner.java:1737)
	at com.carrotsearch.randomizedtesting.RandomizedRunner$8.evaluate(RandomizedRunner.java:934)
	at com.carrotsearch.randomizedtesting.RandomizedRunner$9.evaluate(RandomizedRunner.java:970)
	at com.carrotsearch.randomizedtesting.RandomizedRunner$10.evaluate(RandomizedRunner.java:984)
	at com.carrotsearch.randomizedtesting.rules.SystemPropertiesRestoreRule$1.evaluate(SystemPropertiesRestoreRule.java:57)
	at org.apache.lucene.util.TestRuleSetupTeardownChained$1.evaluate(TestRuleSetupTeardownChained.java:49)
	at org.apache.lucene.util.AbstractBeforeAfterRule$1.evaluate(AbstractBeforeAfterRule.java:45)
	at org.apache.lucene.util.TestRuleThreadAndTestName$1.evaluate(TestRuleThreadAndTestName.java:48)
	at org.apache.lucene.util.TestRuleIgnoreAfterMaxFailures$1.evaluate(TestRuleIgnoreAfterMaxFailures.java:64)
	at org.apache.lucene.util.TestRuleMarkFailure$1.evaluate(TestRuleMarkFailure.java:47)
	at com.carrotsearch.randomizedtesting.rules.StatementAdapter.evaluate(StatementAdapter.java:36)
	at com.carrotsearch.randomizedtesting.ThreadLeakControl$StatementRunner.run(ThreadLeakControl.java:368)
	at com.carrotsearch.randomizedtesting.ThreadLeakControl.forkTimeoutingTask(ThreadLeakControl.java:817)
	at com.carrotsearch.randomizedtesting.ThreadLeakControl$3.evaluate(ThreadLeakControl.java:468)
	at com.carrotsearch.randomizedtesting.RandomizedRunner.runSingleTest(RandomizedRunner.java:943)
	at com.carrotsearch.randomizedtesting.RandomizedRunner$5.evaluate(RandomizedRunner.java:829)
	at com.carrotsearch.randomizedtesting.RandomizedRunner$6.evaluate(RandomizedRunner.java:879)
	at com.carrotsearch.randomizedtesting.RandomizedRunner$7.evaluate(RandomizedRunner.java:890)
	at com.carrotsearch.randomizedtesting.rules.StatementAdapter.evaluate(StatementAdapter.java:36)
	at com.carrotsearch.randomizedtesting.rules.SystemPropertiesRestoreRule$1.evaluate(SystemPropertiesRestoreRule.java:57)
	at org.apache.lucene.util.AbstractBeforeAfterRule$1.evaluate(AbstractBeforeAfterRule.java:45)
	at com.carrotsearch.randomizedtesting.rules.StatementAdapter.evaluate(StatementAdapter.java:36)
	at org.apache.lucene.util.TestRuleStoreClassName$1.evaluate(TestRuleStoreClassName.java:41)
	at com.carrotsearch.randomizedtesting.rules.NoShadowingOrOverridesOnMethodsRule$1.evaluate(NoShadowingOrOverridesOnMethodsRule.java:40)
	at com.carrotsearch.randomizedtesting.rules.NoShadowingOrOverridesOnMethodsRule$1.evaluate(NoShadowingOrOverridesOnMethodsRule.java:40)
	at com.carrotsearch.randomizedtesting.rules.StatementAdapter.evaluate(StatementAdapter.java:36)
	at com.carrotsearch.randomizedtesting.rules.StatementAdapter.evaluate(StatementAdapter.java:36)
	at com.carrotsearch.randomizedtesting.rules.StatementAdapter.evaluate(StatementAdapter.java:36)
	at org.apache.lucene.util.TestRuleAssertionsRequired$1.evaluate(TestRuleAssertionsRequired.java:53)
	at org.apache.lucene.util.TestRuleMarkFailure$1.evaluate(TestRuleMarkFailure.java:47)
	at org.apache.lucene.util.TestRuleIgnoreAfterMaxFailures$1.evaluate(TestRuleIgnoreAfterMaxFailures.java:64)
	at org.apache.lucene.util.TestRuleIgnoreTestSuites$1.evaluate(TestRuleIgnoreTestSuites.java:54)
	at com.carrotsearch.randomizedtesting.rules.StatementAdapter.evaluate(StatementAdapter.java:36)
	at com.carrotsearch.randomizedtesting.ThreadLeakControl$StatementRunner.run(ThreadLeakControl.java:368)
	at java.lang.Thread.run(Thread.java:748)


FAILED:  org.apache.solr.handler.export.TestExportWriter.testMultipleSorts

Error Message:


Stack Trace:
java.lang.AssertionError
	at __randomizedtesting.SeedInfo.seed([FBDB2884CBB0889D:D2E9E06DE2A595BB]:0)
	at org.junit.Assert.fail(Assert.java:92)
	at org.junit.Assert.assertTrue(Assert.java:43)
	at org.junit.Assert.assertTrue(Assert.java:54)
	at org.apache.solr.handler.export.TestExportWriter.validateSort(TestExportWriter.java:697)
	at org.apache.solr.handler.export.TestExportWriter.testMultipleSorts(TestExportWriter.java:637)
	at sun.reflect.NativeMethodAccessorImpl.invoke0(Native Method)
	at sun.reflect.NativeMethodAccessorImpl.invoke(NativeMethodAccessorImpl.java:62)
	at sun.reflect.DelegatingMethodAccessorImpl.invoke(DelegatingMethodAccessorImpl.java:43)
	at java.lang.reflect.Method.invoke(Method.java:498)
	at com.carrotsearch.randomizedtesting.RandomizedRunner.invoke(RandomizedRunner.java:1737)
	at com.carrotsearch.randomizedtesting.RandomizedRunner$8.evaluate(RandomizedRunner.java:934)
	at com.carrotsearch.randomizedtesting.RandomizedRunner$9.evaluate(RandomizedRunner.java:970)
	at com.carrotsearch.randomizedtesting.RandomizedRunner$10.evaluate(RandomizedRunner.java:984)
	at com.carrotsearch.randomizedtesting.rules.SystemPropertiesRestoreRule$1.evaluate(SystemPropertiesRestoreRule.java:57)
	at org.apache.lucene.util.TestRuleSetupTeardownChained$1.evaluate(TestRuleSetupTeardownChained.java:49)
	at org.apache.lucene.util.AbstractBeforeAfterRule$1.evaluate(AbstractBeforeAfterRule.java:45)
	at org.apache.lucene.util.TestRuleThreadAndTestName$1.evaluate(TestRuleThreadAndTestName.java:48)
	at org.apache.lucene.util.TestRuleIgnoreAfterMaxFailures$1.evaluate(TestRuleIgnoreAfterMaxFailures.java:64)
	at org.apache.lucene.util.TestRuleMarkFailure$1.evaluate(TestRuleMarkFailure.java:47)
	at com.carrotsearch.randomizedtesting.rules.StatementAdapter.evaluate(StatementAdapter.java:36)
	at com.carrotsearch.randomizedtesting.ThreadLeakControl$StatementRunner.run(ThreadLeakControl.java:368)
	at com.carrotsearch.randomizedtesting.ThreadLeakControl.forkTimeoutingTask(ThreadLeakControl.java:817)
	at com.carrotsearch.randomizedtesting.ThreadLeakControl$3.evaluate(ThreadLeakControl.java:468)
	at com.carrotsearch.randomizedtesting.RandomizedRunner.runSingleTest(RandomizedRunner.java:943)
	at com.carrotsearch.randomizedtesting.RandomizedRunner$5.evaluate(RandomizedRunner.java:829)
	at com.carrotsearch.randomizedtesting.RandomizedRunner$6.evaluate(RandomizedRunner.java:879)
	at com.carrotsearch.randomizedtesting.RandomizedRunner$7.evaluate(RandomizedRunner.java:890)
	at com.carrotsearch.randomizedtesting.rules.StatementAdapter.evaluate(StatementAdapter.java:36)
	at com.carrotsearch.randomizedtesting.rules.SystemPropertiesRestoreRule$1.evaluate(SystemPropertiesRestoreRule.java:57)
	at org.apache.lucene.util.AbstractBeforeAfterRule$1.evaluate(AbstractBeforeAfterRule.java:45)
	at com.carrotsearch.randomizedtesting.rules.StatementAdapter.evaluate(StatementAdapter.java:36)
	at org.apache.lucene.util.TestRuleStoreClassName$1.evaluate(TestRuleStoreClassName.java:41)
	at com.carrotsearch.randomizedtesting.rules.NoShadowingOrOverridesOnMethodsRule$1.evaluate(NoShadowingOrOverridesOnMethodsRule.java:40)
	at com.carrotsearch.randomizedtesting.rules.NoShadowingOrOverridesOnMethodsRule$1.evaluate(NoShadowingOrOverridesOnMethodsRule.java:40)
	at com.carrotsearch.randomizedtesting.rules.StatementAdapter.evaluate(StatementAdapter.java:36)
	at com.carrotsearch.randomizedtesting.rules.StatementAdapter.evaluate(StatementAdapter.java:36)
	at com.carrotsearch.randomizedtesting.rules.StatementAdapter.evaluate(StatementAdapter.java:36)
	at org.apache.lucene.util.TestRuleAssertionsRequired$1.evaluate(TestRuleAssertionsRequired.java:53)
	at org.apache.lucene.util.TestRuleMarkFailure$1.evaluate(TestRuleMarkFailure.java:47)
	at org.apache.lucene.util.TestRuleIgnoreAfterMaxFailures$1.evaluate(TestRuleIgnoreAfterMaxFailures.java:64)
	at org.apache.lucene.util.TestRuleIgnoreTestSuites$1.evaluate(TestRuleIgnoreTestSuites.java:54)
	at com.carrotsearch.randomizedtesting.rules.StatementAdapter.evaluate(StatementAdapter.java:36)
	at com.carrotsearch.randomizedtesting.ThreadLeakControl$StatementRunner.run(ThreadLeakControl.java:368)
	at java.lang.Thread.run(Thread.java:748)


FAILED:  org.apache.solr.handler.export.TestExportWriter.testMultipleSorts

Error Message:


Stack Trace:
java.lang.AssertionError
	at __randomizedtesting.SeedInfo.seed([FBDB2884CBB0889D:D2E9E06DE2A595BB]:0)
	at org.junit.Assert.fail(Assert.java:92)
	at org.junit.Assert.assertTrue(Assert.java:43)
	at org.junit.Assert.assertTrue(Assert.java:54)
	at org.apache.solr.handler.export.TestExportWriter.validateSort(TestExportWriter.java:697)
	at org.apache.solr.handler.export.TestExportWriter.testMultipleSorts(TestExportWriter.java:637)
	at sun.reflect.NativeMethodAccessorImpl.invoke0(Native Method)
	at sun.reflect.NativeMethodAccessorImpl.invoke(NativeMethodAccessorImpl.java:62)
	at sun.reflect.DelegatingMethodAccessorImpl.invoke(DelegatingMethodAccessorImpl.java:43)
	at java.lang.reflect.Method.invoke(Method.java:498)
	at com.carrotsearch.randomizedtesting.RandomizedRunner.invoke(RandomizedRunner.java:1737)
	at com.carrotsearch.randomizedtesting.RandomizedRunner$8.evaluate(RandomizedRunner.java:934)
	at com.carrotsearch.randomizedtesting.RandomizedRunner$9.evaluate(RandomizedRunner.java:970)
	at com.carrotsearch.randomizedtesting.RandomizedRunner$10.evaluate(RandomizedRunner.java:984)
	at com.carrotsearch.randomizedtesting.rules.SystemPropertiesRestoreRule$1.evaluate(SystemPropertiesRestoreRule.java:57)
	at org.apache.lucene.util.TestRuleSetupTeardownChained$1.evaluate(TestRuleSetupTeardownChained.java:49)
	at org.apache.lucene.util.AbstractBeforeAfterRule$1.evaluate(AbstractBeforeAfterRule.java:45)
	at org.apache.lucene.util.TestRuleThreadAndTestName$1.evaluate(TestRuleThreadAndTestName.java:48)
	at org.apache.lucene.util.TestRuleIgnoreAfterMaxFailures$1.evaluate(TestRuleIgnoreAfterMaxFailures.java:64)
	at org.apache.lucene.util.TestRuleMarkFailure$1.evaluate(TestRuleMarkFailure.java:47)
	at com.carrotsearch.randomizedtesting.rules.StatementAdapter.evaluate(StatementAdapter.java:36)
	at com.carrotsearch.randomizedtesting.ThreadLeakControl$StatementRunner.run(ThreadLeakControl.java:368)
	at com.carrotsearch.randomizedtesting.ThreadLeakControl.forkTimeoutingTask(ThreadLeakControl.java:817)
	at com.carrotsearch.randomizedtesting.ThreadLeakControl$3.evaluate(ThreadLeakControl.java:468)
	at com.carrotsearch.randomizedtesting.RandomizedRunner.runSingleTest(RandomizedRunner.java:943)
	at com.carrotsearch.randomizedtesting.RandomizedRunner$5.evaluate(RandomizedRunner.java:829)
	at com.carrotsearch.randomizedtesting.RandomizedRunner$6.evaluate(RandomizedRunner.java:879)
	at com.carrotsearch.randomizedtesting.RandomizedRunner$7.evaluate(RandomizedRunner.java:890)
	at com.carrotsearch.randomizedtesting.rules.StatementAdapter.evaluate(StatementAdapter.java:36)
	at com.carrotsearch.randomizedtesting.rules.SystemPropertiesRestoreRule$1.evaluate(SystemPropertiesRestoreRule.java:57)
	at org.apache.lucene.util.AbstractBeforeAfterRule$1.evaluate(AbstractBeforeAfterRule.java:45)
	at com.carrotsearch.randomizedtesting.rules.StatementAdapter.evaluate(StatementAdapter.java:36)
	at org.apache.lucene.util.TestRuleStoreClassName$1.evaluate(TestRuleStoreClassName.java:41)
	at com.carrotsearch.randomizedtesting.rules.NoShadowingOrOverridesOnMethodsRule$1.evaluate(NoShadowingOrOverridesOnMethodsRule.java:40)
	at com.carrotsearch.randomizedtesting.rules.NoShadowingOrOverridesOnMethodsRule$1.evaluate(NoShadowingOrOverridesOnMethodsRule.java:40)
	at com.carrotsearch.randomizedtesting.rules.StatementAdapter.evaluate(StatementAdapter.java:36)
	at com.carrotsearch.randomizedtesting.rules.StatementAdapter.evaluate(StatementAdapter.java:36)
	at com.carrotsearch.randomizedtesting.rules.StatementAdapter.evaluate(StatementAdapter.java:36)
	at org.apache.lucene.util.TestRuleAssertionsRequired$1.evaluate(TestRuleAssertionsRequired.java:53)
	at org.apache.lucene.util.TestRuleMarkFailure$1.evaluate(TestRuleMarkFailure.java:47)
	at org.apache.lucene.util.TestRuleIgnoreAfterMaxFailures$1.evaluate(TestRuleIgnoreAfterMaxFailures.java:64)
	at org.apache.lucene.util.TestRuleIgnoreTestSuites$1.evaluate(TestRuleIgnoreTestSuites.java:54)
	at com.carrotsearch.randomizedtesting.rules.StatementAdapter.evaluate(StatementAdapter.java:36)
	at com.carrotsearch.randomizedtesting.ThreadLeakControl$StatementRunner.run(ThreadLeakControl.java:368)
	at java.lang.Thread.run(Thread.java:748)


FAILED:  org.apache.solr.handler.export.TestExportWriter.testMultipleSorts

Error Message:


Stack Trace:
java.lang.AssertionError
	at __randomizedtesting.SeedInfo.seed([FBDB2884CBB0889D:D2E9E06DE2A595BB]:0)
	at org.junit.Assert.fail(Assert.java:92)
	at org.junit.Assert.assertTrue(Assert.java:43)
	at org.junit.Assert.assertTrue(Assert.java:54)
	at org.apache.solr.handler.export.TestExportWriter.validateSort(TestExportWriter.java:697)
	at org.apache.solr.handler.export.TestExportWriter.testMultipleSorts(TestExportWriter.java:637)
	at sun.reflect.NativeMethodAccessorImpl.invoke0(Native Method)
	at sun.reflect.NativeMethodAccessorImpl.invoke(NativeMethodAccessorImpl.java:62)
	at sun.reflect.DelegatingMethodAccessorImpl.invoke(DelegatingMethodAccessorImpl.java:43)
	at java.lang.reflect.Method.invoke(Method.java:498)
	at com.carrotsearch.randomizedtesting.RandomizedRunner.invoke(RandomizedRunner.java:1737)
	at com.carrotsearch.randomizedtesting.RandomizedRunner$8.evaluate(RandomizedRunner.java:934)
	at com.carrotsearch.randomizedtesting.RandomizedRunner$9.evaluate(RandomizedRunner.java:970)
	at com.carrotsearch.randomizedtesting.RandomizedRunner$10.evaluate(RandomizedRunner.java:984)
	at com.carrotsearch.randomizedtesting.rules.SystemPropertiesRestoreRule$1.evaluate(SystemPropertiesRestoreRule.java:57)
	at org.apache.lucene.util.TestRuleSetupTeardownChained$1.evaluate(TestRuleSetupTeardownChained.java:49)
	at org.apache.lucene.util.AbstractBeforeAfterRule$1.evaluate(AbstractBeforeAfterRule.java:45)
	at org.apache.lucene.util.TestRuleThreadAndTestName$1.evaluate(TestRuleThreadAndTestName.java:48)
	at org.apache.lucene.util.TestRuleIgnoreAfterMaxFailures$1.evaluate(TestRuleIgnoreAfterMaxFailures.java:64)
	at org.apache.lucene.util.TestRuleMarkFailure$1.evaluate(TestRuleMarkFailure.java:47)
	at com.carrotsearch.randomizedtesting.rules.StatementAdapter.evaluate(StatementAdapter.java:36)
	at com.carrotsearch.randomizedtesting.ThreadLeakControl$StatementRunner.run(ThreadLeakControl.java:368)
	at com.carrotsearch.randomizedtesting.ThreadLeakControl.forkTimeoutingTask(ThreadLeakControl.java:817)
	at com.carrotsearch.randomizedtesting.ThreadLeakControl$3.evaluate(ThreadLeakControl.java:468)
	at com.carrotsearch.randomizedtesting.RandomizedRunner.runSingleTest(RandomizedRunner.java:943)
	at com.carrotsearch.randomizedtesting.RandomizedRunner$5.evaluate(RandomizedRunner.java:829)
	at com.carrotsearch.randomizedtesting.RandomizedRunner$6.evaluate(RandomizedRunner.java:879)
	at com.carrotsearch.randomizedtesting.RandomizedRunner$7.evaluate(RandomizedRunner.java:890)
	at com.carrotsearch.randomizedtesting.rules.StatementAdapter.evaluate(StatementAdapter.java:36)
	at com.carrotsearch.randomizedtesting.rules.SystemPropertiesRestoreRule$1.evaluate(SystemPropertiesRestoreRule.java:57)
	at org.apache.lucene.util.AbstractBeforeAfterRule$1.evaluate(AbstractBeforeAfterRule.java:45)
	at com.carrotsearch.randomizedtesting.rules.StatementAdapter.evaluate(StatementAdapter.java:36)
	at org.apache.lucene.util.TestRuleStoreClassName$1.evaluate(TestRuleStoreClassName.java:41)
	at com.carrotsearch.randomizedtesting.rules.NoShadowingOrOverridesOnMethodsRule$1.evaluate(NoShadowingOrOverridesOnMethodsRule.java:40)
	at com.carrotsearch.randomizedtesting.rules.NoShadowingOrOverridesOnMethodsRule$1.evaluate(NoShadowingOrOverridesOnMethodsRule.java:40)
	at com.carrotsearch.randomizedtesting.rules.StatementAdapter.evaluate(StatementAdapter.java:36)
	at com.carrotsearch.randomizedtesting.rules.StatementAdapter.evaluate(StatementAdapter.java:36)
	at com.carrotsearch.randomizedtesting.rules.StatementAdapter.evaluate(StatementAdapter.java:36)
	at org.apache.lucene.util.TestRuleAssertionsRequired$1.evaluate(TestRuleAssertionsRequired.java:53)
	at org.apache.lucene.util.TestRuleMarkFailure$1.evaluate(TestRuleMarkFailure.java:47)
	at org.apache.lucene.util.TestRuleIgnoreAfterMaxFailures$1.evaluate(TestRuleIgnoreAfterMaxFailures.java:64)
	at org.apache.lucene.util.TestRuleIgnoreTestSuites$1.evaluate(TestRuleIgnoreTestSuites.java:54)
	at com.carrotsearch.randomizedtesting.rules.StatementAdapter.evaluate(StatementAdapter.java:36)
	at com.carrotsearch.randomizedtesting.ThreadLeakControl$StatementRunner.run(ThreadLeakControl.java:368)
	at java.lang.Thread.run(Thread.java:748)




Build Log:
[...truncated 12465 lines...]
   [junit4] Suite: org.apache.solr.handler.export.TestExportWriter
   [junit4]   2> 73035 INFO  (SUITE-TestExportWriter-seed#[FBDB2884CBB0889D]-worker) [    ] o.a.s.SolrTestCaseJ4 SecureRandom sanity checks: test.solr.allowed.securerandom=null & java.security.egd=file:/dev/./urandom
   [junit4]   2> Creating dataDir: /home/jenkins/workspace/Lucene-Solr-master-Linux/solr/build/solr-core/test/J2/temp/solr.handler.export.TestExportWriter_FBDB2884CBB0889D-001/init-core-data-001
   [junit4]   2> 73035 WARN  (SUITE-TestExportWriter-seed#[FBDB2884CBB0889D]-worker) [    ] o.a.s.SolrTestCaseJ4 startTrackingSearchers: numOpens=9 numCloses=9
   [junit4]   2> 73036 INFO  (SUITE-TestExportWriter-seed#[FBDB2884CBB0889D]-worker) [    ] o.a.s.SolrTestCaseJ4 Using PointFields (NUMERIC_POINTS_SYSPROP=true) w/NUMERIC_DOCVALUES_SYSPROP=true
   [junit4]   2> 73038 INFO  (SUITE-TestExportWriter-seed#[FBDB2884CBB0889D]-worker) [    ] o.a.s.SolrTestCaseJ4 Randomized ssl (true) and clientAuth (true) via: @org.apache.solr.util.RandomizeSSL(reason=, value=NaN, ssl=NaN, clientAuth=NaN)
   [junit4]   2> 73040 INFO  (SUITE-TestExportWriter-seed#[FBDB2884CBB0889D]-worker) [    ] o.a.s.SolrTestCaseJ4 ####initCore
   [junit4]   2> 73040 INFO  (SUITE-TestExportWriter-seed#[FBDB2884CBB0889D]-worker) [    ] o.a.s.c.SolrResourceLoader [null] Added 2 libs to classloader, from paths: [/home/jenkins/workspace/Lucene-Solr-master-Linux/solr/core/src/test-files/solr/collection1/lib, /home/jenkins/workspace/Lucene-Solr-master-Linux/solr/core/src/test-files/solr/collection1/lib/classes]
   [junit4]   2> 73057 INFO  (SUITE-TestExportWriter-seed#[FBDB2884CBB0889D]-worker) [    ] o.a.s.c.SolrConfig Using Lucene MatchVersion: 8.0.0
   [junit4]   2> 73068 INFO  (SUITE-TestExportWriter-seed#[FBDB2884CBB0889D]-worker) [    ] o.a.s.s.IndexSchema [null] Schema name=schema-docValuesMulti
   [junit4]   2> 73074 INFO  (SUITE-TestExportWriter-seed#[FBDB2884CBB0889D]-worker) [    ] o.a.s.s.IndexSchema Loaded schema schema-docValuesMulti/1.6 with uniqueid field id
   [junit4]   2> 73148 INFO  (SUITE-TestExportWriter-seed#[FBDB2884CBB0889D]-worker) [    ] o.a.s.c.TransientSolrCoreCacheDefault Allocating transient cache for 2147483647 transient cores
   [junit4]   2> 73148 INFO  (SUITE-TestExportWriter-seed#[FBDB2884CBB0889D]-worker) [    ] o.a.s.h.a.MetricsHistoryHandler No .system collection, keeping metrics history in memory.
   [junit4]   2> 73158 INFO  (SUITE-TestExportWriter-seed#[FBDB2884CBB0889D]-worker) [    ] o.a.s.m.r.SolrJmxReporter JMX monitoring for 'solr.node' (registry 'solr.node') enabled at server: com.sun.jmx.mbeanserver.JmxMBeanServer@cd15409
   [junit4]   2> 73162 INFO  (SUITE-TestExportWriter-seed#[FBDB2884CBB0889D]-worker) [    ] o.a.s.m.r.SolrJmxReporter JMX monitoring for 'solr.jvm' (registry 'solr.jvm') enabled at server: com.sun.jmx.mbeanserver.JmxMBeanServer@cd15409
   [junit4]   2> 73162 INFO  (SUITE-TestExportWriter-seed#[FBDB2884CBB0889D]-worker) [    ] o.a.s.m.r.SolrJmxReporter JMX monitoring for 'solr.jetty' (registry 'solr.jetty') enabled at server: com.sun.jmx.mbeanserver.JmxMBeanServer@cd15409
   [junit4]   2> 73163 INFO  (coreLoadExecutor-165-thread-1) [    x:collection1] o.a.s.c.SolrResourceLoader [null] Added 2 libs to classloader, from paths: [/home/jenkins/workspace/Lucene-Solr-master-Linux/solr/core/src/test-files/solr/collection1/lib, /home/jenkins/workspace/Lucene-Solr-master-Linux/solr/core/src/test-files/solr/collection1/lib/classes]
   [junit4]   2> 73180 INFO  (coreLoadExecutor-165-thread-1) [    x:collection1] o.a.s.c.SolrConfig Using Lucene MatchVersion: 8.0.0
   [junit4]   2> 73187 INFO  (coreLoadExecutor-165-thread-1) [    x:collection1] o.a.s.s.IndexSchema [collection1] Schema name=schema-docValuesMulti
   [junit4]   2> 73193 INFO  (coreLoadExecutor-165-thread-1) [    x:collection1] o.a.s.s.IndexSchema Loaded schema schema-docValuesMulti/1.6 with uniqueid field id
   [junit4]   2> 73193 INFO  (coreLoadExecutor-165-thread-1) [    x:collection1] o.a.s.c.CoreContainer Creating SolrCore 'collection1' using configuration from instancedir /home/jenkins/workspace/Lucene-Solr-master-Linux/solr/core/src/test-files/solr/collection1, trusted=true
   [junit4]   2> 73193 INFO  (coreLoadExecutor-165-thread-1) [    x:collection1] o.a.s.m.r.SolrJmxReporter JMX monitoring for 'solr.core.collection1' (registry 'solr.core.collection1') enabled at server: com.sun.jmx.mbeanserver.JmxMBeanServer@cd15409
   [junit4]   2> 73193 INFO  (coreLoadExecutor-165-thread-1) [    x:collection1] o.a.s.c.SolrCore solr.RecoveryStrategy.Builder
   [junit4]   2> 73193 INFO  (coreLoadExecutor-165-thread-1) [    x:collection1] o.a.s.c.SolrCore [[collection1] ] Opening new SolrCore at [/home/jenkins/workspace/Lucene-Solr-master-Linux/solr/core/src/test-files/solr/collection1], dataDir=[/home/jenkins/workspace/Lucene-Solr-master-Linux/solr/build/solr-core/test/J2/temp/solr.handler.export.TestExportWriter_FBDB2884CBB0889D-001/init-core-data-001/]
   [junit4]   2> 73195 INFO  (coreLoadExecutor-165-thread-1) [    x:collection1] o.a.s.u.RandomMergePolicy RandomMergePolicy wrapping class org.apache.lucene.index.LogDocMergePolicy: [LogDocMergePolicy: minMergeSize=1000, mergeFactor=28, maxMergeSize=9223372036854775807, maxMergeSizeForForcedMerge=9223372036854775807, calibrateSizeByDeletes=true, maxMergeDocs=2147483647, maxCFSSegmentSizeMB=8.796093022207999E12, noCFSRatio=0.7126371745305893]
   [junit4]   2> 73221 INFO  (coreLoadExecutor-165-thread-1) [    x:collection1] o.a.s.u.CommitTracker Hard AutoCommit: disabled
   [junit4]   2> 73221 INFO  (coreLoadExecutor-165-thread-1) [    x:collection1] o.a.s.u.CommitTracker Soft AutoCommit: disabled
   [junit4]   2> 73222 INFO  (coreLoadExecutor-165-thread-1) [    x:collection1] o.a.s.u.RandomMergePolicy RandomMergePolicy wrapping class org.apache.lucene.index.LogDocMergePolicy: [LogDocMergePolicy: minMergeSize=1000, mergeFactor=41, maxMergeSize=9223372036854775807, maxMergeSizeForForcedMerge=9223372036854775807, calibrateSizeByDeletes=false, maxMergeDocs=2147483647, maxCFSSegmentSizeMB=8.796093022207999E12, noCFSRatio=1.0]
   [junit4]   2> 73222 INFO  (coreLoadExecutor-165-thread-1) [    x:collection1] o.a.s.s.SolrIndexSearcher Opening [Searcher@84f2883[collection1] main]
   [junit4]   2> 73223 WARN  (coreLoadExecutor-165-thread-1) [    x:collection1] o.a.s.r.ManagedResourceStorage Cannot write to config directory /home/jenkins/workspace/Lucene-Solr-master-Linux/solr/core/src/test-files/solr/collection1/conf; switching to use InMemory storage instead.
   [junit4]   2> 73223 INFO  (coreLoadExecutor-165-thread-1) [    x:collection1] o.a.s.h.ReplicationHandler Commits will be reserved for 10000ms.
   [junit4]   2> 73224 INFO  (searcherExecutor-166-thread-1-processing-x:collection1) [    x:collection1] o.a.s.c.SolrCore [collection1] Registered new searcher Searcher@84f2883[collection1] main{ExitableDirectoryReader(UninvertingDirectoryReader())}
   [junit4]   2> 73224 INFO  (SUITE-TestExportWriter-seed#[FBDB2884CBB0889D]-worker) [    ] o.a.s.SolrTestCaseJ4 ####initCore end
   [junit4]   2> 73226 INFO  (TEST-TestExportWriter.testRandomNumerics-seed#[FBDB2884CBB0889D]) [    ] o.a.s.SolrTestCaseJ4 ###Starting testRandomNumerics
   [junit4]   2> 73228 INFO  (TEST-TestExportWriter.testRandomNumerics-seed#[FBDB2884CBB0889D]) [    ] o.a.s.u.DirectUpdateHandler2 [collection1] REMOVING ALL DOCUMENTS FROM INDEX
   [junit4]   2> 73229 INFO  (TEST-TestExportWriter.testRandomNumerics-seed#[FBDB2884CBB0889D]) [    ] o.a.s.u.p.LogUpdateProcessorFactory [collection1]  webapp=null path=null params={}{deleteByQuery=*:*} 0 1
   [junit4]   2> 73231 INFO  (TEST-TestExportWriter.testRandomNumerics-seed#[FBDB2884CBB0889D]) [    ] o.a.s.u.DirectUpdateHandler2 start commit{,optimize=false,openSearcher=true,waitSearcher=true,expungeDeletes=false,softCommit=false,prepareCommit=false}
   [junit4]   2> 73231 INFO  (TEST-TestExportWriter.testRandomNumerics-seed#[FBDB2884CBB0889D]) [    ] o.a.s.u.SolrIndexWriter Calling setCommitData with IW:org.apache.solr.update.SolrIndexWriter@1508eb19 commitCommandVersion:0
   [junit4]   2> 73232 INFO  (TEST-TestExportWriter.testRandomNumerics-seed#[FBDB2884CBB0889D]) [    ] o.a.s.s.SolrIndexSearcher Opening [Searcher@594ce44d[collection1] main]
   [junit4]   2> 73233 INFO  (TEST-TestExportWriter.testRandomNumerics-seed#[FBDB2884CBB0889D]) [    ] o.a.s.u.DirectUpdateHandler2 end_commit_flush
   [junit4]   2> 73234 INFO  (searcherExecutor-166-thread-1) [    ] o.a.s.c.SolrCore [collection1] Registered new searcher Searcher@594ce44d[collection1] main{ExitableDirectoryReader(UninvertingDirectoryReader())}
   [junit4]   2> 73234 INFO  (TEST-TestExportWriter.testRandomNumerics-seed#[FBDB2884CBB0889D]) [    ] o.a.s.u.p.LogUpdateProcessorFactory [collection1]  webapp=null path=null params={}{commit=} 0 3
   [junit4]   2> 73235 INFO  (TEST-TestExportWriter.testRandomNumerics-seed#[FBDB2884CBB0889D]) [    ] o.a.s.u.DirectUpdateHandler2 [collection1] REMOVING ALL DOCUMENTS FROM INDEX
   [junit4]   2> 73235 INFO  (TEST-TestExportWriter.testRandomNumerics-seed#[FBDB2884CBB0889D]) [    ] o.a.s.u.p.LogUpdateProcessorFactory [collection1]  webapp=null path=null params={}{deleteByQuery=*:*} 0 0
   [junit4]   2> 73235 INFO  (TEST-TestExportWriter.testRandomNumerics-seed#[FBDB2884CBB0889D]) [    ] o.a.s.u.DirectUpdateHandler2 start commit{,optimize=false,openSearcher=true,waitSearcher=true,expungeDeletes=false,softCommit=false,prepareCommit=false}
   [junit4]   2> 73235 INFO  (TEST-TestExportWriter.testRandomNumerics-seed#[FBDB2884CBB0889D]) [    ] o.a.s.u.SolrIndexWriter Calling setCommitData with IW:org.apache.solr.update.SolrIndexWriter@1508eb19 commitCommandVersion:0
   [junit4]   2> 73236 INFO  (TEST-TestExportWriter.testRandomNumerics-seed#[FBDB2884CBB0889D]) [    ] o.a.s.s.SolrIndexSearcher Opening [Searcher@43afa2f7[collection1] main]
   [junit4]   2> 73236 INFO  (TEST-TestExportWriter.testRandomNumerics-seed#[FBDB2884CBB0889D]) [    ] o.a.s.u.DirectUpdateHandler2 end_commit_flush
   [junit4]   2> 73237 INFO  (searcherExecutor-166-thread-1) [    ] o.a.s.c.SolrCore [collection1] Registered new searcher Searcher@43afa2f7[collection1] main{ExitableDirectoryReader(UninvertingDirectoryReader())}
   [junit4]   2> 73238 INFO  (TEST-TestExportWriter.testRandomNumerics-seed#[FBDB2884CBB0889D]) [    ] o.a.s.u.p.LogUpdateProcessorFactory [collection1]  webapp=null path=null params={}{commit=} 0 2
   [junit4]   2> 73260 INFO  (TEST-TestExportWriter.testRandomNumerics-seed#[FBDB2884CBB0889D]) [    ] o.a.s.u.p.LogUpdateProcessorFactory [collection1]  webapp=null path=null params={}{add=[0]} 0 18
   [junit4]   2> 73261 INFO  (TEST-TestExportWriter.testRandomNumerics-seed#[FBDB2884CBB0889D]) [    ] o.a.s.u.p.LogUpdateProcessorFactory [collection1]  webapp=null path=null params={}{add=[1]} 0 0
   [junit4]   2> 73266 INFO  (TEST-TestExportWriter.testRandomNumerics-seed#[FBDB2884CBB0889D]) [    ] o.a.s.u.p.LogUpdateProcessorFactory [collection1]  webapp=null path=null params={}{add=[2]} 0 4
   [junit4]   2> 73274 INFO  (TEST-TestExportWriter.testRandomNumerics-seed#[FBDB2884CBB0889D]) [    ] o.a.s.u.p.LogUpdateProcessorFactory [collection1]  webapp=null path=null params={}{add=[3]} 0 6
   [junit4]   2> 73277 INFO  (TEST-TestExportWriter.testRandomNumerics-seed#[FBDB2884CBB0889D]) [    ] o.a.s.u.p.LogUpdateProcessorFactory [collection1]  webapp=null path=null params={}{add=[4]} 0 2
   [junit4]   2> 73281 INFO  (TEST-TestExportWriter.testRandomNumerics-seed#[FBDB2884CBB0889D]) [    ] o.a.s.u.p.LogUpdateProcessorFactory [collection1]  webapp=null path=null params={}{add=[5]} 0 2
   [junit4]   2> 73284 INFO  (TEST-TestExportWriter.testRandomNumerics-seed#[FBDB2884CBB0889D]) [    ] o.a.s.u.p.LogUpdateProcessorFactory [collection1]  webapp=null path=null params={}{add=[6]} 0 2
   [junit4]   2> 73287 INFO  (TEST-TestExportWriter.testRandomNumerics-seed#[FBDB2884CBB0889D]) [    ] o.a.s.u.p.LogUpdateProcessorFactory [collection1]  webapp=null path=null params={}{add=[7]} 0 2
   [junit4]   2> 73290 INFO  (TEST-TestExportWriter.testRandomNumerics-seed#[FBDB2884CBB0889D]) [    ] o.a.s.u.p.LogUpdateProcessorFactory [collection1]  webapp=null path=null params={}{add=[8]} 0 2
   [junit4]   2> 73291 INFO  (TEST-TestExportWriter.testRandomNumerics-seed#[FBDB2884CBB0889D]) [    ] o.a.s.u.DirectUpdateHandler2 start commit{,optimize=false,openSearcher=true,waitSearcher=true,expungeDeletes=false,softCommit=false,prepareCommit=false}
   [junit4]   2> 73291 INFO  (TEST-TestExportWriter.testRandomNumerics-seed#[FBDB2884CBB0889D]) [    ] o.a.s.u.SolrIndexWriter Calling setCommitData with IW:org.apache.solr.update.SolrIndexWriter@1508eb19 commitCommandVersion:0
   [junit4]   2> 73334 INFO  (TEST-TestExportWriter.testRandomNumerics-seed#[FBDB2884CBB0889D]) [    ] o.a.s.s.SolrIndexSearcher Opening [Searcher@53153d00[collection1] main]
   [junit4]   2> 73335 INFO  (TEST-TestExportWriter.testRandomNumerics-seed#[FBDB2884CBB0889D]) [    ] o.a.s.u.DirectUpdateHandler2 end_commit_flush
   [junit4]   2> 73336 INFO  (searcherExecutor-166-thread-1) [    ] o.a.s.c.SolrCore [collection1] Registered new searcher Searcher@53153d00[collection1] main{ExitableDirectoryReader(UninvertingDirectoryReader(Uninverting(_0(8.0.0):c9)))}
   [junit4]   2> 73336 INFO  (TEST-TestExportWriter.testRandomNumerics-seed#[FBDB2884CBB0889D]) [    ] o.a.s.u.p.LogUpdateProcessorFactory [collection1]  webapp=null path=null params={}{commit=} 0 45
   [junit4]   2> 73340 INFO  (TEST-TestExportWriter.testRandomNumerics-seed#[FBDB2884CBB0889D]) [    ] o.a.s.u.p.LogUpdateProcessorFactory [collection1]  webapp=null path=null params={}{add=[9]} 0 2
   [junit4]   2> 73343 INFO  (TEST-TestExportWriter.testRandomNumerics-seed#[FBDB2884CBB0889D]) [    ] o.a.s.u.p.LogUpdateProcessorFactory [collection1]  webapp=null path=null params={}{add=[10]} 0 1
   [junit4]   2> 73344 INFO  (TEST-TestExportWriter.testRandomNumerics-seed#[FBDB2884CBB0889D]) [    ] o.a.s.u.p.LogUpdateProcessorFactory [collection1]  webapp=null path=null params={}{add=[11]} 0 0
   [junit4]   2> 73347 INFO  (TEST-TestExportWriter.testRandomNumerics-seed#[FBDB2884CBB0889D]) [    ] o.a.s.u.p.LogUpdateProcessorFactory [collection1]  webapp=null path=null params={}{add=[12]} 0 2
   [junit4]   2> 73352 INFO  (TEST-TestExportWriter.testRandomNumerics-seed#[FBDB2884CBB0889D]) [    ] o.a.s.u.p.LogUpdateProcessorFactory [collection1]  webapp=null path=null params={}{add=[13]} 0 4
   [junit4]   2> 73357 INFO  (TEST-TestExportWriter.testRandomNumerics-seed#[FBDB2884CBB0889D]) [    ] o.a.s.u.p.LogUpdateProcessorFactory [collection1]  webapp=null path=null params={}{add=[14]} 0 4
   [junit4]   2> 73361 INFO  (TEST-TestExportWriter.testRandomNumerics-seed#[FBDB2884CBB0889D]) [    ] o.a.s.u.p.LogUpdateProcessorFactory [collection1]  webapp=null path=null params={}{add=[15]} 0 2
   [junit4]   2> 73365 INFO  (TEST-TestExportWriter.testRandomNumerics-seed#[FBDB2884CBB0889D]) [    ] o.a.s.u.p.LogUpdateProcessorFactory [collection1]  webapp=null path=null params={}{add=[16]} 0 3
   [junit4]   2> 73370 INFO  (TEST-TestExportWriter.testRandomNumerics-seed#[FBDB2884CBB0889D]) [    ] o.a.s.u.p.LogUpdateProcessorFactory [collection1]  webapp=null path=null params={}{add=[17]} 0 3
   [junit4]   2> 73375 INFO  (TEST-TestExportWriter.testRandomNumerics-seed#[FBDB2884CBB0889D]) [    ] o.a.s.u.p.LogUpdateProcessorFactory [collection1]  webapp=null path=null params={}{add=[18]} 0 3
   [junit4]   2> 73376 INFO  (TEST-TestExportWriter.testRandomNumerics-seed#[FBDB2884CBB0889D]) [    ] o.a.s.u.p.LogUpdateProcessorFactory [collection1]  webapp=null path=null params={}{add=[19]} 0 0
   [junit4]   2> 73381 INFO  (TEST-TestExportWriter.testRandomNumerics-seed#[FBDB2884CBB0889D]) [    ] o.a.s.u.p.LogUpdateProcessorFactory [collection1]  webapp=null path=null params={}{add=[20]} 0 3
   [junit4]   2> 73382 INFO  (TEST-TestExportWriter.testRandomNumerics-seed#[FBDB2884CBB0889D]) [    ] o.a.s.u.DirectUpdateHandler2 start commit{,optimize=false,openSearcher=true,waitSearcher=true,expungeDeletes=false,softCommit=false,prepareCommit=false}
   [junit4]   2> 73382 INFO  (TEST-TestExportWriter.testRandomNumerics-seed#[FBDB2884CBB0889D]) [    ] o.a.s.u.SolrIndexWriter Calling setCommitData with IW:org.apache.solr.update.SolrIndexWriter@1508eb19 commitCommandVersion:0
   [junit4]   2> 73411 INFO  (TEST-TestExportWriter.testRandomNumerics-seed#[FBDB2884CBB0889D]) [    ] o.a.s.s.SolrIndexSearcher Opening [Searcher@fd886e5[collection1] main]
   [junit4]   2> 73412 INFO  (TEST-TestExportWriter.testRandomNumerics-seed#[FBDB2884CBB0889D]) [    ] o.a.s.u.DirectUpdateHandler2 end_commit_flush
   [junit4]   2> 73413 INFO  (searcherExecutor-166-thread-1) [    ] o.a.s.c.SolrCore [collection1] Registered new searcher Searcher@fd886e5[collection1] main{ExitableDirectoryReader(UninvertingDirectoryReader(Uninverting(_0(8.0.0):c9) Uninverting(_1(8.0.0):c12)))}
   [junit4]   2> 73414 INFO  (TEST-TestExportWriter.testRandomNumerics-seed#[FBDB2884CBB0889D]) [    ] o.a.s.u.p.LogUpdateProcessorFactory [collection1]  webapp=null path=null params={}{commit=} 0 31
   [junit4]   2> 73418 INFO  (TEST-TestExportWriter.testRandomNumerics-seed#[FBDB2884CBB0889D]) [    ] o.a.s.u.p.LogUpdateProcessorFactory [collection1]  webapp=null path=null params={}{add=[21]} 0 3
   [junit4]   2> 73421 INFO  (TEST-TestExportWriter.testRandomNumerics-seed#[FBDB2884CBB0889D]) [    ] o.a.s.u.p.LogUpdateProcessorFactory [collection1]  webapp=null path=null params={}{add=[22]} 0 1
   [junit4]   2> 73425 INFO  (TEST-TestExportWriter.testRandomNumerics-seed#[FBDB2884CBB0889D]) [    ] o.a.s.u.p.LogUpdateProcessorFactory [collection1]  webapp=null path=null params={}{add=[23]} 0 2
   [junit4]   2> 73429 INFO  (TEST-TestExportWriter.testRandomNumerics-seed#[FBDB2884CBB0889D]) [    ] o.a.s.u.p.LogUpdateProcessorFactory [collection1]  webapp=null path=null params={}{add=[24]} 0 2
   [junit4]   2> 73433 INFO  (TEST-TestExportWriter.testRandomNumerics-seed#[FBDB2884CBB0889D]) [    ] o.a.s.u.p.LogUpdateProcessorFactory [collection1]  webapp=null path=null params={}{add=[25]} 0 2
   [junit4]   2> 73435 INFO  (TEST-TestExportWriter.testRandomNumerics-seed#[FBDB2884CBB0889D]) [    ] o.a.s.u.p.LogUpdateProcessorFactory [collection1]  webapp=null path=null params={}{delete=[25]} 0 1
   [junit4]   2> 73438 INFO  (TEST-TestExportWriter.testRandomNumerics-seed#[FBDB2884CBB0889D]) [    ] o.a.s.u.p.LogUpdateProcessorFactory [collection1]  webapp=null path=null params={}{add=[26]} 0 1
   [junit4]   2> 73443 INFO  (TEST-TestExportWriter.testRandomNumerics-seed#[FBDB2884CBB0889D]) [    ] o.a.s.u.p.LogUpdateProcessorFactory [collection1]  webapp=null path=null params={}{add=[27]} 0 3
   [junit4]   2> 73445 INFO  (TEST-TestExportWriter.testRandomNumerics-seed#[FBDB2884CBB0889D]) [    ] o.a.s.u.p.LogUpdateProcessorFactory [collection1]  webapp=null path=null params={}{add=[28]} 0 1
   [junit4]   2> 73449 INFO  (TEST-TestExportWriter.testRandomNumerics-seed#[FBDB2884CBB0889D]) [    ] o.a.s.u.p.LogUpdateProcessorFactory [collection1]  webapp=null path=null params={}{add=[29]} 0 2
   [junit4]   2> 73452 INFO  (TEST-TestExportWriter.testRandomNumerics-seed#[FBDB2884CBB0889D]) [    ] o.a.s.u.p.LogUpdateProcessorFactory [collection1]  webapp=null path=null params={}{add=[30]} 0 2
   [junit4]   2> 73455 INFO  (TEST-TestExportWriter.testRandomNumerics-seed#[FBDB2884CBB0889D]) [    ] o.a.s.u.p.LogUpdateProcessorFactory [collection1]  webapp=null path=null params={}{add=[31]} 0 1
   [junit4]   2> 73457 INFO  (TEST-TestExportWriter.testRandomNumerics-seed#[FBDB2884CBB0889D]) [    ] o.a.s.u.p.LogUpdateProcessorFactory [collection1]  webapp=null path=null params={}{add=[32]} 0 1
   [junit4]   2> 73459 INFO  (TEST-TestExportWriter.testRandomNumerics-seed#[FBDB2884CBB0889D]) [    ] o.a.s.u.p.LogUpdateProcessorFactory [collection1]  webapp=null path=null params={}{add=[33]} 0 1
   [junit4]   2> 73461 INFO  (TEST-TestExportWriter.testRandomNumerics-seed#[FBDB2884CBB0889D]) [    ] o.a.s.u.p.LogUpdateProcessorFactory [collection1]  webapp=null path=null params={}{add=[34]} 0 1
   [junit4]   2> 73462 INFO  (TEST-TestExportWriter.testRandomNumerics-seed#[FBDB2884CBB0889D]) [    ] o.a.s.u.p.LogUpdateProcessorFactory [collection1]  webapp=null path=null params={}{add=[35]} 0 0
   [junit4]   2> 73463 INFO  (TEST-TestExportWriter.testRandomNumerics-seed#[FBDB2884CBB0889D]) [    ] o.a.s.u.p.LogUpdateProcessorFactory [collection1]  webapp=null path=null params={}{delete=[35]} 0 0
   [junit4]   2> 73464 INFO  (TEST-TestExportWriter.testRandomNumerics-seed#[FBDB2884CBB0889D]) [    ] o.a.s.u.p.LogUpdateProcessorFactory [collection1]  webapp=null path=null params={}{add=[36]} 0 0
   [junit4]   2> 73465 INFO  (TEST-TestExportWriter.testRandomNumerics-seed#[FBDB2884CBB0889D]) [    ] o.a.s.u.p.LogUpdateProcessorFactory [collection1]  webapp=null path=null params={}{add=[37]} 0 0
   [junit4]   2> 73468 INFO  (TEST-TestExportWriter.testRandomNumerics-seed#[FBDB2884CBB0889D]) [    ] o.a.s.u.p.LogUpdateProcessorFactory [collection1]  webapp=null path=null params={}{add=[38]} 0 2
   [junit4]   2> 73470 INFO  (TEST-TestExportWriter.testRandomNumerics-seed#[FBDB2884CBB0889D]) [    ] o.a.s.u.p.LogUpdateProcessorFactory [collection1]  webapp=null path=null params={}{add=[39]} 0 1
   [junit4]   2> 73475 INFO  (TEST-TestExportWriter.testRandomNumerics-seed#[FBDB2884CBB0889D]) [    ] o.a.s.u.p.LogUpdateProcessorFactory [collection1]  webapp=null path=null params={}{add=[40]} 0 3
   [junit4]   2> 73476 INFO  (TEST-TestExportWriter.testRandomNumerics-seed#[FBDB2884CBB0889D]) [    ] o.a.s.u.p.LogUpdateProcessorFactory [collection1]  webapp=null path=null params={}{add=[41]} 0 0
   [junit4]   2> 73479 INFO  (TEST-TestExportWriter.testRandomNumerics-seed#[FBDB2884CBB0889D]) [    ] o.a.s.u.p.LogUpdateProcessorFactory [collection1]  webapp=null path=null params={}{add=[42]} 0 1
   [junit4]   2> 73481 INFO  (TEST-TestExportWriter.testRandomNumerics-seed#[FBDB2884CBB0889D]) [    ] o.a.s.u.p.LogUpdateProcessorFactory [collection1]  webapp=null path=null params={}{add=[43]} 0 1
   [junit4]   2> 73484 INFO  (TEST-TestExportWriter.testRandomNumerics-seed#[FBDB2884CBB0889D]) [    ] o.a.s.u.p.LogUpdateProcessorFactory [collection1]  webapp=null path=null params={}{add=[44]} 0 1
   [junit4]   2> 73485 INFO  (TEST-TestExportWriter.testRandomNumerics-seed#[FBDB2884CBB0889D]) [    ] o.a.s.u.DirectUpdateHandler2 start commit{,optimize=false,openSearcher=true,waitSearcher=true,expungeDeletes=false,softCommit=false,prepareCommit=false}
   [junit4]   2> 73485 INFO  (TEST-TestExportWriter.testRandomNumerics-seed#[FBDB2884CBB0889D]) [    ] o.a.s.u.SolrIndexWriter Calling setCommitData with IW:org.apache.solr.update.SolrIndexWriter@1508eb19 commitCommandVersion:0
   [junit4]   2> 73507 INFO  (TEST-TestExportWriter.testRandomNumerics-seed#[FBDB2884CBB0889D]) [    ] o.a.s.s.SolrIndexSearcher Opening [Searcher@6abb7c25[collection1] main]
   [junit4]   2> 73507 INFO  (TEST-TestExportWriter.testRandomNumerics-seed#[FBDB2884CBB0889D]) [    ] o.a.s.u.DirectUpdateHandler2 end_commit_flush
   [junit4]   2> 73509 INFO  (searcherExecutor-166-thread-1) [    ] o.a.s.c.SolrCore [collection1] Registered new searcher Searcher@6abb7c25[collection1] main{ExitableDirectoryReader(UninvertingDirectoryReader(Uninverting(_0(8.0.0):c9) Uninverting(_1(8.0.0):c12) Uninverting(_2(8.0.0):c24/2:delGen=1)))}
   [junit4]   2> 73509 INFO  (TEST-TestExportWriter.testRandomNumerics-seed#[FBDB2884CBB0889D]) [    ] o.a.s.u.p.LogUpdateProcessorFactory [collection1]  webapp=null path=null params={}{commit=} 0 24
   [junit4]   2> 73512 INFO  (TEST-TestExportWriter.testRandomNumerics-seed#[FBDB2884CBB0889D]) [    ] o.a.s.u.p.LogUpdateProcessorFactory [collection1]  webapp=null path=null params={}{add=[45]} 0 2
   [junit4]   2> 73515 INFO  (TEST-TestExportWriter.testRandomNumerics-seed#[FBDB2884CBB0889D]) [    ] o.a.s.u.p.LogUpdateProcessorFactory [collection1]  webapp=null path=null params={}{add=[46]} 0 2
   [junit4]   2> 73517 INFO  (TEST-TestExportWriter.testRandomNumerics-seed#[FBDB2884CBB0889D]) [    ] o.a.s.u.p.LogUpdateProcessorFactory [collection1]  webapp=null path=null params={}{add=[47]} 0 1
   [junit4]   2> 73520 INFO  (TEST-TestExportWriter.testRandomNumerics-seed#[FBDB2884CBB0889D]) [    ] o.a.s.u.p.LogUpdateProcessorFactory [collection1]  webapp=null path=null params={}{add=[48]} 0 1
   [junit4]   2> 73523 INFO  (TEST-TestExportWriter.testRandomNumerics-seed#[FBDB2884CBB0889D]) [    ] o.a.s.u.p.LogUpdateProcessorFactory [collection1]  webapp=null path=null params={}{add=[49]} 0 1
   [junit4]   2> 73526 INFO  (TEST-TestExportWriter.testRandomNumerics-seed#[FBDB2884CBB0889D]) [    ] o.a.s.u.p.LogUpdateProcessorFactory [collection1]  webapp=null path=null params={}{add=[50]} 0 1
   [junit4]   2> 73529 INFO  (TEST-TestExportWriter.testRandomNumerics-seed#[FBDB2884CBB0889D]) [    ] o.a.s.u.p.LogUpdateProcessorFactory [collection1]  webapp=null path=null params={}{add=[51]} 0 1
   [junit4]   2> 73532 INFO  (TEST-TestExportWriter.testRandomNumerics-seed#[FBDB2884CBB0889D]) [    ] o.a.s.u.p.LogUpdateProcessorFactory [collection1]  webapp=null path=null params={}{add=[52]} 0 1
   [junit4]   2> 73533 INFO  (TEST-TestExportWriter.testRandomNumerics-seed#[FBDB2884CBB0889D]) [    ] o.a.s.u.p.LogUpdateProcessorFactory [collection1]  webapp=null path=null params={}{add=[53]} 0 1
   [junit4]   2> 73536 INFO  (TEST-TestExportWriter.testRandomNumerics-seed#[FBDB2884CBB0889D]) [    ] o.a.s.u.p.LogUpdateProcessorFactory [collection1]  webapp=null path=null params={}{add=[54]} 0 1
   [junit4]   2> 73538 INFO  (TEST-TestExportWriter.testRandomNumerics-seed#[FBDB2884CBB0889D]) [    ] o.a.s.u.p.LogUpdateProcessorFactory [collection1]  webapp=null path=null params={}{add=[55]} 0 1
   [junit4]   2> 73541 INFO  (TEST-TestExportWriter.testRandomNumerics-seed#[FBDB2884CBB0889D]) [    ] o.a.s.u.p.LogUpdateProcessorFactory [collection1]  webapp=null path=null params={}{add=[56]} 0 1
   [junit4]   2> 73543 INFO  (TEST-TestExportWriter.testRandomNumerics-seed#[FBDB2884CBB0889D]) [    ] o.a.s.u.p.LogUpdateProcessorFactory [collection1]  webapp=null path=null params={}{add=[57]} 0 1
   [junit4]   2> 73547 INFO  (TEST-TestExportWriter.testRandomNumerics-seed#[FBDB2884CBB0889D]) [    ] o.a.s.u.p.LogUpdateProcessorFactory [collection1]  webapp=null path=null params={}{add=[58]} 0 3
   [junit4]   2> 73549 INFO  (TEST-TestExportWriter.testRandomNumerics-seed#[FBDB2884CBB0889D]) [    ] o.a.s.u.p.LogUpdateProcessorFactory [collection1]  webapp=null path=null params={}{add=[59]} 0 1
   [junit4]   2> 73551 INFO  (TEST-TestExportWriter.testRandomNumerics-seed#[FBDB2884CBB0889D]) [    ] o.a.s.u.p.LogUpdateProcessorFactory [collection1]  webapp=null path=null params={}{add=[60]} 0 0
   [junit4]   2> 73553 INFO  (TEST-TestExportWriter.testRandomNumerics-seed#[FBDB2884CBB0889D]) [    ] o.a.s.u.p.LogUpdateProcessorFactory [collection1]  webapp=null path=null params={}{add=[61]} 0 1
   [junit4]   2> 73555 INFO  (TEST-TestExportWriter.testRandomNumerics-seed#[FBDB2884CBB0889D]) [    ] o.a.s.u.p.LogUpdateProcessorFactory [collection1]  webapp=null path=null params={}{add=[62]} 0 0
   [junit4]   2> 73558 INFO  (TEST-TestExportWriter.testRandomNumerics-seed#[FBDB2884CBB0889D]) [    ] o.a.s.u.p.LogUpdateProcessorFactory [collection1]  webapp=null path=null params={}{add=[63]} 0 1
   [junit4]   2> 73559 INFO  (TEST-TestExportWriter.testRandomNumerics-seed#[FBDB2884CBB0889D]) [    ] o.a.s.u.p.LogUpdateProcessorFactory [collection1]  webapp=null path=null params={}{add=[64]} 0 1
   [junit4]   2> 73562 INFO  (TEST-TestExportWriter.testRandomNumerics-seed#[FBDB2884CBB0889D]) [    ] o.a.s.u.p.LogUpdateProcessorFactory [collection1]  webapp=null path=null params={}{add=[65]} 0 1
   [junit4]   2> 73564 INFO  (TEST-TestExportWriter.testRandomNumerics-seed#[FBDB2884CBB0889D]) [    ] o.a.s.u.p.LogUpdateProcessorFactory [collection1]  webapp=null path=null params={}{add=[66]} 0 0
   [junit4]   2> 73565 INFO  (TEST-TestExportWriter.testRandomNumerics-seed#[FBDB2884CBB0889D]) [    ] o.a.s.u.p.LogUpdateProcessorFactory [collection1]  webapp=null path=null params={}{add=[67]} 0 0
   [junit4]   2> 73568 INFO  (TEST-TestExportWriter.testRandomNumerics-seed#[FBDB2884CBB0889D]) [    ] o.a.s.u.p.LogUpdateProcessorFactory [collection1]  webapp=null path=null params={}{add=[68]} 0 1
   [junit4]   2> 73569 INFO  (TEST-TestExportWriter.testRandomNumerics-seed#[FBDB2884CBB0889D]) [    ] o.a.s.u.p.LogUpdateProcessorFactory [collection1]  webapp=null path=null params={}{add=[69]} 0 0
   [junit4]   2> 73571 INFO  (TEST-TestExportWriter.testRandomNumerics-seed#[FBDB2884CBB0889D]) [    ] o.a.s.u.p.LogUpdateProcessorFactory [collection1]  webapp=null path=null params={}{add=[70]} 0 0
   [junit4]   2> 73572 INFO  (TEST-TestExportWriter.testRandomNumerics-seed#[FBDB2884CBB0889D]) [    ] o.a.s.u.p.LogUpdateProcessorFactory [collection1]  webapp=null path=null params={}{add=[71]} 0 0
   [junit4]   2> 73573 INFO  (TEST-TestExportWriter.testRandomNumerics-seed#[FBDB2884CBB0889D]) [    ] o.a.s.u.p.LogUpdateProcessorFactory [collection1]  webapp=null path=null params={}{add=[72]} 0 0
   [junit4]   2> 73574 INFO  (TEST-TestExportWriter.testRandomNumerics-seed#[FBDB2884CBB0889D]) [    ] o.a.s.u.p.LogUpdateProcessorFactory [collection1]  webapp=null path=null params={}{add=[73]} 0 0
   [junit4]   2> 73575 INFO  (TEST-TestExportWriter.testRandomNumerics-seed#[FBDB2884CBB0889D]) [    ] o.a.s.u.p.LogUpdateProcessorFactory [collection1]  webapp=null path=null params={}{add=[74]} 0 0
   [junit4]   2> 73576 INFO  (TEST-TestExportWriter.testRandomNumerics-seed#[FBDB2884CBB0889D]) [    ] o.a.s.u.p.LogUpdateProcessorFactory [collection1]  webapp=null path=null params={}{add=[75]} 0 0
   [junit4]   2> 73578 INFO  (TEST-TestExportWriter.testRandomNumerics-seed#[FBDB2884CBB0889D]) [    ] o.a.s.u.p.LogUpdateProcessorFactory [collection1]  webapp=null path=null params={}{add=[76]} 0 0
   [junit4]   2> 73579 INFO  (TEST-TestExportWriter.testRandomNumerics-seed#[FBDB2884CBB0889D]) [    ] o.a.s.u.p.LogUpdateProcessorFactory [collection1]  webapp=null path=null params={}{add=[77]} 0 0
   [junit4]   2> 73581 INFO  (TEST-TestExportWriter.testRandomNumerics-seed#[FBDB2884CBB0889D]) [    ] o.a.s.u.p.LogUpdateProcessorFactory [collection1]  webapp=null path=null params={}{add=[78]} 0 0
   [junit4]   2> 73584 INFO  (TEST-TestExportWriter.testRandomNumerics-seed#[FBDB2884CBB0889D]) [    ] o.a.s.u.p.LogUpdateProcessorFactory [collection1]  webapp=null path=null params={}{add=[79]} 0 2
   [junit4]   2> 73587 INFO  (TEST-TestExportWriter.testRandomNumerics-seed#[FBDB2884CBB0889D]) [    ] o.a.s.u.p.LogUpdateProcessorFactory [collection1]  webapp=null path=null params={}{add=[80]} 0 1
   [junit4]   2> 73588 INFO  (TEST-TestExportWriter.testRandomNumerics-seed#[FBDB2884CBB0889D]) [    ] o.a.s.u.DirectUpdateHandler2 start commit{,optimize=false,openSearcher=true,waitSearcher=true,expungeDeletes=false,softCommit=false,prepareCommit=false}
   [junit4]   2> 73588 INFO  (TEST-TestExportWriter.testRandomNumerics-seed#[FBDB2884CBB0889D]) [    ] o.a.s.u.SolrIndexWriter Calling setCommitData with IW:org.apache.solr.update.SolrIndexWriter@1508eb19 commitCommandVersion:0
   [junit4]   2> 73612 INFO  (TEST-TestExportWriter.testRandomNumerics-seed#[FBDB2884CBB0889D]) [    ] o.a.s.s.SolrIndexSearcher Opening [Searcher@522dc22d[collection1] main]
   [junit4]   2> 73613 INFO  (TEST-TestExportWriter.testRandomNumerics-seed#[FBDB2884CBB0889D]) [    ] o.a.s.u.DirectUpdateHandler2 end_commit_flush
   [junit4]   2> 73614 INFO  (searcherExecutor-166-thread-1) [    ] o.a.s.c.SolrCore [collection1] Registered new searcher Searcher@522dc22d[collection1] main{ExitableDirectoryReader(UninvertingDirectoryReader(Uninverting(_0(8.0.0):c9) Uninverting(_1(8.0.0):c12) Uninverting(_2(8.0.0):c24/2:delGen=1) Uninverting(_3(8.0.0):c36)))}
   [junit4]   2> 73616 INFO  (TEST-TestExportWriter.testRandomNumerics-seed#[FBDB2884CBB0889D]) [    ] o.a.s.u.p.LogUpdateProcessorFactory [collection1]  webapp=null path=null params={}{commit=} 0 28
   [junit4]   2> 73618 INFO  (TEST-TestExportWriter.testRandomNumerics-seed#[FBDB2884CBB0889D]) [    ] o.a.s.u.p.LogUpdateProcessorFactory [collection1]  webapp=null path=null params={}{add=[81]} 0 1
   [junit4]   2> 73619 INFO  (TEST-TestExportWriter.testRandomNumerics-seed#[FBDB2884CBB0889D]) [    ] o.a.s.u.p.LogUpdateProcessorFactory [collection1]  webapp=null path=null params={}{add=[82]} 0 0
   [junit4]   2> 73621 INFO  (TEST-TestExportWriter.testRandomNumerics-seed#[FBDB2884CBB0889D]) [    ] o.a.s.u.p.LogUpdateProcessorFactory [collection1]  webapp=null path=null params={}{add=[83]} 0 0
   [junit4]   2> 73622 INFO  (TEST-TestExportWriter.testRandomNumerics-seed#[FBDB2884CBB0889D]) [    ] o.a.s.u.p.LogUpdateProcessorFactory [collection1]  webapp=null path=null params={}{add=[84]} 0 0
   [junit4]   2> 73623 INFO  (TEST-TestExportWriter.testRandomNumerics-seed#[FBDB2884CBB0889D]) [    ] o.a.s.u.p.LogUpdateProcessorFactory [collection1]  webapp=null path=null params={}{add=[85]} 0 0
   [junit4]   2> 73624 INFO  (TEST-TestExportWriter.testRandomNumerics-seed#[FBDB2884CBB0889D]) [    ] o.a.s.u.p.LogUpdateProcessorFactory [collection1]  webapp=null path=null params={}{add=[86]} 0 0
   [junit4]   2> 73625 INFO  (TEST-TestExportWriter.testRandomNumerics-seed#[FBDB2884CBB0889D]) [    ] o.a.s.u.p.LogUpdateProcessorFactory [collection1]  webapp=null path=null params={}{add=[87]} 0 0
   [junit4]   2> 73626 INFO  (TEST-TestExportWriter.testRandomNumerics-seed#[FBDB2884CBB0889D]) [    ] o.a.s.u.p.LogUpdateProcessorFactory [collection1]  webapp=null path=null params={}{add=[88]} 0 0
   [junit4]   2> 73627 INFO  (TEST-TestExportWriter.testRandomNumerics-seed#[FBDB2884CBB0889D]) [    ] o.a.s.u.p.LogUpdateProcessorFactory [collection1]  webapp=null path=null params={}{add=[89]} 0 0
   [junit4]   2> 73628 INFO  (TEST-TestExportWriter.testRandomNumerics-seed#[FBDB2884CBB0889D]) [    ] o.a.s.u.p.LogUpdateProcessorFactory [collection1]  webapp=null path=null params={}{add=[90]} 0 0
   [junit4]   2> 73630 INFO  (TEST-TestExportWriter.testRandomNumerics-seed#[FBDB2884CBB0889D]) [    ] o.a.s.u.p.LogUpdateProcessorFactory [collection1]  webapp=null path=null params={}{add=[91]} 0 0
   [junit4]   2> 73637 INFO  (TEST-TestExportWriter.testRandomNumerics-seed#[FBDB2884CBB0889D]) [    ] o.a.s.u.p.LogUpdateProcessorFactory [collection1]  webapp=null path=null params={}{add=[92]} 0 0
   [junit4]   2> 73639 INFO  (TEST-TestExportWriter.testRandomNumerics-seed#[FBDB2884CBB0889D]) [    ] o.a.s.u.p.LogUpdateProcessorFactory [collection1]  webapp=null path=null params={}{add=[93]} 0 0
   [junit4]   2> 73640 INFO  (TEST-TestExportWriter.testRandomNumerics-seed#[FBDB2884CBB0889D]) [    ] o.a.s.u.p.LogUpdateProcessorFactory [collection1]  webapp=null path=null params={}{add=[94]} 0 0
   [junit4]   2> 73641 INFO  (TEST-TestExportWriter.testRandomNumerics-seed#[FBDB2884CBB0889D]) [    ] o.a.s.u.p.LogUpdateProcessorFactory [collection1]  webapp=null path=null params={}{add=[95]} 0 0
   [junit4]   2> 73642 INFO  (TEST-TestExportWriter.testRandomNumerics-seed#[FBDB2884CBB0889D]) [    ] o.a.s.u.p.LogUpdateProcessorFactory [collection1]  webapp=null path=null params={}{add=[96]} 0 0
   [junit4]   2> 73644 INFO  (TEST-TestExportWriter.testRandomNumerics-seed#[FBDB2884CBB0889D]) [    ] o.a.s.u.p.LogUpdateProcessorFactory [collection1]  webapp=null path=null params={}{add=[97]} 0 1
   [junit4]   2> 73646 INFO  (TEST-TestExportWriter.testRandomNumerics-seed#[FBDB2884CBB0889D]) [    ] o.a.s.u.p.LogUpdateProcessorFactory [collection1]  webapp=null path=null params={}{add=[98]} 0 0
   [junit4]   2> 73647 INFO  (TEST-TestExportWriter.testRandomNumerics-seed#[FBDB2884CBB0889D]) [    ] o.a.s.u.p.LogUpdateProcessorFactory [collection1]  webapp=null path=null params={}{add=[99]} 0 0
   [junit4]   2> 73649 INFO  (TEST-TestExportWriter.testRandomNumerics-seed#[FBDB2884CBB0889D]) [    ] o.a.s.u.p.LogUpdateProcessorFactory [collection1]  webapp=null path=null params={}{add=[100]} 0 1
   [junit4]   2> 73650 INFO  (TEST-TestExportWriter.testRandomNumerics-seed#[FBDB2884CBB0889D]) [    ] o.a.s.u.p.LogUpdateProcessorFactory [collection1]  webapp=null path=null params={}{add=[101]} 0 0
   [junit4]   2> 73652 INFO  (TEST-TestExportWriter.testRandomNumerics-seed#[FBDB2884CBB0889D]) [    ] o.a.s.u.p.LogUpdateProcessorFactory [collection1]  webapp=null path=null params={}{add=[102]} 0 0
   [junit4]   2> 73653 INFO  (TEST-TestExportWriter.testRandomNumerics-seed#[FBDB2884CBB0889D]) [    ] o.a.s.u.p.LogUpdateProcessorFactory [collection1]  webapp=null path=null params={}{add=[103]} 0 0
   [junit4]   2> 73657 INFO  (TEST-TestExportWriter.testRandomNumerics-seed#[FBDB2884CBB0889D]) [    ] o.a.s.u.p.LogUpdateProcessorFactory [collection1]  webapp=null path=null params={}{add=[104]} 0 2
   [junit4]   2> 73658 INFO  (TEST-TestExportWriter.testRandomNumerics-seed#[FBDB2884CBB0889D]) [    ] o.a.s.u.p.LogUpdateProcessorFactory [collection1]  webapp=null path=null params={}{add=[105]} 0 0
   [junit4]   2> 73660 INFO  (TEST-TestExportWriter.testRandomNumerics-seed#[FBDB2884CBB0889D]) [    ] o.a.s.u.p.LogUpdateProcessorFactory [collection1]  webapp=null path=null params={}{add=[106]} 0 0
   [junit4]   2> 73661 INFO  (TEST-TestExportWriter.testRandomNumerics-seed#[FBDB2884CBB0889D]) [    ] o.a.s.u.p.LogUpdateProcessorFactory [collection1]  webapp=null path=null params={}{add=[107]} 0 0
   [junit4]   2> 73663 INFO  (TEST-TestExportWriter.testRandomNumerics-seed#[FBDB2884CBB0889D]) [    ] o.a.s.u.p.LogUpdateProcessorFactory [collection1]  webapp=null path=null params={}{add=[108]} 0 1
   [junit4]   2> 73665 INFO  (TEST-TestExportWriter.testRandomNumerics-seed#[FBDB2884CBB0889D]) [    ] o.a.s.u.p.LogUpdateProcessorFactory [collection1]  webapp=null path=null params={}{add=[109]} 0 1
   [junit4]   2> 73666 INFO  (TEST-TestExportWriter.testRandomNumerics-seed#[FBDB2884CBB0889D]) [    ] o.a.s.u.p.LogUpdateProcessorFactory [collection1]  webapp=null path=null params={}{add=[110]} 0 0
   [junit4]   2> 73667 INFO  (TEST-TestExportWriter.testRandomNumerics-seed#[FBDB2884CBB0889D]) [    ] o.a.s.u.p.LogUpdateProcessorFactory [collection1]  webapp=null path=null params={}{delete=[110]} 0 0
   [junit4]   2> 73669 INFO  (TEST-TestExportWriter.testRandomNumerics-seed#[FBDB2884CBB0889D]) [    ] o.a.s.u.p.LogUpdateProcessorFactory [collection1]  webapp=null path=null params={}{add=[111]} 0 1
   [junit4]   2> 73670 INFO  (TEST-TestExportWriter.testRandomNumerics-seed#[FBDB2884CBB0889D]) [    ] o.a.s.u.p.LogUpdateProcessorFactory [collection1]  webapp=null path=null params={}{add=[112]} 0 0
   [junit4]   2> 73671 INFO  (TEST-TestExportWriter.testRandomNumerics-seed#[FBDB2884CBB0889D]) [    ] o.a.s.u.p.LogUpdateProcessorFactory [collection1]  webapp=null path=null params={}{add=[113]} 0 0
   [junit4]   2> 73673 INFO  (TEST-TestExportWriter.testRandomNumerics-seed#[FBDB2884CBB0889D]) [    ] o.a.s.u.p.LogUpdateProcessorFactory [collection1]  webapp=null path=null params={}{add=[114]} 0 0
   [junit4]   2> 73674 INFO  (TEST-TestExportWriter.testRandomNumerics-seed#[FBDB2884CBB0889D]) [    ] o.a.s.u.p.LogUpdateProcessorFactory [collection1]  webapp=null path=null params={}{add=[115]} 0 0
   [junit4]   2> 73675 INFO  (TEST-TestExportWriter.testRandomNumerics-seed#[FBDB2884CBB0889D]) [    ] o.a.s.u.p.LogUpdateProcessorFactory [collection1]  webapp=null path=null params={}{add=[116]} 0 0
   [junit4]   2> 73676 INFO  (TEST-TestExportWriter.testRandomNumerics-seed#[FBDB2884CBB0889D]) [    ] o.a.s.u.p.LogUpdateProcessorFactory [collection1]  webapp=null path=null params={}{add=[117]} 0 0
   [junit4]   2> 73678 INFO  (TEST-TestExportWriter.testRandomNumerics-seed#[FBDB2884CBB0889D]) [    ] o.a.s.u.p.LogUpdateProcessorFactory [collection1]  webapp=null path=null params={}{add=[118]} 0 0
   [junit4]   2> 73679 INFO  (TEST-TestExportWriter.testRandomNumerics-seed#[FBDB2884CBB0889D]) [    ] o.a.s.u.p.LogUpdateProcessorFactory [collection1]  webapp=null path=null params={}{add=[119]} 0 0
   [junit4]   2> 73681 INFO  (TEST-TestExportWriter.testRandomNumerics-seed#[FBDB2884CBB0889D]) [    ] o.a.s.u.p.LogUpdateProcessorFactory [collection1]  webapp=null path=null params={}{add=[120]} 0 0
   [junit4]   2> 73682 INFO  (TEST-TestExportWriter.testRandomNumerics-seed#[FBDB2884CBB0889D]) [    ] o.a.s.u.p.LogUpdateProcessorFactory [collection1]  webapp=null path=null params={}{add=[121]} 0 0
   [junit4]   2> 73683 INFO  (TEST-TestExportWriter.testRandomNumerics-seed#[FBDB2884CBB0889D]) [    ] o.a.s.u.p.LogUpdateProcessorFactory [collection1]  webapp=null path=null params={}{add=[122]} 0 0
   [junit4]   2> 73685 INFO  (TEST-TestExportWriter.testRandomNumerics-seed#[FBDB2884CBB0889D]) [    ] o.a.s.u.p.LogUpdateProcessorFactory [collection1]  webapp=null path=null params={}{add=[123]} 0 0
   [junit4]   2> 73686 INFO  (TEST-TestExportWriter.testRandomNumerics-seed#[FBDB2884CBB0889D]) [    ] o.a.s.u.p.LogUpdateProcessorFactory [collection1]  webapp=null path=null params={}{add=[124]} 0 0
   [junit4]   2> 73687 INFO  (TEST-TestExportWriter.testRandomNumerics-seed#[FBDB2884CBB0889D]) [    ] o.a.s.u.p.LogUpdateProcessorFactory [collection1]  webapp=null path=null params={}{add=[125]} 0 0
   [junit4]   2> 73688 INFO  (TEST-TestExportWriter.testRandomNumerics-seed#[FBDB2884CBB0889D]) [    ] o.a.s.u.p.LogUpdateProcessorFactory [collection1]  webapp=null path=null params={}{delete=[125]} 0 0
   [junit4]   2> 73689 INFO  (TEST-TestExportWriter.testRandomNumerics-seed#[FBDB2884CBB0889D]) [    ] o.a.s.u.p.LogUpdateProcessorFactory [collection1]  webapp=null path=null params={}{add=[126]} 0 0
   [junit4]   2> 73692 INFO  (TEST-TestExportWriter.testRandomNumerics-seed#[FBDB2884CBB0889D]) [    ] o.a.s.u.p.LogUpdateProcessorFactory [collection1]  webapp=null path=null params={}{add=[127]} 0 1
   [junit4]   2> 73694 INFO  (TEST-TestExportWriter.testRandomNumerics-seed#[FBDB2884CBB0889D]) [    ] o.a.s.u.p.LogUpdateProcessorFactory [collection1]  webapp=null path=null params={}{add=[128]} 0 2
   [junit4]   2> 73696 INFO  (TEST-TestExportWriter.testRandomNumerics-seed#[FBDB2884CBB0889D]) [    ] o.a.s.u.p.LogUpdateProcessorFactory [collection1]  webapp=null path=null params={}{add=[129]} 0 0
   [junit4]   2> 73697 INFO  (TEST-TestExportWriter.testRandomNumerics-seed#[FBDB2884CBB0889D]) [    ] o.a.s.u.p.LogUpdateProcessorFactory [collection1]  webapp=null path=null params={}{add=[130]} 0 0
   [junit4]   2> 73698 INFO  (TEST-TestExportWriter.testRandomNumerics-seed#[FBDB2884CBB0889D]) [    ] o.a.s.u.p.LogUpdateProcessorFactory [collection1]  webapp=null path=null params={}{add=[131]} 0 0
   [junit4]   2> 73700 INFO  (TEST-TestExportWriter.testRandomNumerics-seed#[FBDB2884CBB0889D]) [    ] o.a.s.u.p.LogUpdateProcessorFactory [collection1]  webapp=null path=null params={}{add=[132]} 0 1
   [junit4]   2> 73701 INFO  (TEST-TestExportWriter.testRandomNumerics-seed#[FBDB2884CBB0889D]) [    ] o.a.s.u.p.LogUpdateProcessorFactory [collection1]  webapp=null path=null params={}{add=[133]} 0 0
   [junit4]   2> 73702 INFO  (TEST-TestExportWriter.testRandomNumerics-seed#[FBDB2884CBB0889D]) [    ] o.a.s.u.p.LogUpdateProcessorFactory [collection1]  webapp=null path=null params={}{delete=[133]} 0 0
   [junit4]   2> 73703 INFO  (TEST-TestExportWriter.testRandomNumerics-seed#[FBDB2884CBB0889D]) [    ] o.a.s.u.p.LogUpdateProcessorFactory [collection1]  webapp=null path=null params={}{add=[134]} 0 0
   [junit4]   2> 73704 INFO  (TEST-TestExportWriter.testRandomNumerics-seed#[FBDB2884CBB0889D]) [    ] o.a.s.u.p.LogUpdateProcessorFactory [collection1]  webapp=null path=null params={}{add=[135]} 0 0
   [junit4]   2> 73705 INFO  (TEST-TestExportWriter.testRandomNumerics-seed#[FBDB2884CBB0889D]) [    ] o.a.s.u.p.LogUpdateProcessorFactory [collection1]  webapp=null path=null params={}{add=[136]} 0 0
   [junit4]   2> 73707 INFO  (TEST-TestExportWriter.testRandomNumerics-seed#[FBDB2884CBB0889D]) [    ] o.a.s.u.p.LogUpdateProcessorFactory [collection1]  webapp=null path=null params={}{add=[137]} 0 0
   [junit4]   2> 73708 INFO  (TEST-TestExportWriter.testRandomNumerics-seed#[FBDB2884CBB0889D]) [    ] o.a.s.u.p.LogUpdateProcessorFactory [collection1]  webapp=null path=null params={}{add=[138]} 0 0
   [junit4]   2> 73709 INFO  (TEST-TestExportWriter.testRandomNumerics-seed#[FBDB2884CBB0889D]) [    ] o.a.s.u.p.LogUpdateProcessorFactory [collection1]  webapp=null path=null params={}{add=[139]} 0 0
   [junit4]   2> 73711 INFO  (TEST-TestExportWriter.testRandomNumerics-seed#[FBDB2884CBB0889D]) [    ] o.a.s.u.p.LogUpdateProcessorFactory [collection1]  webapp=null path=null params={}{add=[140]} 0 0
   [junit4]   2> 73712 INFO  (TEST-TestExportWriter.testRandomNumerics-seed#[FBDB2884CBB0889D]) [    ] o.a.s.u.p.LogUpdateProcessorFactory [collection1]  webapp=null path=null params={}{add=[141]} 0 0
   [junit4]   2> 73713 INFO  (TEST-TestExportWriter.testRandomNumerics-seed#[FBDB2884CBB0889D]) [    ] o.a.s.u.p.LogUpdateProcessorFactory [collection1]  webapp=null path=null params={}{add=[142]} 0 0
   [junit4]   2> 73714 INFO  (TEST-TestExportWriter.testRandomNumerics-seed#[FBDB2884CBB0889D]) [    ] o.a.s.u.p.LogUpdateProcessorFactory [collection1]  webapp=null path=null params={}{add=[143]} 0 0
   [junit4]   2> 73715 INFO  (TEST-TestExportWriter.testRandomNumerics-seed#[FBDB2884CBB0889D]) [    ] o.a.s.u.p.LogUpdateProcessorFactory [collection1]  webapp=null path=null params={}{add=[144]} 0 0
   [junit4]   2> 73717 INFO  (TEST-TestExportWriter.testRandomNumerics-seed#[FBDB2884CBB0889D]) [    ] o.a.s.u.p.LogUpdateProcessorFactory [collection1]  webapp=null path=null params={}{add=[145]} 0 0
   [junit4]   2> 73717 INFO  (TEST-TestExportWriter.testRandomNumerics-seed#[FBDB2884CBB0889D]) [    ] o.a.s.u.p.LogUpdateProcessorFactory [collection1]  webapp=null path=null params={}{add=[146]} 0 0
   [junit4]   2> 73718 INFO  (TEST-TestExportWriter.testRandomNumerics-seed#[FBDB2884CBB0889D]) [    ] o.a.s.u.p.LogUpdateProcessorFactory [collection1]  webapp=null path=null params={}{add=[147]} 0 0
   [junit4]   2> 73719 INFO  (TEST-TestExportWriter.testRandomNumerics-seed#[FBDB2884CBB0889D]) [    ] o.a.s.u.DirectUpdateHandler2 start commit{,optimize=false,openSearcher=true,waitSearcher=true,expungeDeletes=false,softCommit=false,prepareCommit=false}
   [junit4]   2> 73719 INFO  (TEST-TestExportWriter.testRandomNumerics-seed#[FBDB2884CBB0889D]) [    ] o.a.s.u.SolrIndexWriter Calling setCommitData with IW:org.apache.solr.update.SolrIndexWriter@1508eb19 commitCommandVersion:0
   [junit4]   2> 73738 INFO  (TEST-TestExportWriter.testRandomNumerics-seed#[FBDB2884CBB0889D]) [    ] o.a.s.s.SolrIndexSearcher Opening [Searcher@16f7cda[collection1] main]
   [junit4]   2> 73739 INFO  (TEST-TestExportWriter.testRandomNumerics-seed#[FBDB2884CBB0889D]) [    ] o.a.s.u.DirectUpdateHandler2 end_commit_flush
   [junit4]   2> 73739 INFO  (searcherExecutor-166-thread-1) [    ] o.a.s.c.SolrCore [collection1] Registered new searcher Searcher@16f7cda[collection1] main{ExitableDirectoryReader(UninvertingDirectoryReader(Uninverting(_0(8.0.0):c9) Uninverting(_1(8.0.0):c12) Uninverting(_2(8.0.0):c24/2:delGen=1) Uninverting(_3(8.0.0):c36) Uninverting(_4(8.0.0):c67/3:delGen=1)))}
   [junit4]   2> 73740 INFO  (TEST-TestExportWriter.testRandomNumerics-seed#[FBDB2884CBB0889D]) [    ] o.a.s.u.p.LogUpdateProcessorFactory [collection1]  webapp=null path=null params={}{commit=} 0 21
   [junit4]   2> 73742 INFO  (TEST-TestExportWriter.testRandomNumerics-seed#[FBDB2884CBB0889D]) [    ] o.a.s.u.p.LogUpdateProcessorFactory [collection1]  webapp=null path=null params={}{add=[148]} 0 1
   [junit4]   2> 73744 INFO  (TEST-TestExportWriter.testRandomNumerics-seed#[FBDB2884CBB0889D]) [    ] o.a.s.u.p.LogUpdateProcessorFactory [collection1]  webapp=null path=null params={}{add=[149]} 0 0
   [junit4]   2> 73745 INFO  (TEST-TestExportWriter.testRandomNumerics-seed#[FBDB2884CBB0889D]) [    ] o.a.s.u.p.LogUpdateProcessorFactory [collection1]  webapp=null path=null params={}{add=[150]} 0 0
   [junit4]   2> 73746 INFO  (TEST-TestExportWriter.testRandomNumerics-seed#[FBDB2884CBB0889D]) [    ] o.a.s.u.p.LogUpdateProcessorFactory [collection1]  webapp=null path=null params={}{add=[151]} 0 0
   [junit4]   2> 73748 INFO  (TEST-TestExportWriter.testRandomNumerics-seed#[FBDB2884CBB0889D]) [    ] o.a.s.u.p.LogUpdateProcessorFactory [collection1]  webapp=null path=null params={}{add=[152]} 0 0
   [junit4]   2> 73749 INFO  (TEST-TestExportWriter.testRandomNumerics-seed#[FBDB2884CBB0889D]) [    ] o.a.s.u.p.LogUpdateProcessorFactory [collection1]  webapp=null path=null params={}{add=[153]} 0 0
   [junit4]   2> 73750 INFO  (TEST-TestExportWriter.testRandomNumerics-seed#[FBDB2884CBB0889D]) [    ] o.a.s.u.p.LogUpdateProcessorFactory [collection1]  webapp=null path=null params={}{add=[154]} 0 0
   [junit4]   2> 73751 INFO  (TEST-TestExportWriter.testRandomNumerics-seed#[FBDB2884CBB0889D]) [    ] o.a.s.u.p.LogUpdateProcessorFactory [collection1]  webapp=null path=null params={}{add=[155]} 0 0
   [junit4]   2> 73752 INFO  (TEST-TestExportWriter.testRandomNumerics-seed#[FBDB2884CBB0889D]) [    ] o.a.s.u.DirectUpdateHandler2 start commit{,optimize=false,openSearcher=true,waitSearcher=true,expungeDeletes=false,softCommit=false,prepareCommit=false}
   [junit4]   2> 73752 INFO  (TEST-TestExportWriter.testRandomNumerics-seed#[FBDB2884CBB0889D]) [    ] o.a.s.u.SolrIndexWriter Calling setCommitData with IW:org.apache.solr.update.SolrIndexWriter@1508eb19 commitCommandVersion:0
   [junit4]   2> 73762 INFO  (TEST-TestExportWriter.testRandomNumerics-seed#[FBDB2884CBB0889D]) [    ] o.a.s.s.SolrIndexSearcher Opening [Searcher@2572da6d[collection1] main]
   [junit4]   2> 73762 INFO  (TEST-TestExportWriter.testRandomNumerics-seed#[FBDB2884CBB0889D]) [    ] o.a.s.u.DirectUpdateHandler2 end_commit_flush
   [junit4]   2> 73763 INFO  (searcherExecutor-166-thread-1) [    ] o.a.s.c.SolrCore [collection1] Registered new searcher Searcher@2572da6d[collection1] main{ExitableDirectoryReader(UninvertingDirectoryReader(Uninverting(_0(8.0.0):c9) Uninverting(_1(8.0.0):c12) Uninverting(_2(8.0.0):c24/2:delGen=1) Uninverting(_3(8.0.0):c36) Uninverting(_4(8.0.0):c67/3:delGen=1) Uninverting(_5(8.0.0):c8)))}
   [junit4]   2> 73764 INFO  (TEST-TestExportWriter.testRandomNumerics-seed#[FBDB2884CBB0889D]) [    ] o.a.s.u.p.LogUpdateProcessorFactory [collection1]  webapp=null path=null params={}{commit=} 0 12
   [junit4]   2> 73766 INFO  (TEST-TestExportWriter.testRandomNumerics-seed#[FBDB2884CBB0889D]) [    ] o.a.s.u.p.LogUpdateProcessorFactory [collection1]  webapp=null path=null params={}{add=[156]} 0 1
   [junit4]   2> 73767 INFO  (TEST-TestExportWriter.testRandomNumerics-seed#[FBDB2884CBB0889D]) [    ] o.a.s.u.p.LogUpdateProcessorFactory [collection1]  webapp=null path=null params={}{add=[157]} 0 0
   [junit4]   2> 73768 INFO  (TEST-TestExportWriter.testRandomNumerics-seed#[FBDB2884CBB0889D]) [    ] o.a.s.u.p.LogUpdateProcessorFactory [collection1]  webapp=null path=null params={}{add=[158]} 0 0
   [junit4]   2> 73770 INFO  (TEST-TestExportWriter.testRandomNumerics-seed#[FBDB2884CBB0889D]) [    ] o.a.s.u.p.LogUpdateProcessorFactory [collection1]  webapp=null path=null params={}{add=[159]} 0 0
   [junit4]   2> 73771 INFO  (TEST-TestExportWriter.testRandomNumerics-seed#[FBDB2884CBB0889D]) [    ] o.a.s.u.p.LogUpdateProcessorFactory [collection1]  webapp=null path=null params={}{add=[160]} 0 0
   [junit4]   2> 73771 INFO  (TEST-TestExportWriter.testRandomNumerics-seed#[FBDB2884CBB0889D]) [    ] o.a.s.u.DirectUpdateHandler2 start commit{,optimize=false,openSearcher=true,waitSearcher=true,expungeDeletes=false,softCommit=false,prepareCommit=false}
   [junit4]   2> 73771 INFO  (TEST-TestExportWriter.testRandomNumerics-seed#[FBDB2884CBB0889D]) [    ] o.a.s.u.SolrIndexWriter Calling setCommitData with IW:org.apache.solr.update.SolrIndexWriter@1508eb19 commitCommandVersion:0
   [junit4]   2> 73780 INFO  (TEST-TestExportWriter.testRandomNumerics-seed#[FBDB2884CBB0889D]) [    ] o.a.s.s.SolrIndexSearcher Opening [Searcher@3ee7166a[collection1] main]
   [junit4]   2> 73781 INFO  (TEST-TestExportWriter.testRandomNumerics-seed#[FBDB2884CBB0889D]) [    ] o.a.s.u.DirectUpdateHandler2 end_commit_flush
   [junit4]   2> 73782 INFO  (searcherExecutor-166-thread-1) [    ] o.a.s.c.SolrCore [collection1] Registered new searcher Searcher@3ee7166a[collection1] main{ExitableDirectoryReader(UninvertingDirectoryReader(Uninverting(_0(8.0.0):c9) Uninverting(_1(8.0.0):c12) Uninverting(_2(8.0.0):c24/2:delGen=1) Uninverting(_3(8.0.0):c36) Uninverting(_4(8.0.0):c67/3:delGen=1) Uninverting(_5(8.0.0):c8) Uninverting(_6(8.0.0):c5)))}
   [junit4]   2> 73782 INFO  (TEST-TestExportWriter.testRandomNumerics-seed#[FBDB2884CBB0889D]) [    ] o.a.s.u.p.LogUpdateProcessorFactory [collection1]  webapp=null path=null params={}{commit=} 0 11
   [junit4]   2> 73784 INFO  (TEST-TestExportWriter.testRandomNumerics-seed#[FBDB2884CBB0889D]) [    ] o.a.s.u.p.LogUpdateProcessorFactory [collection1]  webapp=null path=null params={}{add=[161]} 0 1
   [junit4]   2> 73786 INFO  (TEST-TestExportWriter.testRandomNumerics-seed#[FBDB2884CBB0889D]) [    ] o.a.s.u.p.LogUpdateProcessorFactory [collection1]  webapp=null path=null params={}{add=[162]} 0 0
   [junit4]   2> 73786 INFO  (TEST-TestExportWriter.testRandomNumerics-seed#[FBDB2884CBB0889D]) [    ] o.a.s.u.DirectUpdateHandler2 start commit{,optimize=false,openSearcher=true,waitSearcher=true,expungeDeletes=false,softCommit=false,prepareCommit=false}
   [junit4]   2> 73786 INFO  (TEST-TestExportWriter.testRandomNumerics-seed#[FBDB2884CBB0889D]) [    ] o.a.s.u.SolrIndexWriter Calling setCommitData with IW:org.apache.solr.update.SolrIndexWriter@1508eb19 commitCommandVersion:0
   [junit4]   2> 73796 INFO  (TEST-TestExportWriter.testRandomNumerics-seed#[FBDB2884CBB0889D]) [    ] o.a.s.s.SolrIndexSearcher Opening [Searcher@2fb514c9[collection1] main]
   [junit4]   2> 73798 INFO  (searcherExecutor-166-thread-1) [    ] o.a.s.c.SolrCore [collection1] Registered new searcher Searcher@2fb514c9[collection1] main{ExitableDirectoryReader(UninvertingDirectoryReader(Uninverting(_0(8.0.0):c9) Uninverting(_1(8.0.0):c12) Uninverting(_2(8.0.0):c24/2:delGen=1) Uninverting(_3(8.0.0):c36) Uninverting(_4(8.0.0):c67/3:delGen=1) Uninverting(_5(8.0.0):c8) Uninverting(_6(8.0.0):c5) Uninverting(_7(8.0.0):c2)))}
   [junit4]   2> 73799 INFO  (TEST-TestExportWriter.testRandomNumerics-seed#[FBDB2884CBB0889D]) [    ] o.a.s.u.DirectUpdateHandler2 end_commit_flush
   [junit4]   2> 73799 INFO  (TEST-TestExportWriter.testRandomNumerics-seed#[FBDB2884CBB0889D]) [    ] o.a.s.u.p.LogUpdateProcessorFactory [collection1]  webapp=null path=null params={}{commit=} 0 12
   [junit4]   2> 73803 INFO  (TEST-TestExportWriter.testRandomNumerics-seed#[FBDB2884CBB0889D]) [    ] o.a.s.u.p.LogUpdateProcessorFactory [collection1]  webapp=null path=null params={}{add=[163]} 0 3
   [junit4]   2> 73804 INFO  (TEST-TestExportWriter.testRandomNumerics-seed#[FBDB2884CBB0889D]) [    ] o.a.s.u.p.LogUpdateProcessorFactory [collection1]  webapp=null path=null params={}{add=[164]} 0 0
   [junit4]   2> 73805 INFO  (TEST-TestExportWriter.testRandomNumerics-seed#[FBDB2884CBB0889D]) [    ] o.a.s.u.p.LogUpdateProcessorFactory [collection1]  webapp=null path=null params={}{delete=[164]} 0 0
   [junit4]   2> 73806 INFO  (TEST-TestExportWriter.testRandomNumerics-seed#[FBDB2884CBB0889D]) [    ] o.a.s.u.p.LogUpdateProcessorFactory [collection1]  webapp=null path=null params={}{add=[165]} 0 0
   [junit4]   2> 73807 INFO  (TEST-TestExportWriter.testRandomNumerics-seed#[FBDB2884CBB0889D]) [    ] o.a.s.u.p.LogUpdateProcessorFactory [collection1]  webapp=null path=null params={}{delete=[165]} 0 0
   [junit4]   2> 73809 INFO  (TEST-TestExportWriter.testRandomNumerics-seed#[FBDB2884CBB0889D]) [    ] o.a.s.u.p.LogUpdateProcessorFactory [collection1]  webapp=null path=null params={}{add=[166]} 0 1
   [junit4]   2> 73811 INFO  (TEST-TestExportWriter.testRandomNumerics-seed#[FBDB2884CBB0889D]) [    ] o.a.s.u.p.LogUpdateProcessorFactory [collection1]  webapp=null path=null params={}{add=[167]} 0 1
   [junit4]   2> 73812 INFO  (TEST-TestExportWriter.testRandomNumerics-seed#[FBDB2884CBB0889D]) [    ] o.a.s.u.DirectUpdateHandler2 start commit{,optimize=false,openSearcher=true,waitSearcher=true,expungeDeletes=false,softCommit=false,prepareCommit=false}
   [junit4]   2> 73812 INFO  (TEST-TestExportWriter.testRandomNumerics-seed#[FBDB2884CBB0889D]) [    ] o.a.s.u.SolrIndexWriter Calling setCommitData with IW:org.apache.solr.update.SolrIndexWriter@1508eb19 commitCommandVersion:0
   [junit4]   2> 73850 INFO  (TEST-TestExportWriter.testRandomNumerics-seed#[FBDB2884CBB0889D]) [    ] o.a.s.s.SolrIndexSearcher Opening [Searcher@2b504ee0[collection1] main]
   [junit4]   2> 73853 INFO  (searcherExecutor-166-thread-1) [    ] o.a.s.c.SolrCore [collection1] Registered new searcher Searcher@2b504ee0[collection1] main{ExitableDirectoryReader(UninvertingDirectoryReader(Uninverting(_0(8.0.0):c9) Uninverting(_1(8.0.0):c12) Uninverting(_2(8.0.0):c24/2:delGen=1) Uninverting(_3(8.0.0):c36) Uninverting(_4(8.0.0):c67/3:delGen=1) Uninverting(_5(8.0.0):c8) Uninverting(_6(8.0.0):c5) Uninverting(_7(8.0.0):c2) Uninverting(_8(8.0.0):c5/2:delGen=1)))}
   [junit4]   2> 73854 INFO  (TEST-TestExportWriter.testRandomNumerics-seed#[FBDB2884CBB0889D]) [    ] o.a.s.u.DirectUpdateHandler2 end_commit_flush
   [junit4]   2> 73855 INFO  (TEST-TestExportWriter.testRandomNumerics-seed#[FBDB2884CBB0889D]) [    ] o.a.s.u.p.LogUpdateProcessorFactory [collection1]  webapp=null path=null params={}{commit=} 0 43
   [junit4]   2> 73858 INFO  (TEST-TestExportWriter.testRandomNumerics-seed#[FBDB2884CBB0889D]) [    ] o.a.s.u.p.LogUpdateProcessorFactory [collection1]  webapp=null path=null params={}{add=[168]} 0 1
   [junit4]   2> 73859 INFO  (TEST-TestExportWriter.testRandomNumerics-seed#[FBDB2884CBB0889D]) [    ] o.a.s.u.p.LogUpdateProcessorFactory [collection1]  webapp=null path=null params={}{add=[169]} 0 0
   [junit4]   2> 73860 INFO  (TEST-TestExportWriter.testRandomNumerics-seed#[FBDB2884CBB0889D]) [    ] o.a.s.u.p.LogUpdateProcessorFactory [collection1]  webapp=null path=null params={}{add=[170]} 0 0
   [junit4]   2> 73862 INFO  (TEST-TestExportWriter.testRandomNumerics-seed#[FBDB2884CBB0889D]) [    ] o.a.s.u.p.LogUpdateProcessorFactory [collection1]  webapp=null path=null params={}{add=[171]} 0 0
   [junit4]   2> 73864 INFO  (TEST-TestExportWriter.testRandomNumerics-seed#[FBDB2884CBB0889D]) [    ] o.a.s.u.p.LogUpdateProcessorFactory [collection1]  webapp=null path=null params={}{add=[172]} 0 0
   [junit4]   2> 73865 INFO  (TEST-TestExportWriter.testRandomNumerics-seed#[FBDB2884CBB0889D]) [    ] o.a.s.u.p.LogUpdateProcessorFactory [collection1]  webapp=null path=null params={}{add=[173]} 0 0
   [junit4]   2> 73866 INFO  (TEST-TestExportWriter.testRandomNumerics-seed#[FBDB2884CBB0889D]) [    ] o.a.s.u.p.LogUpdateProcessorFactory [collection1]  webapp=null path=null params={}{add=[174]} 0 0
   [junit4]   2> 73867 INFO  (TEST-TestExportWriter.testRandomNumerics-seed#[FBDB2884CBB0889D]) [    ] o.a.s.u.p.LogUpdateProcessorFactory [collection1]  webapp=null path=null params={}{add=[175]} 0 0
   [junit4]   2> 73868 INFO  (TEST-TestExportWriter.testRandomNumerics-seed#[FBDB2884CBB0889D]) [    ] o.a.s.u.p.LogUpdateProcessorFactory [collection1]  webapp=null path=null params={}{add=[176]} 0 0
   [junit4]   2> 73869 INFO  (TEST-TestExportWriter.testRandomNumerics-seed#[FBDB2884CBB0889D]) [    ] o.a.s.u.p.LogUpdateProcessorFactory [collection1]  webapp=null path=null params={}{add=[177]} 0 0
   [junit4]   2> 73870 INFO  (TEST-TestExportWriter.testRandomNumerics-seed#[FBDB2884CBB0889D]) [    ] o.a.s.u.p.LogUpdateProcessorFactory [collection1]  webapp=null path=null params={}{add=[178]} 0 0
   [junit4]   2> 73872 INFO  (TEST-TestExportWriter.testRandomNumerics-seed#[FBDB2884CBB0889D]) [    ] o.a.s.u.p.LogUpdateProcessorFactory [collection1]  webapp=null path=null params={}{add=[179]} 0 0
   [junit4]   2> 73873 INFO  (TEST-TestExportWriter.testRandomNumerics-seed#[FBDB2884CBB0889D]) [    ] o.a.s.u.p.LogUpdateProcessorFactory [collection1]  webapp=null path=null params={}{add=[180]} 0 0
   [junit4]   2> 73874 INFO  (TEST-TestExportWriter.testRandomNumerics-seed#[FBDB2884CBB0889D]) [    ] o.a.s.u.p.LogUpdateProcessorFactory [collection1]  webapp=null path=null params={}{add=[181]} 0 0
   [junit4]   2> 73876 INFO  (TEST-TestExportWriter.testRandomNumerics-seed#[FBDB2884CBB0889D]) [    ] o.a.s.u.p.LogUpdateProcessorFactory [collection1]  webapp=null path=null params={}{add=[182]} 0 0
   [junit4]   2> 73878 INFO  (TEST-TestExportWriter.testRandomNumerics-seed#[FBDB2884CBB0889D]) [    ] o.a.s.u.p.LogUpdateProcessorFactory [collection1]  webapp=null path=null params={}{add=[183]} 0 1
   [junit4]   2> 73879 INFO  (TEST-TestExportWriter.testRandomNumerics-seed#[FBDB2884CBB0889D]) [    ] o.a.s.u.p.LogUpdateProcessorFactory [collection1]  webapp=null path=null params={}{add=[184]} 0 0
   [junit4]   2> 73881 INFO  (TEST-TestExportWriter.testRandomNumerics-seed#[FBDB2884CBB0889D]) [    ] o.a.s.u.p.LogUpdateProcessorFactory [collection1]  webapp=null path=null params={}{add=[185]} 0 1
   [junit4]   2> 73883 INFO  (TEST-TestExportWriter.testRandomNumerics-seed#[FBDB2884CBB0889D]) [    ] o.a.s.u.p.LogUpdateProcessorFactory [collection1]  webapp=null path=null params={}{add=[186]} 0 0
   [junit4]   2> 73886 INFO  (TEST-TestExportWriter.testRandomNumerics-seed#[FBDB2884CBB0889D]) [    ] o.a.s.u.p.LogUpdateProcessorFactory [collection1]  webapp=null path=null params={}{add=[187]} 0 3
   [junit4]   2> 73888 INFO  (TEST-TestExportWriter.testRandomNumerics-seed#[FBDB2884CBB0889D]) [    ] o.a.s.u.p.LogUpdateProcessorFactory [collection1]  webapp=null path=null params={}{add=[188]} 0 1
   [junit4]   2> 73889 INFO  (TEST-TestExportWriter.testRandomNumerics-seed#[FBDB2884CBB0889D]) [    ] o.a.s.u.p.LogUpdateProcessorFactory [collection1]  webapp=null path=null params={}{add=[189]} 0 0
   [junit4]   2> 73891 INFO  (TEST-TestExportWriter.testRandomNumerics-seed#[FBDB2884CBB0889D]) [    ] o.a.s.u.p.LogUpdateProcessorFactory [collection1]  webapp=null path=null params={}{add=[190]} 0 0
   [junit4]   2> 73891 INFO  (TEST-TestExportWriter.testRandomNumerics-seed#[FBDB2884CBB0889D]) [    ] o.a.s.u.DirectUpdateHandler2 start commit{,optimize=false,openSearcher=true,waitSearcher=true,expungeDeletes=false,softCommit=false,prepareCommit=false}
   [junit4]   2> 73892 INFO  (TEST-TestExportWriter.testRandomNumerics-seed#[FBDB2884CBB0889D]) [    ] o.a.s.u.SolrIndexWriter Calling setCommitData with IW:org.apache.solr.update.SolrIndexWriter@1508eb19 commitCommandVersion:0
   [junit4]   2> 73904 INFO  (TEST-TestExportWriter.testRandomNumerics-seed#[FBDB2884CBB0889D]) [    ] o.a.s.s.SolrIndexSearcher Opening [Searcher@2e28164e[collection1] main]
   [junit4]   2> 73905 INFO  (TEST-TestExportWriter.testRandomNumerics-seed#[FBDB2884CBB0889D]) [    ] o.a.s.u.DirectUpdateHandler2 end_commit_flush
   [junit4]   2> 73906 INFO  (searcherExecutor-166-thread-1) [    ] o.a.s.c.SolrCore [collection1] Registered new searcher Searcher@2e28164e[collection1] main{ExitableDirectoryReader(UninvertingDirectoryReader(Uninverting(_0(8.0.0):c9) Uninverting(_1(8.0.0):c12) Uninverting(_2(8.0.0):c24/2:delGen=1) Uninverting(_3(8.0.0):c36) Uninverting(_4(8.0.0):c67/3:delGen=1) Uninverting(_5(8.0.0):c8) Uninverting(_6(8.0.0):c5) Uninverting(_7(8.0.0):c2) Uninverting(_8(8.0.0):c5/2:delGen=1) Uninverting(_9(8.0.0):c23)))}
   [junit4]   2> 73908 INFO  (TEST-TestExportWriter.testRandomNumerics-seed#[FBDB2884CBB0889D]) [    ] o.a.s.u.p.LogUpdateProcessorFactory [collection1]  webapp=null path=null params={}{commit=} 0 16
   [junit4]   2> 73917 INFO  (TEST-TestExportWriter.testRandomNumerics-seed#[FBDB2884CBB0889D]) [    ] o.a.s.u.p.LogUpdateProcessorFactory [collection1]  webapp=null path=null params={}{add=[191]} 0 1
   [junit4]   2> 73919 INFO  (TEST-TestExportWriter.testRandomNumerics-seed#[FBDB2884CBB0889D]) [    ] o.a.s.u.p.LogUpdateProcessorFactory [collection1]  webapp=null path=null params={}{add=[192]} 0 0
   [junit4]   2> 73920 INFO  (TEST-TestExportWriter.testRandomNumerics-seed#[FBDB2884CBB0889D]) [    ] o.a.s.u.p.LogUpdateProcessorFactory [collection1]  webapp=null path=null params={}{add=[193]} 0 0
   [junit4]   2> 73922 INFO  (TEST-TestExportWriter.testRandomNumerics-seed#[FBDB2884CBB0889D]) [    ] o.a.s.u.p.LogUpdateProcessorFactory [collection1]  webapp=null path=null params={}{add=[194]} 0 1
   [junit4]   2> 73923 INFO  (TEST-TestExportWriter.testRandomNumerics-seed#[FBDB2884CBB0889D]) [    ] o.a.s.u.p.LogUpdateProcessorFactory [collection1]  webapp=null path=null params={}{add=[195]} 0 0
   [junit4]   2> 73925 INFO  (TEST-TestExportWriter.testRandomNumerics-seed#[FBDB2884CBB0889D]) [    ] o.a.s.u.p.LogUpdateProcessorFactory [collection1]  webapp=null path=null params={}{add=[196]} 0 1
   [junit4]   2> 73926 INFO  (TEST-TestExportWriter.testRandomNumerics-seed#[FBDB2884CBB0889D]) [    ] o.a.s.u.p.LogUpdateProcessorFactory [collection1]  webapp=null path=null params={}{add=[197]} 0 0
   [junit4]   2> 73928 INFO  (TEST-TestExportWriter.testRandomNumerics-seed#[FBDB2884CBB0889D]) [    ] o.a.s.u.p.LogUpdateProcessorFactory [collection1]  webapp=null path=null params={}{add=[198]} 0 0
   [junit4]   2> 73929 INFO  (TEST-TestExportWriter.testRandomNumerics-seed#[FBDB2884CBB0889D]) [    ] o.a.s.u.DirectUpdateHandler2 start commit{,optimize=false,openSearcher=true,waitSearcher=true,expungeDeletes=false,softCommit=false,prepareCommit=false}
   [junit4]   2> 73929 INFO  (TEST-TestExportWriter.testRandomNumerics-seed#[FBDB2884CBB0889D]) [    ] o.a.s.u.SolrIndexWriter Calling setCommitData with IW:org.apache.solr.update.SolrIndexWriter@1508eb19 commitCommandVersion:0
   [junit4]   2> 73942 INFO  (TEST-TestExportWriter.testRandomNumerics-seed#[FBDB2884CBB0889D]) [    ] o.a.s.s.SolrIndexSearcher Opening [Searcher@8103cc1[collection1] main]
   [junit4]   2> 73943 INFO  (TEST-TestExportWriter.testRandomNumerics-seed#[FBDB2884CBB0889D]) [    ] o.a.s.u.DirectUpdateHandler2 end_commit_flush
   [junit4]   2> 73944 INFO  (searcherExecutor-166-thread-1) [    ] o.a.s.c.SolrCore [collection1] Registered new searcher Searcher@8103cc1[collection1] main{ExitableDirectoryReader(UninvertingDirectoryReader(Uninverting(_0(8.0.0):c9) Uninverting(_1(8.0.0):c12) Uninverting(_2(8.0.0):c24/2:delGen=1) Uninverting(_3(8.0.0):c36) Uninverting(_4(8.0.0):c67/3:delGen=1) Uninverting(_5(8.0.0):c8) Uninverting(_6(8.0.0):c5) Uninverting(_7(8.0.0):c2) Uninverting(_8(8.0.0):c5/2:delGen=1) Uninverting(_9(8.0.0):c23) Uninverting(_a(8.0.0):c8)))}
   [junit4]   2> 73945 INFO  (TEST-TestExportWriter.testRandomNumerics-seed#[FBDB2884CBB0889D]) [    ] o.a.s.u.p.LogUpdateProcessorFactory [collection1]  webapp=null path=null params={}{commit=} 0 16
   [junit4]   2> 73947 INFO  (TEST-TestExportWriter.testRandomNumerics-seed#[FBDB2884CBB0889D]) [    ] o.a.s.u.p.LogUpdateProcessorFactory [collection1]  webapp=null path=null params={}{add=[199]} 0 1
   [junit4]   2> 73949 INFO  (TEST-TestExportWriter.testRandomNumerics-seed#[FBDB2884CBB0889D]) [    ] o.a.s.u.p.LogUpdateProcessorFactory [collection1]  webapp=null path=null params={}{add=[200]} 0 0
   [junit4]   2> 73950 INFO  (TEST-TestExportWriter.testRandomNumerics-seed#[FBDB2884CBB0889D]) [    ] o.a.s.u.p.LogUpdateProcessorFactory [collection1]  webapp=null path=null params={}{add=[201]} 0 0
   [junit4]   2> 73952 INFO  (TEST-TestExportWriter.testRandomNumerics-seed#[FBDB2884CBB0889D]) [    ] o.a.s.u.p.LogUpdateProcessorFactory [collection1]  webapp=null path=null params={}{add=[202]} 0 0
   [junit4]   2> 73953 INFO  (TEST-TestExportWriter.testRandomNumerics-seed#[FBDB2884CBB0889D]) [    ] o.a.s.u.p.LogUpdateProcessorFactory [collection1]  webapp=null path=null params={}{add=[203]} 0 0
   [junit4]   2> 73955 INFO  (TEST-TestExportWriter.testRandomNumerics-seed#[FBDB2884CBB0889D]) [    ] o.a.s.u.p.LogUpdateProcessorFactory [collection1]  webapp=null path=null params={}{add=[204]} 0 0
   [junit4]   2> 73956 INFO  (TEST-TestExportWriter.testRandomNumerics-seed#[FBDB2884CBB0889D]) [    ] o.a.s.u.p.LogUpdateProcessorFactory [collection1]  webapp=null path=null params={}{add=[205]} 0 0
   [junit4]   2> 73957 INFO  (TEST-TestExportWriter.testRandomNumerics-seed#[FBDB2884CBB0889D]) [    ] o.a.s.u.p.LogUpdateProcessorFactory [collection1]  webapp=null path=null params={}{add=[206]} 0 0
   [junit4]   2> 73959 INFO  (TEST-TestExportWriter.testRandomNumerics-seed#[FBDB2884CBB0889D]) [    ] o.a.s.u.p.LogUpdateProcessorFactory [collection1]  webapp=null path=null params={}{add=[207]} 0 0
   [junit4]   2> 73960 INFO  (TEST-TestExportWriter.testRandomNumerics-seed#[FBDB2884CBB0889D]) [    ] o.a.s.u.p.LogUpdateProcessorFactory [collection1]  webapp=null path=null params={}{add=[208]} 0 0
   [junit4]   2> 73961 INFO  (TEST-TestExportWriter.testRandomNumerics-seed#[FBDB2884CBB0889D]) [    ] o.a.s.u.p.LogUpdateProcessorFactory [collection1]  webapp=null path=null params={}{add=[209]} 0 0
   [junit4]   2> 73962 INFO  (TEST-TestExportWriter.testRandomNumerics-seed#[FBDB2884CBB0889D]) [    ] o.a.s.u.p.LogUpdateProcessorFactory [collection1]  webapp=null path=null params={}{add=[210]} 0 0
   [junit4]   2> 73964 INFO  (TEST-TestExportWriter.testRandomNumerics-seed#[FBDB2884CBB0889D]) [    ] o.a.s.u.p.LogUpdateProcessorFactory [collection1]  webapp=null path=null params={}{add=[211]} 0 0
   [junit4]   2> 73966 INFO  (TEST-TestExportWriter.testRandomNumerics-seed#[FBDB2884CBB0889D]) [    ] o.a.s.u.p.LogUpdateProcessorFactory [collection1]  webapp=null path=null params={}{add=[212]} 0 0
   [junit4]   2> 73967 INFO  (TEST-TestExportWriter.testRandomNumerics-seed#[FBDB2884CBB0889D]) [    ] o.a.s.u.p.LogUpdateProcessorFactory [collection1]  webapp=null path=null params={}{add=[213]} 0 0
   [junit4]   2> 73969 INFO  (TEST-TestExportWriter.testRandomNumerics-seed#[FBDB2884CBB0889D]) [    ] o.a.s.u.p.LogUpdateProcessorFactory [collection1]  webapp=null path=null params={}{add=[214]} 0 0
   [junit4]   2> 73970 INFO  (TEST-TestExportWriter.testRandomNumerics-seed#[FBDB2884CBB0889D]) [    ] o.a.s.u.p.LogUpdateProcessorFactory [collection1]  webapp=null path=null params={}{add=[215]} 0 0
   [junit4]   2> 73972 INFO  (TEST-TestExportWriter.testRandomNumerics-seed#[FBDB2884CBB0889D]) [    ] o.a.s.u.p.LogUpdateProcessorFactory [collection1]  webapp=null path=null params={}{add=[216]} 0 0
   [junit4]   2> 73973 INFO  (TEST-TestExportWriter.testRandomNumerics-seed#[FBDB2884CBB0889D]) [    ] o.a.s.u.p.LogUpdateProcessorFactory [collection1]  webapp=null path=null params={}{add=[217]} 0 0
   [junit4]   2> 73977 INFO  (TEST-TestExportWriter.testRandomNumerics-seed#[FBDB2884CBB0889D]) [    ] o.a.s.u.p.LogUpdateProcessorFactory [collection1]  webapp=null path=null params={}{add=[218]} 0 2
   [junit4]   2> 73978 INFO  (TEST-TestExportWriter.testRandomNumerics-seed#[FBDB2884CBB0889D]) [    ] o.a.s.u.p.LogUpdateProcessorFactory [collection1]  webapp=null path=null params={}{add=[219]} 0 0
   [junit4]   2> 73980 INFO  (TEST-TestExportWriter.testRandomNumerics-seed#[FBDB2884CBB0889D]) [    ] o.a.s.u.p.LogUpdateProcessorFactory [collection1]  webapp=null path=null params={}{add=[220]} 0 1
   [junit4]   2> 73981 INFO  (TEST-TestExportWriter.testRandomNumerics-seed#[FBDB2884CBB0889D]) [    ] o.a.s.u.p.LogUpdateProcessorFactory [collection1]  webapp=null path=null params={}{add=[221]} 0 0
   [junit4]   2> 73983 INFO  (TEST-TestExportWriter.testRandomNumerics-seed#[FBDB2884CBB0889D]) [    ] o.a.s.u.p.LogUpdateProcessorFactory [collection1]  webapp=null path=null params={}{add=[222]} 0 0
   [junit4]   2> 73983 INFO  (TEST-TestExportWriter.testRandomNumerics-seed#[FBDB2884CBB0889D]) [    ] o.a.s.u.DirectUpdateHandler2 start commit{,optimize=false,openSearcher=true,waitSearcher=true,expungeDeletes=false,softCommit=false,prepareCommit=false}
   [junit4]   2> 73984 INFO  (TEST-TestExportWriter.testRandomNumerics-seed#[FBDB2884CBB0889D]) [    ] o.a.s.u.SolrIndexWriter Calling setCommitData with IW:org.apache.solr.update.SolrIndexWriter@1508eb19 commitCommandVersion:0
   [junit4]   2> 73999 INFO  (TEST-TestExportWriter.testRandomNumerics-seed#[FBDB2884CBB0889D]) [    ] o

[...truncated too long message...]

Searcher@f7bab3a[collection1] main{ExitableDirectoryReader(UninvertingDirectoryReader(Uninverting(_21(8.0.0):c1) Uninverting(_22(8.0.0):c1)))}
   [junit4]   2> 41472 INFO  (TEST-TestExportWriter.testBooleanField-seed#[FBDB2884CBB0889D]) [    ] o.a.s.u.p.LogUpdateProcessorFactory [collection1]  webapp=null path=null params={}{commit=} 0 4
   [junit4]   2> 41472 INFO  (TEST-TestExportWriter.testBooleanField-seed#[FBDB2884CBB0889D]) [    ] o.a.s.c.S.Request [collection1]  webapp=null path=null params={q=*:*&qt=/export&fl=id&sort=booleandv+asc&wt=xml} hits=2 status=0 QTime=0
   [junit4]   2> 41473 INFO  (TEST-TestExportWriter.testBooleanField-seed#[FBDB2884CBB0889D]) [    ] o.a.s.c.S.Request [collection1]  webapp=null path=null params={q=*:*&qt=/export&fl=id&sort=booleandv+desc&wt=xml} hits=2 status=0 QTime=0
   [junit4]   2> 41474 INFO  (TEST-TestExportWriter.testBooleanField-seed#[FBDB2884CBB0889D]) [    ] o.a.s.SolrTestCaseJ4 ###Ending testBooleanField
   [junit4] OK      0.02s J0 | TestExportWriter.testBooleanField
   [junit4]   2> 41474 INFO  (SUITE-TestExportWriter-seed#[FBDB2884CBB0889D]-worker) [    ] o.a.s.SolrTestCaseJ4 ###deleteCore
   [junit4]   2> 41474 INFO  (SUITE-TestExportWriter-seed#[FBDB2884CBB0889D]-worker) [    ] o.a.s.c.CoreContainer Shutting down CoreContainer instance=360264128
   [junit4]   2> 41474 INFO  (SUITE-TestExportWriter-seed#[FBDB2884CBB0889D]-worker) [    ] o.a.s.m.SolrMetricManager Closing metric reporters for registry=solr.node, tag=null
   [junit4]   2> 41474 INFO  (SUITE-TestExportWriter-seed#[FBDB2884CBB0889D]-worker) [    ] o.a.s.m.r.SolrJmxReporter Closing reporter [org.apache.solr.metrics.reporters.SolrJmxReporter@1360096f: rootName = null, domain = solr.node, service url = null, agent id = null] for registry solr.node / com.codahale.metrics.MetricRegistry@2a71d97e
   [junit4]   2> 41480 INFO  (SUITE-TestExportWriter-seed#[FBDB2884CBB0889D]-worker) [    ] o.a.s.m.SolrMetricManager Closing metric reporters for registry=solr.jvm, tag=null
   [junit4]   2> 41480 INFO  (SUITE-TestExportWriter-seed#[FBDB2884CBB0889D]-worker) [    ] o.a.s.m.r.SolrJmxReporter Closing reporter [org.apache.solr.metrics.reporters.SolrJmxReporter@771c3619: rootName = null, domain = solr.jvm, service url = null, agent id = null] for registry solr.jvm / com.codahale.metrics.MetricRegistry@396f09cd
   [junit4]   2> 41480 INFO  (SUITE-TestExportWriter-seed#[FBDB2884CBB0889D]-worker) [    ] o.a.s.m.SolrMetricManager Closing metric reporters for registry=solr.jetty, tag=null
   [junit4]   2> 41480 INFO  (SUITE-TestExportWriter-seed#[FBDB2884CBB0889D]-worker) [    ] o.a.s.m.r.SolrJmxReporter Closing reporter [org.apache.solr.metrics.reporters.SolrJmxReporter@495caa92: rootName = null, domain = solr.jetty, service url = null, agent id = null] for registry solr.jetty / com.codahale.metrics.MetricRegistry@59edf90c
   [junit4]   2> 41480 INFO  (coreCloseExecutor-29-thread-1) [    x:collection1] o.a.s.c.SolrCore [collection1]  CLOSING SolrCore org.apache.solr.core.SolrCore@1f6a27d7
   [junit4]   2> 41480 INFO  (coreCloseExecutor-29-thread-1) [    x:collection1] o.a.s.m.SolrMetricManager Closing metric reporters for registry=solr.core.collection1, tag=1f6a27d7
   [junit4]   2> 41480 INFO  (coreCloseExecutor-29-thread-1) [    x:collection1] o.a.s.m.r.SolrJmxReporter Closing reporter [org.apache.solr.metrics.reporters.SolrJmxReporter@1379be7c: rootName = null, domain = solr.core.collection1, service url = null, agent id = null] for registry solr.core.collection1 / com.codahale.metrics.MetricRegistry@18defaa5
   [junit4]   2> NOTE: leaving temporary files on disk at: /home/jenkins/workspace/Lucene-Solr-master-Linux/solr/build/solr-core/test/J0/temp/solr.handler.export.TestExportWriter_FBDB2884CBB0889D-002
   [junit4]   2> NOTE: test params are: codec=Asserting(Lucene80): {id=PostingsFormat(name=LuceneVarGapDocFreqInterval), field1_s_dv=FSTOrd50}, docValues:{number_i_p=DocValuesFormat(name=Asserting), field1_i_p=DocValuesFormat(name=Asserting), number_ls_ni_p=DocValuesFormat(name=Asserting), number_ls_t=DocValuesFormat(name=Asserting), number_ds_p=DocValuesFormat(name=Asserting), number_ds_t=DocValuesFormat(name=Asserting), booleandv=DocValuesFormat(name=Asserting), number_i_t=DocValuesFormat(name=Asserting), field2_i_p=DocValuesFormat(name=Lucene70), number_is_ni_p=DocValuesFormat(name=Lucene70), number_is_ni_t=DocValuesFormat(name=Lucene70), longdv=DocValuesFormat(name=Lucene70), number_ls_p=DocValuesFormat(name=Asserting), id=DocValuesFormat(name=Lucene70), field1_s_dv=DocValuesFormat(name=Lucene70), number_dts_p=DocValuesFormat(name=Asserting), stringdv=DocValuesFormat(name=Lucene70), longdv_m=DocValuesFormat(name=Asserting), number_ls_ni_t=DocValuesFormat(name=Asserting), number_is_t=DocValuesFormat(name=Direct), number_dts_t=DocValuesFormat(name=Asserting), doubledv_m=DocValuesFormat(name=Direct), number_is_p=DocValuesFormat(name=Direct), doubledv=DocValuesFormat(name=Lucene70), field4_i_p=DocValuesFormat(name=Direct), number_dts_ni_t=DocValuesFormat(name=Asserting), field3_i_p=DocValuesFormat(name=Lucene70), intdv=DocValuesFormat(name=Direct), floatdv=DocValuesFormat(name=Lucene70), number_fs_p=DocValuesFormat(name=Lucene70), number_f_t=DocValuesFormat(name=Direct), field6_i_p=DocValuesFormat(name=Lucene70), number_l_p=DocValuesFormat(name=Lucene70), number_dt_p=DocValuesFormat(name=Lucene70), number_f_p=DocValuesFormat(name=Direct), number_d_t=DocValuesFormat(name=Lucene70), number_dt_t=DocValuesFormat(name=Lucene70), int_is_t=DocValuesFormat(name=Lucene70), number_dts_ni_p=DocValuesFormat(name=Asserting), number_fs_t=DocValuesFormat(name=Lucene70), datedv_m=DocValuesFormat(name=Asserting), int_is_p=DocValuesFormat(name=Lucene70), number_l_t=DocValuesFormat(name=Lucene70), number_ds_ni_t=DocValuesFormat(name=Lucene70), stringdv_m=DocValuesFormat(name=Direct), intdv_m=DocValuesFormat(name=Lucene70), number_ds_ni_p=DocValuesFormat(name=Lucene70), number_d_ni_p=DocValuesFormat(name=Direct), field5_i_p=DocValuesFormat(name=Asserting), number_fs_ni_p=DocValuesFormat(name=Lucene70), number_d_ni_t=DocValuesFormat(name=Direct), number_fs_ni_t=DocValuesFormat(name=Lucene70), field8_i_p=DocValuesFormat(name=Direct), datedv=DocValuesFormat(name=Asserting), number_f_ni_t=DocValuesFormat(name=Lucene70), floatdv_m=DocValuesFormat(name=Asserting), number_l_ni_t=DocValuesFormat(name=Direct), number_i_ni_p=DocValuesFormat(name=Lucene70), number_dt_ni_p=DocValuesFormat(name=Direct), number_f_ni_p=DocValuesFormat(name=Lucene70), number_i_ni_t=DocValuesFormat(name=Lucene70), number_dt_ni_t=DocValuesFormat(name=Direct), number_d_p=DocValuesFormat(name=Lucene70), field3_l_p=DocValuesFormat(name=Lucene70), field7_i_p=DocValuesFormat(name=Lucene70), number_l_ni_p=DocValuesFormat(name=Direct)}, maxPointsInLeafNode=740, maxMBSortInHeap=7.377656711554688, sim=Asserting(org.apache.lucene.search.similarities.AssertingSimilarity@5c812006), locale=fi, timezone=Antarctica/Troll
   [junit4]   2> NOTE: Linux 4.15.0-32-generic amd64/Oracle Corporation 1.8.0_172 (64-bit)/cpus=8,threads=1,free=276627304,total=518979584
   [junit4]   2> NOTE: All tests run in this JVM: [TestExportWriter, TestExportWriter]
   [junit4] Completed [5/5 (5!)] on J0 in 10.19s, 8 tests, 1 failure <<< FAILURES!
   [junit4] 
   [junit4] 
   [junit4] Tests with failures [seed: FBDB2884CBB0889D]:
   [junit4]   - org.apache.solr.handler.export.TestExportWriter.testMultipleSorts
   [junit4]   - org.apache.solr.handler.export.TestExportWriter.testMultipleSorts
   [junit4]   - org.apache.solr.handler.export.TestExportWriter.testMultipleSorts
   [junit4]   - org.apache.solr.handler.export.TestExportWriter.testMultipleSorts
   [junit4]   - org.apache.solr.handler.export.TestExportWriter.testMultipleSorts
   [junit4] 
   [junit4] 
   [junit4] JVM J0:     0.41 ..    42.74 =    42.32s
   [junit4] JVM J1:     0.41 ..    32.31 =    31.90s
   [junit4] JVM J2:     0.41 ..    42.26 =    41.85s
   [junit4] Execution time total: 42 seconds
   [junit4] Tests summary: 5 suites, 40 tests, 5 failures

BUILD FAILED
/home/jenkins/workspace/Lucene-Solr-master-Linux/lucene/common-build.xml:1568: The following error occurred while executing this line:
/home/jenkins/workspace/Lucene-Solr-master-Linux/lucene/common-build.xml:1092: There were test failures: 5 suites, 40 tests, 5 failures [seed: FBDB2884CBB0889D]

Total time: 44 seconds

[repro] Setting last failure code to 256

[repro] Failures:
[repro]   5/5 failed: org.apache.solr.handler.export.TestExportWriter
[repro] Exiting with code 256
+ mv lucene/build lucene/build.repro
+ mv solr/build solr/build.repro
+ mv lucene/build.orig lucene/build
+ mv solr/build.orig solr/build
Archiving artifacts
Setting ANT_1_8_2_HOME=/var/lib/jenkins/tools/hudson.tasks.Ant_AntInstallation/ANT_1.8.2
[WARNINGS] Parsing warnings in console log with parser Java Compiler (javac)
Setting ANT_1_8_2_HOME=/var/lib/jenkins/tools/hudson.tasks.Ant_AntInstallation/ANT_1.8.2
Setting ANT_1_8_2_HOME=/var/lib/jenkins/tools/hudson.tasks.Ant_AntInstallation/ANT_1.8.2
<Git Blamer> Using GitBlamer to create author and commit information for all warnings.
<Git Blamer> GIT_COMMIT=4368ad72d2ccbb40583fa7d2e55464c47e341f8b, workspace=/var/lib/jenkins/workspace/Lucene-Solr-master-Linux
[WARNINGS] Computing warning deltas based on reference build #22731
Recording test results
Setting ANT_1_8_2_HOME=/var/lib/jenkins/tools/hudson.tasks.Ant_AntInstallation/ANT_1.8.2
Build step 'Publish JUnit test result report' changed build result to UNSTABLE
Email was triggered for: Unstable (Test Failures)
Sending email for trigger: Unstable (Test Failures)
Setting ANT_1_8_2_HOME=/var/lib/jenkins/tools/hudson.tasks.Ant_AntInstallation/ANT_1.8.2
Setting ANT_1_8_2_HOME=/var/lib/jenkins/tools/hudson.tasks.Ant_AntInstallation/ANT_1.8.2
Setting ANT_1_8_2_HOME=/var/lib/jenkins/tools/hudson.tasks.Ant_AntInstallation/ANT_1.8.2
Setting ANT_1_8_2_HOME=/var/lib/jenkins/tools/hudson.tasks.Ant_AntInstallation/ANT_1.8.2

[JENKINS] Lucene-Solr-master-Linux (64bit/jdk-9.0.4) - Build # 22733 - Failure!

Posted by Policeman Jenkins Server <je...@thetaphi.de>.
Build: https://jenkins.thetaphi.de/job/Lucene-Solr-master-Linux/22733/
Java: 64bit/jdk-9.0.4 -XX:-UseCompressedOops -XX:+UseParallelGC

All tests passed

Build Log:
[...truncated 14172 lines...]
   [junit4] JVM J2: stdout was not empty, see: /home/jenkins/workspace/Lucene-Solr-master-Linux/solr/build/solr-core/test/temp/junit4-J2-20180824_015307_60515658941903744397590.sysout
   [junit4] >>> JVM J2 emitted unexpected output (verbatim) ----
   [junit4] #
   [junit4] # A fatal error has been detected by the Java Runtime Environment:
   [junit4] #
   [junit4] #  SIGSEGV (0xb) at pc=0x00007ff3a825bdc9, pid=26098, tid=26153
   [junit4] #
   [junit4] # JRE version: Java(TM) SE Runtime Environment (9.0+11) (build 9.0.4+11)
   [junit4] # Java VM: Java HotSpot(TM) 64-Bit Server VM (9.0.4+11, mixed mode, tiered, parallel gc, linux-amd64)
   [junit4] # Problematic frame:
   [junit4] # V  [libjvm.so+0xc5adc9]  PhaseIdealLoop::split_up(Node*, Node*, Node*) [clone .part.40]+0x619
   [junit4] #
   [junit4] # No core dump will be written. Core dumps have been disabled. To enable core dumping, try "ulimit -c unlimited" before starting Java again
   [junit4] #
   [junit4] # An error report file with more information is saved as:
   [junit4] # /home/jenkins/workspace/Lucene-Solr-master-Linux/solr/build/solr-core/test/J2/hs_err_pid26098.log
   [junit4] #
   [junit4] # Compiler replay data is saved as:
   [junit4] # /home/jenkins/workspace/Lucene-Solr-master-Linux/solr/build/solr-core/test/J2/replay_pid26098.log
   [junit4] #
   [junit4] # If you would like to submit a bug report, please visit:
   [junit4] #   http://bugreport.java.com/bugreport/crash.jsp
   [junit4] #
   [junit4] <<< JVM J2: EOF ----

[...truncated 1121 lines...]
   [junit4] ERROR: JVM J2 ended with an exception, command line: /home/jenkins/tools/java/64bit/jdk-9.0.4/bin/java -XX:-UseCompressedOops -XX:+UseParallelGC -XX:+HeapDumpOnOutOfMemoryError -XX:HeapDumpPath=/home/jenkins/workspace/Lucene-Solr-master-Linux/heapdumps -ea -esa --illegal-access=deny -Dtests.prefix=tests -Dtests.seed=E4061B05643A1767 -Xmx512M -Dtests.iters= -Dtests.verbose=false -Dtests.infostream=false -Dtests.codec=random -Dtests.postingsformat=random -Dtests.docvaluesformat=random -Dtests.locale=random -Dtests.timezone=random -Dtests.directory=random -Dtests.linedocsfile=europarl.lines.txt.gz -Dtests.luceneMatchVersion=8.0.0 -Dtests.cleanthreads=perClass -Djava.util.logging.config.file=/home/jenkins/workspace/Lucene-Solr-master-Linux/lucene/tools/junit4/logging.properties -Dtests.nightly=false -Dtests.weekly=false -Dtests.monster=false -Dtests.slow=true -Dtests.asserts=true -Dtests.multiplier=3 -DtempDir=./temp -Djava.io.tmpdir=./temp -Djunit4.tempDir=/home/jenkins/workspace/Lucene-Solr-master-Linux/solr/build/solr-core/test/temp -Dcommon.dir=/home/jenkins/workspace/Lucene-Solr-master-Linux/lucene -Dclover.db.dir=/home/jenkins/workspace/Lucene-Solr-master-Linux/lucene/build/clover/db -Djava.security.policy=/home/jenkins/workspace/Lucene-Solr-master-Linux/lucene/tools/junit4/solr-tests.policy -Dtests.LUCENE_VERSION=8.0.0 -Djetty.testMode=1 -Djetty.insecurerandom=1 -Dsolr.directoryFactory=org.apache.solr.core.MockDirectoryFactory -Djava.awt.headless=true -Djdk.map.althashing.threshold=0 -Dtests.src.home=/home/jenkins/workspace/Lucene-Solr-master-Linux -Djava.security.egd=file:/dev/./urandom -Djunit4.childvm.cwd=/home/jenkins/workspace/Lucene-Solr-master-Linux/solr/build/solr-core/test/J2 -Djunit4.childvm.id=2 -Djunit4.childvm.count=3 -Dfile.encoding=ISO-8859-1 -Djava.security.manager=org.apache.lucene.util.TestSecurityManager -Dtests.filterstacks=true -Dtests.leaveTemporary=false -Dtests.badapples=false -classpath /home/jenkins/workspace/Lucene-Solr-master-Linux/solr/build/solr-core/classes/test:/home/jenkins/workspace/Lucene-Solr-master-Linux/solr/build/solr-test-framework/classes/java:/home/jenkins/workspace/Lucene-Solr-master-Linux/solr/test-framework/lib/junit4-ant-2.6.0.jar:/home/jenkins/workspace/Lucene-Solr-master-Linux/solr/core/src/test-files:/home/jenkins/workspace/Lucene-Solr-master-Linux/lucene/build/test-framework/classes/java:/home/jenkins/workspace/Lucene-Solr-master-Linux/lucene/build/codecs/classes/java:/home/jenkins/workspace/Lucene-Solr-master-Linux/solr/build/solr-solrj/classes/java:/home/jenkins/workspace/Lucene-Solr-master-Linux/solr/build/solr-core/classes/java:/home/jenkins/workspace/Lucene-Solr-master-Linux/lucene/build/analysis/common/lucene-analyzers-common-8.0.0-SNAPSHOT.jar:/home/jenkins/workspace/Lucene-Solr-master-Linux/lucene/build/analysis/kuromoji/lucene-analyzers-kuromoji-8.0.0-SNAPSHOT.jar:/home/jenkins/workspace/Lucene-Solr-master-Linux/lucene/build/analysis/nori/lucene-analyzers-nori-8.0.0-SNAPSHOT.jar:/home/jenkins/workspace/Lucene-Solr-master-Linux/lucene/build/analysis/phonetic/lucene-analyzers-phonetic-8.0.0-SNAPSHOT.jar:/home/jenkins/workspace/Lucene-Solr-master-Linux/lucene/build/codecs/lucene-codecs-8.0.0-SNAPSHOT.jar:/home/jenkins/workspace/Lucene-Solr-master-Linux/lucene/build/backward-codecs/lucene-backward-codecs-8.0.0-SNAPSHOT.jar:/home/jenkins/workspace/Lucene-Solr-master-Linux/lucene/build/highlighter/lucene-highlighter-8.0.0-SNAPSHOT.jar:/home/jenkins/workspace/Lucene-Solr-master-Linux/lucene/build/memory/lucene-memory-8.0.0-SNAPSHOT.jar:/home/jenkins/workspace/Lucene-Solr-master-Linux/lucene/build/misc/lucene-misc-8.0.0-SNAPSHOT.jar:/home/jenkins/workspace/Lucene-Solr-master-Linux/lucene/build/spatial-extras/lucene-spatial-extras-8.0.0-SNAPSHOT.jar:/home/jenkins/workspace/Lucene-Solr-master-Linux/lucene/build/spatial3d/lucene-spatial3d-8.0.0-SNAPSHOT.jar:/home/jenkins/workspace/Lucene-Solr-master-Linux/lucene/build/expressions/lucene-expressions-8.0.0-SNAPSHOT.jar:/home/jenkins/workspace/Lucene-Solr-master-Linux/lucene/build/suggest/lucene-suggest-8.0.0-SNAPSHOT.jar:/home/jenkins/workspace/Lucene-Solr-master-Linux/lucene/build/grouping/lucene-grouping-8.0.0-SNAPSHOT.jar:/home/jenkins/workspace/Lucene-Solr-master-Linux/lucene/build/queries/lucene-queries-8.0.0-SNAPSHOT.jar:/home/jenkins/workspace/Lucene-Solr-master-Linux/lucene/build/queryparser/lucene-queryparser-8.0.0-SNAPSHOT.jar:/home/jenkins/workspace/Lucene-Solr-master-Linux/lucene/build/join/lucene-join-8.0.0-SNAPSHOT.jar:/home/jenkins/workspace/Lucene-Solr-master-Linux/lucene/build/sandbox/lucene-sandbox-8.0.0-SNAPSHOT.jar:/home/jenkins/workspace/Lucene-Solr-master-Linux/lucene/build/classification/lucene-classification-8.0.0-SNAPSHOT.jar:/home/jenkins/workspace/Lucene-Solr-master-Linux/solr/core/lib/antlr4-runtime-4.5.1-1.jar:/home/jenkins/workspace/Lucene-Solr-master-Linux/solr/core/lib/asm-5.1.jar:/home/jenkins/workspace/Lucene-Solr-master-Linux/solr/core/lib/asm-commons-5.1.jar:/home/jenkins/workspace/Lucene-Solr-master-Linux/solr/core/lib/avatica-core-1.10.0.jar:/home/jenkins/workspace/Lucene-Solr-master-Linux/solr/core/lib/caffeine-2.4.0.jar:/home/jenkins/workspace/Lucene-Solr-master-Linux/solr/core/lib/calcite-core-1.13.0.jar:/home/jenkins/workspace/Lucene-Solr-master-Linux/solr/core/lib/calcite-linq4j-1.13.0.jar:/home/jenkins/workspace/Lucene-Solr-master-Linux/solr/core/lib/commons-cli-1.2.jar:/home/jenkins/workspace/Lucene-Solr-master-Linux/solr/core/lib/commons-codec-1.10.jar:/home/jenkins/workspace/Lucene-Solr-master-Linux/solr/core/lib/commons-collections-3.2.2.jar:/home/jenkins/workspace/Lucene-Solr-master-Linux/solr/core/lib/commons-compiler-2.7.6.jar:/home/jenkins/workspace/Lucene-Solr-master-Linux/solr/core/lib/commons-configuration-1.6.jar:/home/jenkins/workspace/Lucene-Solr-master-Linux/solr/core/lib/commons-exec-1.3.jar:/home/jenkins/workspace/Lucene-Solr-master-Linux/solr/core/lib/commons-fileupload-1.3.3.jar:/home/jenkins/workspace/Lucene-Solr-master-Linux/solr/core/lib/commons-io-2.5.jar:/home/jenkins/workspace/Lucene-Solr-master-Linux/solr/core/lib/commons-lang-2.6.jar:/home/jenkins/workspace/Lucene-Solr-master-Linux/solr/core/lib/commons-lang3-3.6.jar:/home/jenkins/workspace/Lucene-Solr-master-Linux/solr/core/lib/curator-client-2.8.0.jar:/home/jenkins/workspace/Lucene-Solr-master-Linux/solr/core/lib/curator-framework-2.8.0.jar:/home/jenkins/workspace/Lucene-Solr-master-Linux/solr/core/lib/curator-recipes-2.8.0.jar:/home/jenkins/workspace/Lucene-Solr-master-Linux/solr/core/lib/disruptor-3.4.0.jar:/home/jenkins/workspace/Lucene-Solr-master-Linux/solr/core/lib/dom4j-1.6.1.jar:/home/jenkins/workspace/Lucene-Solr-master-Linux/solr/core/lib/eigenbase-properties-1.1.5.jar:/home/jenkins/workspace/Lucene-Solr-master-Linux/solr/core/lib/guava-14.0.1.jar:/home/jenkins/workspace/Lucene-Solr-master-Linux/solr/core/lib/hadoop-annotations-2.7.4.jar:/home/jenkins/workspace/Lucene-Solr-master-Linux/solr/core/lib/hadoop-auth-2.7.4.jar:/home/jenkins/workspace/Lucene-Solr-master-Linux/solr/core/lib/hadoop-common-2.7.4.jar:/home/jenkins/workspace/Lucene-Solr-master-Linux/solr/core/lib/hadoop-hdfs-2.7.4.jar:/home/jenkins/workspace/Lucene-Solr-master-Linux/solr/core/lib/hppc-0.8.1.jar:/home/jenkins/workspace/Lucene-Solr-master-Linux/solr/core/lib/htrace-core-3.2.0-incubating.jar:/home/jenkins/workspace/Lucene-Solr-master-Linux/solr/core/lib/jackson-annotations-2.9.5.jar:/home/jenkins/workspace/Lucene-Solr-master-Linux/solr/core/lib/jackson-core-2.9.5.jar:/home/jenkins/workspace/Lucene-Solr-master-Linux/solr/core/lib/jackson-core-asl-1.9.13.jar:/home/jenkins/workspace/Lucene-Solr-master-Linux/solr/core/lib/jackson-databind-2.9.5.jar:/home/jenkins/workspace/Lucene-Solr-master-Linux/solr/core/lib/jackson-dataformat-smile-2.9.5.jar:/home/jenkins/workspace/Lucene-Solr-master-Linux/solr/core/lib/jackson-mapper-asl-1.9.13.jar:/home/jenkins/workspace/Lucene-Solr-master-Linux/solr/core/lib/janino-2.7.6.jar:/home/jenkins/workspace/Lucene-Solr-master-Linux/solr/core/lib/jcl-over-slf4j-1.7.24.jar:/home/jenkins/workspace/Lucene-Solr-master-Linux/solr/core/lib/log4j-1.2-api-2.11.0.jar:/home/jenkins/workspace/Lucene-Solr-master-Linux/solr/core/lib/log4j-api-2.11.0.jar:/home/jenkins/workspace/Lucene-Solr-master-Linux/solr/core/lib/log4j-core-2.11.0.jar:/home/jenkins/workspace/Lucene-Solr-master-Linux/solr/core/lib/log4j-slf4j-impl-2.11.0.jar:/home/jenkins/workspace/Lucene-Solr-master-Linux/solr/core/lib/org.restlet-2.3.0.jar:/home/jenkins/workspace/Lucene-Solr-master-Linux/solr/core/lib/org.restlet.ext.servlet-2.3.0.jar:/home/jenkins/workspace/Lucene-Solr-master-Linux/solr/core/lib/protobuf-java-3.1.0.jar:/home/jenkins/workspace/Lucene-Solr-master-Linux/solr/core/lib/rrd4j-3.2.jar:/home/jenkins/workspace/Lucene-Solr-master-Linux/solr/core/lib/spatial4j-0.7.jar:/home/jenkins/workspace/Lucene-Solr-master-Linux/solr/core/lib/t-digest-3.1.jar:/home/jenkins/workspace/Lucene-Solr-master-Linux/solr/solrj/lib/commons-io-2.5.jar:/home/jenkins/workspace/Lucene-Solr-master-Linux/solr/solrj/lib/commons-math3-3.6.1.jar:/home/jenkins/workspace/Lucene-Solr-master-Linux/solr/solrj/lib/httpclient-4.5.3.jar:/home/jenkins/workspace/Lucene-Solr-master-Linux/solr/solrj/lib/httpcore-4.4.6.jar:/home/jenkins/workspace/Lucene-Solr-master-Linux/solr/solrj/lib/httpmime-4.5.3.jar:/home/jenkins/workspace/Lucene-Solr-master-Linux/solr/solrj/lib/jcl-over-slf4j-1.7.24.jar:/home/jenkins/workspace/Lucene-Solr-master-Linux/solr/solrj/lib/noggit-0.8.jar:/home/jenkins/workspace/Lucene-Solr-master-Linux/solr/solrj/lib/slf4j-api-1.7.24.jar:/home/jenkins/workspace/Lucene-Solr-master-Linux/solr/solrj/lib/stax2-api-3.1.4.jar:/home/jenkins/workspace/Lucene-Solr-master-Linux/solr/solrj/lib/woodstox-core-asl-4.4.1.jar:/home/jenkins/workspace/Lucene-Solr-master-Linux/solr/solrj/lib/zookeeper-3.4.11.jar:/home/jenkins/workspace/Lucene-Solr-master-Linux/solr/server/lib/gmetric4j-1.0.7.jar:/home/jenkins/workspace/Lucene-Solr-master-Linux/solr/server/lib/javax.servlet-api-3.1.0.jar:/home/jenkins/workspace/Lucene-Solr-master-Linux/solr/server/lib/jetty-continuation-9.4.11.v20180605.jar:/home/jenkins/workspace/Lucene-Solr-master-Linux/solr/server/lib/jetty-deploy-9.4.11.v20180605.jar:/home/jenkins/workspace/Lucene-Solr-master-Linux/solr/server/lib/jetty-http-9.4.11.v20180605.jar:/home/jenkins/workspace/Lucene-Solr-master-Linux/solr/server/lib/jetty-io-9.4.11.v20180605.jar:/home/jenkins/workspace/Lucene-Solr-master-Linux/solr/server/lib/jetty-jmx-9.4.11.v20180605.jar:/home/jenkins/workspace/Lucene-Solr-master-Linux/solr/server/lib/jetty-rewrite-9.4.11.v20180605.jar:/home/jenkins/workspace/Lucene-Solr-master-Linux/solr/server/lib/jetty-security-9.4.11.v20180605.jar:/home/jenkins/workspace/Lucene-Solr-master-Linux/solr/server/lib/jetty-server-9.4.11.v20180605.jar:/home/jenkins/workspace/Lucene-Solr-master-Linux/solr/server/lib/jetty-servlet-9.4.11.v20180605.jar:/home/jenkins/workspace/Lucene-Solr-master-Linux/solr/server/lib/jetty-servlets-9.4.11.v20180605.jar:/home/jenkins/workspace/Lucene-Solr-master-Linux/solr/server/lib/jetty-util-9.4.11.v20180605.jar:/home/jenkins/workspace/Lucene-Solr-master-Linux/solr/server/lib/jetty-webapp-9.4.11.v20180605.jar:/home/jenkins/workspace/Lucene-Solr-master-Linux/solr/server/lib/jetty-xml-9.4.11.v20180605.jar:/home/jenkins/workspace/Lucene-Solr-master-Linux/solr/server/lib/metrics-core-3.2.6.jar:/home/jenkins/workspace/Lucene-Solr-master-Linux/solr/server/lib/metrics-ganglia-3.2.6.jar:/home/jenkins/workspace/Lucene-Solr-master-Linux/solr/server/lib/metrics-graphite-3.2.6.jar:/home/jenkins/workspace/Lucene-Solr-master-Linux/solr/server/lib/metrics-jetty9-3.2.6.jar:/home/jenkins/workspace/Lucene-Solr-master-Linux/solr/server/lib/metrics-jvm-3.2.6.jar:/home/jenkins/workspace/Lucene-Solr-master-Linux/solr/example/example-DIH/solr/db/lib/derby-10.9.1.0.jar:/home/jenkins/workspace/Lucene-Solr-master-Linux/solr/example/example-DIH/solr/db/lib/hsqldb-2.4.0.jar:/home/jenkins/workspace/Lucene-Solr-master-Linux/lucene/build/core/classes/java:/home/jenkins/workspace/Lucene-Solr-master-Linux/lucene/test-framework/lib/junit-4.10.jar:/home/jenkins/workspace/Lucene-Solr-master-Linux/lucene/test-framework/lib/randomizedtesting-runner-2.6.0.jar:/home/jenkins/workspace/Lucene-Solr-master-Linux/solr/core/test-lib/antlr-2.7.7.jar:/home/jenkins/workspace/Lucene-Solr-master-Linux/solr/core/test-lib/antlr4-runtime-4.5.1-1.jar:/home/jenkins/workspace/Lucene-Solr-master-Linux/solr/core/test-lib/apacheds-core-2.0.0-M15.jar:/home/jenkins/workspace/Lucene-Solr-master-Linux/solr/core/test-lib/apacheds-core-api-2.0.0-M15.jar:/home/jenkins/workspace/Lucene-Solr-master-Linux/solr/core/test-lib/apacheds-core-avl-2.0.0-M15.jar:/home/jenkins/workspace/Lucene-Solr-master-Linux/solr/core/test-lib/apacheds-core-shared-2.0.0-M15.jar:/home/jenkins/workspace/Lucene-Solr-master-Linux/solr/core/test-lib/apacheds-i18n-2.0.0-M15.jar:/home/jenkins/workspace/Lucene-Solr-master-Linux/solr/core/test-lib/apacheds-interceptor-kerberos-2.0.0-M15.jar:/home/jenkins/workspace/Lucene-Solr-master-Linux/solr/core/test-lib/apacheds-interceptors-admin-2.0.0-M15.jar:/home/jenkins/workspace/Lucene-Solr-master-Linux/solr/core/test-lib/apacheds-interceptors-authn-2.0.0-M15.jar:/home/jenkins/workspace/Lucene-Solr-master-Linux/solr/core/test-lib/apacheds-interceptors-authz-2.0.0-M15.jar:/home/jenkins/workspace/Lucene-Solr-master-Linux/solr/core/test-lib/apacheds-interceptors-changelog-2.0.0-M15.jar:/home/jenkins/workspace/Lucene-Solr-master-Linux/solr/core/test-lib/apacheds-interceptors-collective-2.0.0-M15.jar:/home/jenkins/workspace/Lucene-Solr-master-Linux/solr/core/test-lib/apacheds-interceptors-event-2.0.0-M15.jar:/home/jenkins/workspace/Lucene-Solr-master-Linux/solr/core/test-lib/apacheds-interceptors-exception-2.0.0-M15.jar:/home/jenkins/workspace/Lucene-Solr-master-Linux/solr/core/test-lib/apacheds-interceptors-journal-2.0.0-M15.jar:/home/jenkins/workspace/Lucene-Solr-master-Linux/solr/core/test-lib/apacheds-interceptors-normalization-2.0.0-M15.jar:/home/jenkins/workspace/Lucene-Solr-master-Linux/solr/core/test-lib/apacheds-interceptors-operational-2.0.0-M15.jar:/home/jenkins/workspace/Lucene-Solr-master-Linux/solr/core/test-lib/apacheds-interceptors-referral-2.0.0-M15.jar:/home/jenkins/workspace/Lucene-Solr-master-Linux/solr/core/test-lib/apacheds-interceptors-schema-2.0.0-M15.jar:/home/jenkins/workspace/Lucene-Solr-master-Linux/solr/core/test-lib/apacheds-interceptors-subtree-2.0.0-M15.jar:/home/jenkins/workspace/Lucene-Solr-master-Linux/solr/core/test-lib/apacheds-interceptors-trigger-2.0.0-M15.jar:/home/jenkins/workspace/Lucene-Solr-master-Linux/solr/core/test-lib/apacheds-jdbm-partition-2.0.0-M15.jar:/home/jenkins/workspace/Lucene-Solr-master-Linux/solr/core/test-lib/apacheds-jdbm1-2.0.0-M2.jar:/home/jenkins/workspace/Lucene-Solr-master-Linux/solr/core/test-lib/apacheds-kerberos-codec-2.0.0-M15.jar:/home/jenkins/workspace/Lucene-Solr-master-Linux/solr/core/test-lib/apacheds-ldif-partition-2.0.0-M15.jar:/home/jenkins/workspace/Lucene-Solr-master-Linux/solr/core/test-lib/apacheds-mavibot-partition-2.0.0-M15.jar:/home/jenkins/workspace/Lucene-Solr-master-Linux/solr/core/test-lib/apacheds-protocol-kerberos-2.0.0-M15.jar:/home/jenkins/workspace/Lucene-Solr-master-Linux/solr/core/test-lib/apacheds-protocol-ldap-2.0.0-M15.jar:/home/jenkins/workspace/Lucene-Solr-master-Linux/solr/core/test-lib/apacheds-protocol-shared-2.0.0-M15.jar:/home/jenkins/workspace/Lucene-Solr-master-Linux/solr/core/test-lib/apacheds-xdbm-partition-2.0.0-M15.jar:/home/jenkins/workspace/Lucene-Solr-master-Linux/solr/core/test-lib/api-all-1.0.0-M20.jar:/home/jenkins/workspace/Lucene-Solr-master-Linux/solr/core/test-lib/bcprov-jdk15on-1.54.jar:/home/jenkins/workspace/Lucene-Solr-master-Linux/solr/core/test-lib/byte-buddy-1.6.2.jar:/home/jenkins/workspace/Lucene-Solr-master-Linux/solr/core/test-lib/commons-collections-3.2.2.jar:/home/jenkins/workspace/Lucene-Solr-master-Linux/solr/core/test-lib/commons-math3-3.6.1.jar:/home/jenkins/workspace/Lucene-Solr-master-Linux/solr/core/test-lib/ehcache-core-2.4.4.jar:/home/jenkins/workspace/Lucene-Solr-master-Linux/solr/core/test-lib/hadoop-common-2.7.4-tests.jar:/home/jenkins/workspace/Lucene-Solr-master-Linux/solr/core/test-lib/hadoop-hdfs-2.7.4-tests.jar:/home/jenkins/workspace/Lucene-Solr-master-Linux/solr/core/test-lib/hadoop-minikdc-2.7.4.jar:/home/jenkins/workspace/Lucene-Solr-master-Linux/solr/core/test-lib/htrace-core-3.2.0-incubating.jar:/home/jenkins/workspace/Lucene-Solr-master-Linux/solr/core/test-lib/jersey-core-1.9.jar:/home/jenkins/workspace/Lucene-Solr-master-Linux/solr/core/test-lib/jersey-server-1.9.jar:/home/jenkins/workspace/Lucene-Solr-master-Linux/solr/core/test-lib/jetty-6.1.26.jar:/home/jenkins/workspace/Lucene-Solr-master-Linux/solr/core/test-lib/jetty-sslengine-6.1.26.jar:/home/jenkins/workspace/Lucene-Solr-master-Linux/solr/core/test-lib/jetty-util-6.1.26.jar:/home/jenkins/workspace/Lucene-Solr-master-Linux/solr/core/test-lib/mina-core-2.0.0-M5.jar:/home/jenkins/workspace/Lucene-Solr-master-Linux/solr/core/test-lib/mockito-core-2.6.2.jar:/home/jenkins/workspace/Lucene-Solr-master-Linux/solr/core/test-lib/netty-all-4.0.36.Final.jar:/home/jenkins/workspace/Lucene-Solr-master-Linux/solr/core/test-lib/objenesis-2.5.jar:/home/jenkins/workspace/Lucene-Solr-master-Linux/lucene/build/analysis/icu/lucene-analyzers-icu-8.0.0-SNAPSHOT.jar:/home/jenkins/workspace/Lucene-Solr-master-Linux/solr/build/contrib/solr-analysis-extras/classes/java:/home/jenkins/workspace/Lucene-Solr-master-Linux/lucene/build/queryparser/classes/test:/home/jenkins/workspace/Lucene-Solr-master-Linux/lucene/build/backward-codecs/classes/test:/home/jenkins/workspace/Lucene-Solr-master-Linux/solr/contrib/analysis-extras/lib/icu4j-62.1.jar:/var/lib/jenkins/tools/hudson.tasks.Ant_AntInstallation/ANT_1.8.2/lib/ant-launcher.jar:/home/jenkins/.ant/lib/ivy-2.4.0.jar:/var/lib/jenkins/tools/hudson.tasks.Ant_AntInstallation/ANT_1.8.2/lib/ant-netrexx.jar:/var/lib/jenkins/tools/hudson.tasks.Ant_AntInstallation/ANT_1.8.2/lib/ant-apache-xalan2.jar:/var/lib/jenkins/tools/hudson.tasks.Ant_AntInstallation/ANT_1.8.2/lib/ant.jar:/var/lib/jenkins/tools/hudson.tasks.Ant_AntInstallation/ANT_1.8.2/lib/ant-javamail.jar:/var/lib/jenkins/tools/hudson.tasks.Ant_AntInstallation/ANT_1.8.2/lib/ant-commons-net.jar:/var/lib/jenkins/tools/hudson.tasks.Ant_AntInstallation/ANT_1.8.2/lib/ant-apache-regexp.jar:/var/lib/jenkins/tools/hudson.tasks.Ant_AntInstallation/ANT_1.8.2/lib/ant-apache-oro.jar:/var/lib/jenkins/tools/hudson.tasks.Ant_AntInstallation/ANT_1.8.2/lib/ant-jmf.jar:/var/lib/jenkins/tools/hudson.tasks.Ant_AntInstallation/ANT_1.8.2/lib/ant-apache-log4j.jar:/var/lib/jenkins/tools/hudson.tasks.Ant_AntInstallation/ANT_1.8.2/lib/ant-jsch.jar:/var/lib/jenkins/tools/hudson.tasks.Ant_AntInstallation/ANT_1.8.2/lib/ant-jai.jar:/var/lib/jenkins/tools/hudson.tasks.Ant_AntInstallation/ANT_1.8.2/lib/ant-apache-bsf.jar:/var/lib/jenkins/tools/hudson.tasks.Ant_AntInstallation/ANT_1.8.2/lib/ant-junit4.jar:/var/lib/jenkins/tools/hudson.tasks.Ant_AntInstallation/ANT_1.8.2/lib/ant-apache-resolver.jar:/var/lib/jenkins/tools/hudson.tasks.Ant_AntInstallation/ANT_1.8.2/lib/ant-apache-bcel.jar:/var/lib/jenkins/tools/hudson.tasks.Ant_AntInstallation/ANT_1.8.2/lib/ant-junit.jar:/var/lib/jenkins/tools/hudson.tasks.Ant_AntInstallation/ANT_1.8.2/lib/ant-jdepend.jar:/var/lib/jenkins/tools/hudson.tasks.Ant_AntInstallation/ANT_1.8.2/lib/ant-testutil.jar:/var/lib/jenkins/tools/hudson.tasks.Ant_AntInstallation/ANT_1.8.2/lib/ant-antlr.jar:/var/lib/jenkins/tools/hudson.tasks.Ant_AntInstallation/ANT_1.8.2/lib/ant-swing.jar:/var/lib/jenkins/tools/hudson.tasks.Ant_AntInstallation/ANT_1.8.2/lib/ant-commons-logging.jar:/home/jenkins/.ivy2/cache/com.carrotsearch.randomizedtesting/junit4-ant/jars/junit4-ant-2.6.0.jar com.carrotsearch.ant.tasks.junit4.slave.SlaveMainSafe -eventsfile /home/jenkins/workspace/Lucene-Solr-master-Linux/solr/build/solr-core/test/temp/junit4-J2-20180824_015307_60513865585386746835320.events @/home/jenkins/workspace/Lucene-Solr-master-Linux/solr/build/solr-core/test/temp/junit4-J2-20180824_015307_6056307115074461979992.suites -stdin
   [junit4] ERROR: JVM J2 ended with an exception: Forked process returned with error code: 134. Very likely a JVM crash.  See process stdout at: /home/jenkins/workspace/Lucene-Solr-master-Linux/solr/build/solr-core/test/temp/junit4-J2-20180824_015307_60515658941903744397590.sysout
   [junit4] 	at com.carrotsearch.ant.tasks.junit4.JUnit4.executeSlave(JUnit4.java:1519)
   [junit4] 	at com.carrotsearch.ant.tasks.junit4.JUnit4.access$000(JUnit4.java:126)
   [junit4] 	at com.carrotsearch.ant.tasks.junit4.JUnit4$2.call(JUnit4.java:982)
   [junit4] 	at com.carrotsearch.ant.tasks.junit4.JUnit4$2.call(JUnit4.java:979)
   [junit4] 	at java.base/java.util.concurrent.FutureTask.run(FutureTask.java:264)
   [junit4] 	at java.base/java.util.concurrent.ThreadPoolExecutor.runWorker(ThreadPoolExecutor.java:1167)
   [junit4] 	at java.base/java.util.concurrent.ThreadPoolExecutor$Worker.run(ThreadPoolExecutor.java:641)
   [junit4] 	at java.base/java.lang.Thread.run(Thread.java:844)

BUILD FAILED
/home/jenkins/workspace/Lucene-Solr-master-Linux/build.xml:633: The following error occurred while executing this line:
/home/jenkins/workspace/Lucene-Solr-master-Linux/build.xml:577: The following error occurred while executing this line:
/home/jenkins/workspace/Lucene-Solr-master-Linux/build.xml:59: The following error occurred while executing this line:
/home/jenkins/workspace/Lucene-Solr-master-Linux/solr/build.xml:267: The following error occurred while executing this line:
/home/jenkins/workspace/Lucene-Solr-master-Linux/solr/common-build.xml:558: The following error occurred while executing this line:
/home/jenkins/workspace/Lucene-Solr-master-Linux/lucene/common-build.xml:1568: The following error occurred while executing this line:
/home/jenkins/workspace/Lucene-Solr-master-Linux/lucene/common-build.xml:1092: At least one slave process threw an exception, first: Forked process returned with error code: 134. Very likely a JVM crash.  See process stdout at: /home/jenkins/workspace/Lucene-Solr-master-Linux/solr/build/solr-core/test/temp/junit4-J2-20180824_015307_60515658941903744397590.sysout

Total time: 78 minutes 11 seconds
Build step 'Invoke Ant' marked build as failure
Archiving artifacts
Setting ANT_1_8_2_HOME=/var/lib/jenkins/tools/hudson.tasks.Ant_AntInstallation/ANT_1.8.2
[WARNINGS] Skipping publisher since build result is FAILURE
Recording test results
Setting ANT_1_8_2_HOME=/var/lib/jenkins/tools/hudson.tasks.Ant_AntInstallation/ANT_1.8.2
Email was triggered for: Failure - Any
Sending email for trigger: Failure - Any
Setting ANT_1_8_2_HOME=/var/lib/jenkins/tools/hudson.tasks.Ant_AntInstallation/ANT_1.8.2
Setting ANT_1_8_2_HOME=/var/lib/jenkins/tools/hudson.tasks.Ant_AntInstallation/ANT_1.8.2
Setting ANT_1_8_2_HOME=/var/lib/jenkins/tools/hudson.tasks.Ant_AntInstallation/ANT_1.8.2
Setting ANT_1_8_2_HOME=/var/lib/jenkins/tools/hudson.tasks.Ant_AntInstallation/ANT_1.8.2