You are viewing a plain text version of this content. The canonical link for it is here.
Posted to commits@jena.apache.org by Apache Jenkins Server <je...@builds.apache.org> on 2016/04/15 22:09:49 UTC

Build failed in Jenkins: Jena_Development_Deploy #1151

See <https://builds.apache.org/job/Jena_Development_Deploy/1151/changes>

Changes:

[jaroslav.pullmann] Fixed static initialisation issue in OSGi by adding SPI-related headers

[jaroslav.pullmann] Jena-OSGi integration test updated, removed Xerces as embedded

[jaroslav.pullmann] Included new OSGified version of Dexx collection

[jaroslav.pullmann] Bundle's classloader used in ServiceLoader#load

[jaroslav.pullmann] Added Apache Karaf feature definition for Jena, reused in integration

[andy] Untab POM files

[andy] Remove logging. Remove extended JenaSubsystemRegistryBasic

[andy] reformat+comment

[andy] Make context setting purely local

[andy] JENA-913 : OSGi tests break in preflight 'verify'

------------------------------------------
Started by user andy
[EnvInject] - Loading node environment variables.
Building remotely on H10 (docker Ubuntu ubuntu yahoo-not-h2) in workspace <https://builds.apache.org/job/Jena_Development_Deploy/ws/>
 > git rev-parse --is-inside-work-tree # timeout=10
Fetching changes from the remote Git repository
 > git config remote.origin.url git://git.apache.org/jena.git # timeout=10
Fetching upstream changes from git://git.apache.org/jena.git
 > git --version # timeout=10
 > git -c core.askpass=true fetch --tags --progress git://git.apache.org/jena.git +refs/heads/*:refs/remotes/origin/*
 > git rev-parse origin/master^{commit} # timeout=10
Checking out Revision 4b9116cedd204d9d6fda1ceb7013436dd3ab576b (origin/master)
 > git config core.sparsecheckout # timeout=10
 > git checkout -f 4b9116cedd204d9d6fda1ceb7013436dd3ab576b
 > git rev-list b4de37daa513439ac9b0aa756d0d962cf372d15a # timeout=10
Parsing POMs
Discovered a new module org.apache.jena:jena-osgi-features Apache Jena - OSGi Karaf features
Modules changed, recalculating dependency graph
Established TCP socket on 55420
maven32-agent.jar already up to date
maven32-interceptor.jar already up to date
maven3-interceptor-commons.jar already up to date
[Jena_Development_Deploy] $ /home/jenkins/jenkins-slave/tools/hudson.model.JDK/latest1.8/bin/java -Xrs -cp /home/jenkins/jenkins-slave/maven32-agent.jar:/home/jenkins/jenkins-slave/tools/hudson.tasks.Maven_MavenInstallation/maven-3.3.3/boot/plexus-classworlds-2.5.2.jar:/home/jenkins/jenkins-slave/tools/hudson.tasks.Maven_MavenInstallation/maven-3.3.3/conf/logging jenkins.maven3.agent.Maven32Main /home/jenkins/jenkins-slave/tools/hudson.tasks.Maven_MavenInstallation/maven-3.3.3 /home/jenkins/jenkins-slave/slave.jar /home/jenkins/jenkins-slave/maven32-interceptor.jar /home/jenkins/jenkins-slave/maven3-interceptor-commons.jar 55420
<===[JENKINS REMOTING CAPACITY]===>   channel started
Executing Maven:  -B -f <https://builds.apache.org/job/Jena_Development_Deploy/ws/pom.xml> -Dmaven.repo.local=/home/jenkins/jenkins-slave/maven-repositories/0 clean deploy
[INFO] Scanning for projects...
[INFO] ------------------------------------------------------------------------
[INFO] Reactor Build Order:
[INFO] 
[INFO] Apache Jena - Parent
[INFO] Apache Jena - Shadowed external libraries
[INFO] Apache Jena - IRI
[INFO] Apache Jena - Base Common Environment
[INFO] Apache Jena - Core
[INFO] Apache Jena - ARQ (SPARQL 1.1 Query Engine)
[INFO] Apache Jena - TDB (Native Triple Store)
[INFO] Apache Jena - Libraries POM
[INFO] Apache Jena - Command line tools
[INFO] Apache Jena - SPARQL Text Search
[INFO] Apache Jena - SPARQL Spatial Search
[INFO] Apache Jena - Data Tables for RDF and SPARQL
[INFO] Apache Jena - SDB (SQL based triple store)
[INFO] Apache Jena - Fuseki1
[INFO] Apache Jena - Fuseki - A SPARQL 1.1 Server
[INFO] Apache Jena - Fuseki Server Engine
[INFO] Apache Jena - Fuseki WAR File
[INFO] Apache Jena - Fuseki Server Standalone Jar
[INFO] Apache Jena - Fuseki Binary Distribution
[INFO] Apache Jena - Security Permissions
[INFO] Apache Jena - JDBC Parent
[INFO] Apache Jena - JDBC Core API
[INFO] Apache Jena - JDBC Remote Endpoint Driver
[INFO] Apache Jena - JDBC In-Memory Driver
[INFO] Apache Jena - JDBC TDB Driver
[INFO] Apache Jena - JDBC Driver Bundle
[INFO] Apache Jena - Maven Plugins, including schemagen
[INFO] Apache Jena - Elephas
[INFO] Apache Jena - Elephas - Common API
[INFO] Apache Jena - Elephas - I/O
[INFO] Apache Jena - Elephas - Map/Reduce
[INFO] Apache Jena - Elephas - Statistics Demo App
[INFO] Apache Jena - Distribution
[INFO] Apache Jena - OSGi
[INFO] Apache Jena - OSGi bundle
[INFO] Apache Jena - OSGi Karaf features
[INFO] Apache Jena - Extras
[INFO] Apache Jena - Extras - Query Builder
[INFO] Apache Jena
[INFO]                                                                         
[INFO] ------------------------------------------------------------------------
[INFO] Building Apache Jena - Parent 16-SNAPSHOT
[INFO] ------------------------------------------------------------------------
[INFO] 
[INFO] --- maven-clean-plugin:2.5:clean (default-clean) @ jena-parent ---
[INFO] Deleting <https://builds.apache.org/job/Jena_Development_Deploy/ws/jena-parent/target>
[INFO] 
[INFO] --- maven-enforcer-plugin:1.3.1:enforce (enforce) @ jena-parent ---
[INFO] 
[INFO] --- apache-rat-plugin:0.11:check (rat-checks) @ jena-parent ---
[INFO] 51 implicit excludes (use -debug for more details).
[INFO] Exclude: **/META-INF/services/*
[INFO] Exclude: **/src-examples/data/*
[INFO] Exclude: **/dist/ABOUT
[INFO] Exclude: **/SEE_FUSEKI2
[INFO] Exclude: **/src/main/webapp/css/*
[INFO] Exclude: **/src/main/webapp/fonts/*
[INFO] Exclude: **/src/main/webapp/js/**/*
[INFO] Exclude: **/vocabularies/*
[INFO] Exclude: **/Vocabularies/*
[INFO] Exclude: **/src/main/**/*.html
[INFO] Exclude: **/src/**/package-info.java
[INFO] Exclude: **/DEPENDENCIES
[INFO] Exclude: **/*.txt
[INFO] Exclude: **/*.md
[INFO] Exclude: **/META-INF/services/*
[INFO] Exclude: **/src/test/resources/**/*
[INFO] Exclude: **/testing/**/*
[INFO] Exclude: **/log4j.properties
[INFO] Exclude: **/log4j-testing.properties
[INFO] Exclude: **/derby.log
[INFO] Exclude: **/DB/**/*
[INFO] Exclude: **/tdb*.cfg
[INFO] Exclude: **/run/**/*
[INFO] Exclude: **/*.classpath
[INFO] Exclude: **/target/**/*
[INFO] Exclude: **/dependency-reduced-pom.xml
[INFO] 3 resources included (use -debug for more details)
Warning:  org.apache.xerces.jaxp.SAXParserImpl$JAXPSAXParser: Property 'http://www.oracle.com/xml/jaxp/properties/entityExpansionLimit' is not recognized.
Compiler warnings:
  WARNING:  'org.apache.xerces.jaxp.SAXParserImpl: Property 'http://javax.xml.XMLConstants/property/accessExternalDTD' is not recognized.'
Warning:  org.apache.xerces.parsers.SAXParser: Feature 'http://javax.xml.XMLConstants/feature/secure-processing' is not recognized.
Warning:  org.apache.xerces.parsers.SAXParser: Property 'http://javax.xml.XMLConstants/property/accessExternalDTD' is not recognized.
Warning:  org.apache.xerces.parsers.SAXParser: Property 'http://www.oracle.com/xml/jaxp/properties/entityExpansionLimit' is not recognized.
[INFO] Rat check: Summary of files. Unapproved: 0 unknown: 0 generated: 0 approved: 1 licence.
[INFO] 
[INFO] --- maven-remote-resources-plugin:1.5:process (default) @ jena-parent ---
[INFO] 
[INFO] --- maven-site-plugin:3.4:attach-descriptor (attach-descriptor) @ jena-parent ---
[INFO] 
[INFO] --- maven-javadoc-plugin:2.9.1:jar (attach-javadocs) @ jena-parent ---
[INFO] Not executing Javadoc as the project is not a Java classpath-capable package
[INFO] 
[INFO] --- maven-install-plugin:2.5.2:install (default-install) @ jena-parent ---
[INFO] Installing <https://builds.apache.org/job/Jena_Development_Deploy/ws/jena-parent/pom.xml> to /home/jenkins/jenkins-slave/maven-repositories/0/org/apache/jena/jena-parent/16-SNAPSHOT/jena-parent-16-SNAPSHOT.pom
[INFO] 
[INFO] --- maven-deploy-plugin:2.8.2:deploy (default-deploy) @ jena-parent ---
[INFO] Downloading: https://repository.apache.org/content/repositories/snapshots/org/apache/jena/jena-parent/16-SNAPSHOT/maven-metadata.xml
[WARNING] Could not transfer metadata org.apache.jena:jena-parent:16-SNAPSHOT/maven-metadata.xml from/to apache.snapshots.https (https://repository.apache.org/content/repositories/snapshots): Connect to repository.apache.org:443 [repository.apache.org/140.211.11.112] failed: Connection timed out
[JENKINS] Archiving disabled
[JENKINS] Archiving disabled
[JENKINS] Archiving disabled
[JENKINS] Archiving disabled
[JENKINS] Archiving disabled
[JENKINS] Archiving disabled
[JENKINS] Archiving disabled
[JENKINS] Archiving disabled
[JENKINS] Archiving disabled
[JENKINS] Archiving disabled
[JENKINS] Archiving disabled
[JENKINS] Archiving disabled
[JENKINS] Archiving disabled
[JENKINS] Archiving disabled
[JENKINS] Archiving disabled
[JENKINS] Archiving disabled
[JENKINS] Archiving disabled
[JENKINS] Archiving disabled
[JENKINS] Archiving disabled
[JENKINS] Archiving disabled
[JENKINS] Archiving disabled
[JENKINS] Archiving disabled
[JENKINS] Archiving disabled
[JENKINS] Archiving disabled
[JENKINS] Archiving disabled
[JENKINS] Archiving disabled
[JENKINS] Archiving disabled
[JENKINS] Archiving disabled
[JENKINS] Archiving disabled
[JENKINS] Archiving disabled
[JENKINS] Archiving disabled
[JENKINS] Archiving disabled
[JENKINS] Archiving disabled
[JENKINS] Archiving disabled
[JENKINS] Archiving disabled
[JENKINS] Archiving disabled
[JENKINS] Archiving disabled
[JENKINS] Archiving disabled
[JENKINS] Archiving disabled
[JENKINS] Archiving disabled[INFO] ------------------------------------------------------------------------
[INFO] Reactor Summary:
[INFO] 
[INFO] Apache Jena - Parent ............................... FAILURE [02:16 min]
[INFO] Apache Jena - Shadowed external libraries .......... SKIPPED
[INFO] Apache Jena - IRI .................................. SKIPPED
[INFO] Apache Jena - Base Common Environment .............. SKIPPED
[INFO] Apache Jena - Core ................................. SKIPPED
[INFO] Apache Jena - ARQ (SPARQL 1.1 Query Engine) ........ SKIPPED
[INFO] Apache Jena - TDB (Native Triple Store) ............ SKIPPED
[INFO] Apache Jena - Libraries POM ........................ SKIPPED
[INFO] Apache Jena - Command line tools ................... SKIPPED
[INFO] Apache Jena - SPARQL Text Search ................... SKIPPED
[INFO] Apache Jena - SPARQL Spatial Search ................ SKIPPED
[INFO] Apache Jena - Data Tables for RDF and SPARQL ....... SKIPPED
[INFO] Apache Jena - SDB (SQL based triple store) ......... SKIPPED
[INFO] Apache Jena - Fuseki1 .............................. SKIPPED
[INFO] Apache Jena - Fuseki - A SPARQL 1.1 Server ......... SKIPPED
[INFO] Apache Jena - Fuseki Server Engine ................. SKIPPED
[INFO] Apache Jena - Fuseki WAR File ...................... SKIPPED
[INFO] Apache Jena - Fuseki Server Standalone Jar ......... SKIPPED
[INFO] Apache Jena - Fuseki Binary Distribution ........... SKIPPED
[INFO] Apache Jena - Security Permissions ................. SKIPPED
[INFO] Apache Jena - JDBC Parent .......................... SKIPPED
[INFO] Apache Jena - JDBC Core API ........................ SKIPPED
[INFO] Apache Jena - JDBC Remote Endpoint Driver .......... SKIPPED
[INFO] Apache Jena - JDBC In-Memory Driver ................ SKIPPED
[INFO] Apache Jena - JDBC TDB Driver ...................... SKIPPED
[INFO] Apache Jena - JDBC Driver Bundle ................... SKIPPED
[INFO] Apache Jena - Maven Plugins, including schemagen ... SKIPPED
[INFO] Apache Jena - Elephas .............................. SKIPPED
[INFO] Apache Jena - Elephas - Common API ................. SKIPPED
[INFO] Apache Jena - Elephas - I/O ........................ SKIPPED
[INFO] Apache Jena - Elephas - Map/Reduce ................. SKIPPED
[INFO] Apache Jena - Elephas - Statistics Demo App ........ SKIPPED
[INFO] Apache Jena - Distribution ......................... SKIPPED
[INFO] Apache Jena - OSGi ................................. SKIPPED
[INFO] Apache Jena - OSGi bundle .......................... SKIPPED
[INFO] Apache Jena - OSGi Karaf features .................. SKIPPED
[INFO] Apache Jena - Extras ............................... SKIPPED
[INFO] Apache Jena - Extras - Query Builder ............... SKIPPED
[INFO] Apache Jena ........................................ SKIPPED
[INFO] ------------------------------------------------------------------------
[INFO] BUILD FAILURE
[INFO] ------------------------------------------------------------------------
[INFO] Total time: 02:27 min
[INFO] Finished at: 2016-04-15T20:09:51+00:00

[INFO] Final Memory: 41M/1059M
[INFO] ------------------------------------------------------------------------
[ERROR] Failed to execute goal org.apache.maven.plugins:maven-deploy-plugin:2.8.2:deploy (default-deploy) on project jena-parent: Failed to retrieve remote metadata org.apache.jena:jena-parent:16-SNAPSHOT/maven-metadata.xml: Could not transfer metadata org.apache.jena:jena-parent:16-SNAPSHOT/maven-metadata.xml from/to apache.snapshots.https (https://repository.apache.org/content/repositories/snapshots): Connect to repository.apache.org:443 [repository.apache.org/140.211.11.112] failed: Connection timed out -> [Help 1]
[ERROR] 
[ERROR] To see the full stack trace of the errors, re-run Maven with the -e switch.
[ERROR] Re-run Maven using the -X switch to enable full debug logging.
[ERROR] 
[ERROR] For more information about the errors and possible solutions, please read the following articles:
[ERROR] [Help 1] http://cwiki.apache.org/confluence/display/MAVEN/MojoExecutionException
channel stopped

Jenkins build is back to normal : Jena_Development_Deploy #1152

Posted by Apache Jenkins Server <je...@builds.apache.org>.
See <https://builds.apache.org/job/Jena_Development_Deploy/1152/>