You are viewing a plain text version of this content. The canonical link for it is here.
Posted to dev@ibatis.apache.org by Nathan Maves <Na...@Sun.COM> on 2005/10/18 23:09:16 UTC

Running the tests

when I issue

     ant test.run

I get

test.run:

BUILD FAILED
/Users/nmaves/Development/iBatis/trunk/java/mapper/mapper2/build/ 
build.xml:181: Could not create task or type of type: junit.

Ant could not find the task or a class this task relies upon.

Why would this happen?

Nathan

Re: Running the tests

Posted by Clinton Begin <cl...@gmail.com>.
I don't know, but I do know that we're using a very old Ant version, and
probably old versions of all of our build tools.

Anyone interested in upgrading them?

Clinton

On 10/20/05, Nathan Maves <Na...@sun.com> wrote:
>
> Anyone know why I might be having trouble running the build scripts
> on OS X?
>
>
> On Oct 18, 2005, at 3:09 PM, Nathan Maves wrote:
>
> > when I issue
> >
> > ant test.run
> >
> > I get
> >
> > test.run:
> >
> > BUILD FAILED
> > /Users/nmaves/Development/iBatis/trunk/java/mapper/mapper2/build/
> > build.xml:181: Could not create task or type of type: junit.
> >
> > Ant could not find the task or a class this task relies upon.
> >
> > Why would this happen?
> >
> > Nathan
> >
>
>

Re: Running the tests

Posted by Nathan Maves <Na...@Sun.COM>.
Anyone know why I might be having trouble running the build scripts  
on OS X?


On Oct 18, 2005, at 3:09 PM, Nathan Maves wrote:

> when I issue
>
>     ant test.run
>
> I get
>
> test.run:
>
> BUILD FAILED
> /Users/nmaves/Development/iBatis/trunk/java/mapper/mapper2/build/ 
> build.xml:181: Could not create task or type of type: junit.
>
> Ant could not find the task or a class this task relies upon.
>
> Why would this happen?
>
> Nathan
>