You are viewing a plain text version of this content. The canonical link for it is here.
Posted to builds@cassandra.apache.org by Apache Jenkins Server <je...@builds.apache.org> on 2026/03/12 08:19:15 UTC
Build complete: Cassandra-trunk #2420 [UNSTABLE] fa85a056b2e3bde9837ac29b1a6fef2e33982790
-------------------------------------------------------------------------------
Build Cassandra-trunk #2420 Still Unstable
URL: https://ci-cassandra.apache.org/job/Cassandra-trunk/2420/
-------------------------------------------------------------------------------
Changes:
[Stefan Miklosovic] Fix instructions in README.asc of pylib
-------------------------------------------------------------------------------
Failed Tests:
40 tests failed.
FAILED: dtest-latest.materialized_views_test.TestMaterializedViews.Tests / dtest-latest jdk21 17/64 / test_complex_mv_select_statements
FAILED: dtest-latest.materialized_views_test.TestMaterializedViews.Tests / dtest-latest jdk17 17/64 / test_complex_mv_select_statements
FAILED: dtest-latest.repair_tests.repair_test.TestRepair.Tests / dtest-latest jdk17 13/64 / test_failure_during_validation
FAILED: dtest-novnode.repair_tests.repair_test.TestRepair.Tests / dtest-novnode jdk17 5/64 / test_dead_sync_initiator
FAILED: dtest-novnode.replace_address_test.TestReplaceAddress.Tests / dtest-novnode jdk21 31/64 / test_fail_without_replace
FAILED: dtest-upgrade-novnode.upgrade_tests.cql_tests.TestCQLNodes3RF3_Upgrade_indev_4_0_x_To_indev_trunk.Tests / dtest-upgrade-novnode jdk11 120/160 / test_SIM_assertion_error
FAILED: dtest.materialized_views_test.TestMaterializedViews.Tests / dtest jdk21 17/64 / test_complex_mv_select_statements
FAILED: org.apache.cassandra.db.compaction.CompactionTaskTest.Tests / test-latest jdk11 8/20 / testFullyExpiredSSTablesAreNotReleasedPrematurely-latest_jdk11_x86_64
FAILED: org.apache.cassandra.db.compaction.UnifiedCompactionStrategyTest.Tests / test jdk11 11/20 / testDropExpiredSSTables-_jdk11_x86_64
FAILED: org.apache.cassandra.db.compaction.UnifiedCompactionStrategyTest.Tests / test-latest jdk17 11/20 / testDropExpiredSSTables-latest_jdk17_x86_64
FAILED: org.apache.cassandra.distributed.test.guardrails.GuardrailItemsPerCollectionOnSSTableWriteTest.Tests / jvm-dtest jdk11 10/16 / testCompositeClusteringKey-_jdk11_x86_64
FAILED: org.apache.cassandra.distributed.upgrade.MixedModeMessageForwardTest.Tests / jvm-dtest-upgrade jdk11 3/6 / checkWritesForwardedToOtherDcTest-_jdk11_x86_64
FAILED: dtest.materialized_views_test.TestMaterializedViews.Tests / dtest jdk17 63/64 / test_drop_with_stopped_build
FAILED: dtest.secondary_indexes_test.TestSecondaryIndexes.Tests / dtest jdk17 63/64 / test_6924_dropping_ks
FAILED: org.apache.cassandra.distributed.test.accord.AccordProgressLogTest.Tests / jvm-dtest jdk11 7/16 / testFetchTimeWindow-_jdk11_x86_64
FAILED: org.apache.cassandra.simulator.test.ShortAccordSimulationTest.Tests / simulator-dtest jdk11 1/2 / simulationTest-_jdk11_x86_64
FAILED: org.apache.cassandra.distributed.test.accord.MigrationFromAccordWriteRaceTest.Tests / jvm-dtest jdk21 5/16 / testSplitAndRetryNonSerialLoggedBatchTwoTablesTwoPkeyHintedViaBatchLogRoutingFailure-_jdk21_x86_64
FAILED: org.apache.cassandra.simulator.test.HarrySimulatorTest.Tests / simulator-dtest jdk11 2/2 / test-_jdk11_x86_64
FAILED: dtest-novnode.materialized_views_test.TestMaterializedViews.Tests / dtest-novnode jdk21 7/64 / test_mv_with_default_ttl_with_flush
FAILED: dtest.materialized_views_test.TestMaterializedViews.Tests / dtest jdk21 1/64 / test_mv_with_default_ttl_with_flush
FAILED: junit.framework.TestSuite.Tests / jvm-dtest jdk21 5/16 / org.apache.cassandra.distributed.test.accord.MigrationFromAccordWriteRaceTest-_jdk21_x86_64
FAILED: org.apache.cassandra.simulator.test.SingleNodeSingleTableASTTest.Tests / simulator-dtest jdk11 1/2 / accordMixedReads-cassandra.testtag_IS_UNDEFINED
FAILED: org.apache.cassandra.simulator.test.AccordHarrySimulationTest.Tests / simulator-dtest jdk11 1/2 / test-cassandra.testtag_IS_UNDEFINED
FAILED: dtest-novnode.materialized_views_test.TestMaterializedViews.Tests / dtest-novnode jdk11 7/64 / test_mv_with_default_ttl_with_flush
FAILED: dtest-novnode.materialized_views_test.TestMaterializedViews.Tests / dtest-novnode jdk17 7/64 / test_mv_with_default_ttl_with_flush
FAILED: dtest.materialized_views_test.TestMaterializedViews.Tests / dtest jdk11 1/64 / test_mv_with_default_ttl_with_flush
FAILED: dtest.materialized_views_test.TestMaterializedViews.Tests / dtest jdk17 1/64 / test_mv_with_default_ttl_with_flush
FAILED: org.apache.cassandra.fuzz.topology.AccordBootstrapTest.Tests / jvm-dtest jdk21 9/16 / terminated successfully-cassandra.testtag_IS_UNDEFINED
FAILED: org.apache.cassandra.fuzz.topology.AccordBootstrapTest.Tests / jvm-dtest jdk11 9/16 / terminated successfully-cassandra.testtag_IS_UNDEFINED
FAILED: org.apache.cassandra.fuzz.topology.AccordBootstrapTest.Tests / jvm-dtest jdk17 9/16 / terminated successfully-cassandra.testtag_IS_UNDEFINED
FAILED: org.apache.cassandra.simulator.test.ShortPaxosSimulationTest.Tests / simulator-dtest jdk11 2/2 / selfReconcileTest-cassandra.testtag_IS_UNDEFINED
FAILED: org.apache.cassandra.index.accord.RouteIndexTest.Tests / test-oa jdk11 5/20 / test-cassandra.testtag_IS_UNDEFINED
FAILED: org.apache.cassandra.index.accord.RouteIndexTest.Tests / test jdk21 5/20 / test-cassandra.testtag_IS_UNDEFINED
FAILED: org.apache.cassandra.index.accord.RouteIndexTest.Tests / test-oa jdk21 5/20 / test-cassandra.testtag_IS_UNDEFINED
FAILED: org.apache.cassandra.index.accord.RouteIndexTest.Tests / test-latest jdk17 5/20 / test-cassandra.testtag_IS_UNDEFINED
FAILED: org.apache.cassandra.index.accord.RouteIndexTest.Tests / test-compression jdk21 5/20 / test-cassandra.testtag_IS_UNDEFINED
FAILED: org.apache.cassandra.index.accord.RouteIndexTest.Tests / test-compression jdk17 5/20 / test-cassandra.testtag_IS_UNDEFINED
FAILED: org.apache.cassandra.index.accord.RouteIndexTest.Tests / test-cdc jdk21 5/20 / test-cassandra.testtag_IS_UNDEFINED
FAILED: org.apache.cassandra.index.accord.RouteIndexTest.Tests / test-latest jdk21 5/20 / test-cassandra.testtag_IS_UNDEFINED
FAILED: org.apache.cassandra.distributed.upgrade.ClusterMetadataUpgradeHarryTest.Tests / jvm-dtest-upgrade jdk11 3/6 / simpleUpgradeTest-cassandra.testtag_IS_UNDEFINED
-------------------------------------------------------------------------------
For complete test report and logs see https://nightlies.apache.org/cassandra/Cassandra-trunk/2420/