You are viewing a plain text version of this content. The canonical link for it is here.
Posted to builds@beam.apache.org by Apache Jenkins Server <je...@builds.apache.org> on 2023/01/19 00:36:38 UTC
Build failed in Jenkins: beam_PostCommit_XVR_Direct #3643
See <https://ci-beam.apache.org/job/beam_PostCommit_XVR_Direct/3643/display/redirect?page=changes>
Changes:
[noreply] Remove trailing whitespace from blog to fix precommit (#25055)
[noreply] improve some errors from DoFnSignature (#25001)
[noreply] Bump torch (#24977)
[noreply] Set maxConnections optional in incoming schema for JdbcSchemaIOProvider
[noreply] Document that yield and return shouldn't be mixed. (#25060)
------------------------------------------
[...truncated 2.27 MB...]
>
>
>
coders: <
key: "PEksABrvoTVarIntCoder"
value: <
spec: <
urn: "beam:coders:javasdk:0.1"
payload: "\202SNAPPY\000\000\000\000\001\000\000\000\001\000\000\000\210\330\001\350\254\355\000\005sr\000&org.apache.beam.sdk.coders.VarIntCoder\300K2\332\251KVh\002\000\000xrr5\000\024Atomic\0055 \307\354\265\314\205tPF\002\0055\000*jj\000$Structured\0059\034s\277\022\016\325\3246\021\t9\000 j9\000\005/0C\335\325\211\256\274~\370\002\000\000xp"
>
>
>
coders: <
key: "PEksABrvoTVoidCoder"
value: <
spec: <
urn: "beam:coders:javasdk:0.1"
payload: "\202SNAPPY\000\000\000\000\001\000\000\000\001\000\000\000\210\326\001\350\254\355\000\005sr\000$org.apache.beam.sdk.coders.VoidCoder\271\277U\233\350\r\257U\002\000\000xr\000&j3\000\024Atomic\0055 \307\354\265\314\205tPF\002\0055\000*j5\000$Structured\0059\034s\277\022\016\325\3246\021\t9\000 j9\000\005/0C\335\325\211\256\274~\370\002\000\000xp"
>
>
>
coders: <
key: "c0"
value: <
spec: <
urn: "beam:coder:bytes:v1"
>
>
>
coders: <
key: "c1"
value: <
spec: <
urn: "beam:coder:global_window:v1"
>
>
>
coders: <
key: "c2"
value: <
spec: <
urn: "beam:coder:row:v1"
payload: "\n\r\n\007role_id\032\002\020\003\022$abc5e222-ab8f-4f6f-800a-a58bb0f45675"
>
>
>
environments: <
key: "PEksABrvoTbeam:env:docker:v1"
value: <
urn: "beam:env:docker:v1"
payload: "\n apache/beam_java8_sdk:2.46.0.dev"
capabilities: "beam:coder:bytes:v1"
capabilities: "beam:coder:bool:v1"
capabilities: "beam:coder:varint:v1"
capabilities: "beam:coder:string_utf8:v1"
capabilities: "beam:coder:iterable:v1"
capabilities: "beam:coder:timer:v1"
capabilities: "beam:coder:kv:v1"
capabilities: "beam:coder:length_prefix:v1"
capabilities: "beam:coder:global_window:v1"
capabilities: "beam:coder:interval_window:v1"
capabilities: "beam:coder:custom_window:v1"
capabilities: "beam:coder:windowed_value:v1"
capabilities: "beam:coder:double:v1"
capabilities: "beam:coder:row:v1"
capabilities: "beam:coder:param_windowed_value:v1"
capabilities: "beam:coder:state_backed_iterable:v1"
capabilities: "beam:coder:sharded_key:v1"
capabilities: "beam:coder:nullable:v1"
capabilities: "beam:protocol:multi_core_bundle_processing:v1"
capabilities: "beam:protocol:progress_reporting:v1"
capabilities: "beam:protocol:harness_monitoring_infos:v1"
capabilities: "beam:protocol:control_request_elements_embedding:v1"
capabilities: "beam:protocol:state_caching:v1"
capabilities: "beam:version:sdk_base:apache/beam_java8_sdk:2.46.0.dev"
capabilities: "beam:transform:sdf_truncate_sized_restrictions:v1"
capabilities: "beam:transform:to_string:v1"
dependencies: <
type_urn: "beam:artifact:type:file:v1"
type_payload: "\nL/tmp/artifacts/icedtea-sound-5xFkOD7aUmX8Jiw7lPqhn75zkNGCyUOfOuqi2rClWKM.jar\022@e71164383eda5265fc262c3b94faa19fbe7390d182c9439f3aeaa2dab0a558a3"
role_urn: "beam:artifact:role:staging_to:v1"
role_payload: "\n=icedtea-sound-5xFkOD7aUmX8Jiw7lPqhn75zkNGCyUOfOuqi2rClWKM.jar"
>
dependencies: <
type_urn: "beam:artifact:type:file:v1"
type_payload: "\nF/tmp/artifacts/jaccess-Rlp7GfuSFOBCBGdO8af2XxrTz5LqaQqwSMAXumdbHN0.jar\022@465a7b19fb9214e04204674ef1a7f65f1ad3cf92ea690ab048c017ba675b1cdd"
role_urn: "beam:artifact:role:staging_to:v1"
role_payload: "\n7jaccess-Rlp7GfuSFOBCBGdO8af2XxrTz5LqaQqwSMAXumdbHN0.jar"
>
dependencies: <
type_urn: "beam:artifact:type:file:v1"
type_payload: "\nI/tmp/artifacts/localedata-Nuzln2shadVmT-PppqaNc7GHBbUyMUb9pXsJTjRiAzs.jar\022@36ece59f6b2169d5664fe3e9a6a68d73b18705b5323146fda57b094e3462033b"
role_urn: "beam:artifact:role:staging_to:v1"
role_payload: "\n:localedata-Nuzln2shadVmT-PppqaNc7GHBbUyMUb9pXsJTjRiAzs.jar"
>
dependencies: <
type_urn: "beam:artifact:type:file:v1"
type_payload: "\nF/tmp/artifacts/nashorn-1iQRhJvU2nRCSB4ucg6f4b69TGiwE1yq0_LGG2MU5N0.jar\022@d62411849bd4da7442481e2e720e9fe1bebd4c68b0135caad3f2c61b6314e4dd"
role_urn: "beam:artifact:role:staging_to:v1"
role_payload: "\n7nashorn-1iQRhJvU2nRCSB4ucg6f4b69TGiwE1yq0_LGG2MU5N0.jar"
>
dependencies: <
type_urn: "beam:artifact:type:file:v1"
type_payload: "\nG/tmp/artifacts/cldrdata-MTK3mMuUzlWYlYkweGQNzI7dFpuLG0_8F8oxT0khQDc.jar\022@3132b798cb94ce559895893078640dcc8edd169b8b1b4ffc17ca314f49214037"
role_urn: "beam:artifact:role:staging_to:v1"
role_payload: "\n8cldrdata-MTK3mMuUzlWYlYkweGQNzI7dFpuLG0_8F8oxT0khQDc.jar"
>
dependencies: <
type_urn: "beam:artifact:type:file:v1"
type_payload: "\nD/tmp/artifacts/dnsns-YTF3f6B-OG4FmXLRf2ckHBi4VJnspBZTyIQCz-6Spwk.jar\022@6131777fa07e386e059972d17f67241c18b85499eca41653c88402cfee92a709"
role_urn: "beam:artifact:role:staging_to:v1"
role_payload: "\n5dnsns-YTF3f6B-OG4FmXLRf2ckHBi4VJnspBZTyIQCz-6Spwk.jar"
>
dependencies: <
type_urn: "beam:artifact:type:file:v1"
type_payload: "\n\203\001/tmp/artifacts/beam-sdks-java-extensions-schemaio-expansion-service-2.46.0-SNAPSHOT-UiuxCdWVzMTbiRG5cjf-UYAnAbQ7CDZ-yhSw7_hmDCA.jar\022@522bb109d595ccc4db8911b97237fe51802701b43b08367eca14b0eff8660c20"
role_urn: "beam:artifact:role:staging_to:v1"
role_payload: "\ntbeam-sdks-java-extensions-schemaio-expansion-service-2.46.0-SNAPSHOT-UiuxCdWVzMTbiRG5cjf-UYAnAbQ7CDZ-yhSw7_hmDCA.jar"
>
>
>
environments: <
key: "go"
value: <
urn: "beam:env:docker:v1"
payload: "\n\026apache/beam_go_sdk:dev"
capabilities: "beam:protocol:progress_reporting:v1"
capabilities: "beam:protocol:multi_core_bundle_processing:v1"
capabilities: "beam:transform:sdf_truncate_sized_restrictions:v1"
capabilities: "beam:protocol:worker_status:v1"
capabilities: "beam:protocol:monitoring_info_short_ids:v1"
capabilities: "beam:version:sdk_base:go:apache/beam_go_sdk:2.46.0.dev"
capabilities: "beam:coder:bytes:v1"
capabilities: "beam:coder:bool:v1"
capabilities: "beam:coder:varint:v1"
capabilities: "beam:coder:double:v1"
capabilities: "beam:coder:string_utf8:v1"
capabilities: "beam:coder:length_prefix:v1"
capabilities: "beam:coder:kv:v1"
capabilities: "beam:coder:iterable:v1"
capabilities: "beam:coder:state_backed_iterable:v1"
capabilities: "beam:coder:windowed_value:v1"
capabilities: "beam:coder:global_window:v1"
capabilities: "beam:coder:interval_window:v1"
capabilities: "beam:coder:row:v1"
capabilities: "beam:coder:nullable:v1"
dependencies: <
type_urn: "beam:artifact:type:file:v1"
role_urn: "beam:artifact:role:go_worker_binary:v1"
>
>
>
>
root_transform_ids: "s1"
root_transform_ids: "e2"
root_transform_ids: "e3"
root_transform_ids: "s3"
requirements: "beam:requirement:pardo:splittable_dofn:v1"
2023/01/19 00:02:17 Cross-compiling <https://ci-beam.apache.org/job/beam_PostCommit_XVR_Direct/ws/src/sdks/go/test/integration/io/xlang/jdbc/jdbc_test.go> as /tmp/worker-4-1674086537046792342
2023/01/19 00:02:24 Prepared job with id: go-testjdbcio_postgresreadwrite-217-5991d997-4971-4b60-b487-798039aa4841 and staging token: go-testjdbcio_postgresreadwrite-217-5991d997-4971-4b60-b487-798039aa4841
2023/01/19 00:02:25 Staged binary artifact with token:
2023/01/19 00:02:25 Submitted job: go-testjdbcio_postgresreadwrite-217-5991d997-4971-4b60-b487-798039aa4841
2023/01/19 00:02:25 2023-01-19 00:02:25. (1): Default Python SDK image for environment is apache/beam_python3.10_sdk:2.46.0.dev
2023/01/19 00:02:25 Job state: STOPPED
2023/01/19 00:02:25 Job state: STARTING
2023/01/19 00:02:25 Job state: RUNNING
2023/01/19 00:02:25 2023-01-19 00:02:25. (2): ==================== <function annotate_downstream_side_inputs at 0x7fc918518820> ====================
2023/01/19 00:02:25 2023-01-19 00:02:25. (3): ==================== <function fix_side_input_pcoll_coders at 0x7fc918518940> ====================
2023/01/19 00:02:25 2023-01-19 00:02:25. (4): ==================== <function pack_combiners at 0x7fc918518e50> ====================
2023/01/19 00:02:25 2023-01-19 00:02:25. (5): ==================== <function lift_combiners at 0x7fc918518ee0> ====================
2023/01/19 00:02:25 2023-01-19 00:02:25. (6): ==================== <function expand_sdf at 0x7fc918519090> ====================
2023/01/19 00:02:25 2023-01-19 00:02:25. (7): ==================== <function expand_gbk at 0x7fc918519120> ====================
2023/01/19 00:02:25 2023-01-19 00:02:25. (8): ==================== <function sink_flattens at 0x7fc918519240> ====================
2023/01/19 00:02:25 2023-01-19 00:02:25. (9): ==================== <function greedily_fuse at 0x7fc9185192d0> ====================
2023/01/19 00:02:25 2023-01-19 00:02:25. (10): ==================== <function read_to_impulse at 0x7fc918519360> ====================
2023/01/19 00:02:25 2023-01-19 00:02:25. (11): ==================== <function impulse_to_input at 0x7fc9185193f0> ====================
2023/01/19 00:02:25 2023-01-19 00:02:25. (12): ==================== <function sort_stages at 0x7fc918519630> ====================
2023/01/19 00:02:25 2023-01-19 00:02:25. (13): ==================== <function add_impulse_to_dangling_transforms at 0x7fc918519750> ====================
2023/01/19 00:02:25 2023-01-19 00:02:25. (14): ==================== <function setup_timer_mapping at 0x7fc9185195a0> ====================
2023/01/19 00:02:25 2023-01-19 00:02:25. (15): ==================== <function populate_data_channel_coders at 0x7fc9185196c0> ====================
2023/01/19 00:02:25 2023-01-19 00:02:25. (16): starting control server on port 41957
2023/01/19 00:02:25 2023-01-19 00:02:25. (17): starting data server on port 40933
2023/01/19 00:02:25 2023-01-19 00:02:25. (18): starting state server on port 38565
2023/01/19 00:02:25 2023-01-19 00:02:25. (19): starting logging server on port 34307
2023/01/19 00:02:25 2023-01-19 00:02:25. (20): Created Worker handler <apache_beam.runners.portability.fn_api_runner.worker_handlers.DockerSdkWorkerHandler object at 0x7fc91833b8b0> for environment go (beam:env:docker:v1, b'\n\x16apache/beam_go_sdk:dev')
2023/01/19 00:02:25 2023-01-19 00:02:25. (21): Attempting to pull image apache/beam_go_sdk:dev
2023/01/19 00:02:26 2023-01-19 00:02:26. (22): Unable to pull image apache/beam_go_sdk:dev, defaulting to local image if it exists
2023/01/19 00:02:30 2023-01-19 00:02:30. (23): Waiting for docker to start up. Current status is running
2023/01/19 00:02:30 2023-01-19 00:02:30. (24): Docker container is running. container_id = b'd6cc4e862af608c36df401d0a73b8317fe66ffa6187cd9f3c969da7f6a0c71e8', worker_id = worker_14
2023/01/19 00:02:31 2023-01-19 00:02:31. (25): Created Worker handler <apache_beam.runners.portability.fn_api_runner.worker_handlers.DockerSdkWorkerHandler object at 0x7fc9183852a0> for environment PEksABrvoTbeam:env:docker:v1 (beam:env:docker:v1, b'\n apache/beam_java8_sdk:2.46.0.dev')
2023/01/19 00:02:36 2023-01-19 00:02:36. (26): Attempting to pull image apache/beam_java8_sdk:2.46.0.dev
2023/01/19 00:02:37 2023-01-19 00:02:37. (27): Unable to pull image apache/beam_java8_sdk:2.46.0.dev, defaulting to local image if it exists
2023/01/19 00:02:39 2023-01-19 00:02:39. (28): Waiting for docker to start up. Current status is running
2023/01/19 00:02:39 2023-01-19 00:02:39. (29): Docker container is running. container_id = b'e4adfa22bcfbda768bf7a5b32b2d9ed0da4351ea5cfc18f0695757d38f857ae1', worker_id = worker_16
2023/01/19 00:02:52 2023-01-19 00:02:52. (30): Completed job in 26.705727100372314 seconds with state DONE.
2023/01/19 00:02:52 Job state: DONE
--- PASS: TestJDBCIO_PostgresReadWrite (71.81s)
PASS
ok github.com/apache/beam/sdks/v2/go/test/integration/io/xlang/jdbc 159.652s
=== RUN TestKafkaIO_BasicReadWrite
integration.go:308: Test TestKafkaIO_BasicReadWrite is currently filtered for runner portable
--- SKIP: TestKafkaIO_BasicReadWrite (0.00s)
PASS
ok github.com/apache/beam/sdks/v2/go/test/integration/io/xlang/kafka 6.154s
> Task :sdks:python:test-suites:direct:xlang:validatesCrossLanguageRunnerJavaUsingPython
INFO:apache_beam.runners.portability.stager:Executing command: ['/home/jenkins/.apache_beam/cache/venvs/py-3.8-beam-2.44.0-743bdccef67087512a7a190820e727aab7bdcb14/bin/python', '-m', 'pip', 'download', '--dest', '/tmp/dataflow-requirements-cache', '-r', '/tmp/tmpegnfp1_i/tmp_requirements.txt', '--exists-action', 'i', '--no-deps', '--implementation', 'cp', '--abi', 'cp38', '--platform', 'manylinux2014_x86_64']
org.apache.beam.sdk.extensions.python.PythonExternalTransformTest > pythonTransformWithDependencies FAILED
java.lang.RuntimeException at PythonExternalTransformTest.java:72
Caused by: java.util.concurrent.TimeoutException at PythonExternalTransformTest.java:72
15 tests completed, 1 failed
> Task :sdks:python:test-suites:direct:xlang:validatesCrossLanguageRunnerJavaUsingPython FAILED
> Task :sdks:python:test-suites:direct:xlang:validatesCrossLanguageRunnerPythonUsingJava
> Task :sdks:python:test-suites:direct:xlang:validatesCrossLanguageRunnerPythonUsingSql
> Task :sdks:python:test-suites:direct:xlang:fnApiJobServerCleanup
> Task :sdks:python:test-suites:direct:xlang:validatesCrossLanguageRunnerCleanup
FAILURE: Build failed with an exception.
* What went wrong:
Execution failed for task ':sdks:python:test-suites:direct:xlang:validatesCrossLanguageRunnerJavaUsingPython'.
> There were failing tests. See the report at: file://<https://ci-beam.apache.org/job/beam_PostCommit_XVR_Direct/ws/src/sdks/python/test-suites/direct/xlang/build/reports/tests/validatesCrossLanguageRunnerJavaUsingPython/index.html>
* Try:
> Run with --stacktrace option to get the stack trace.
> Run with --info or --debug option to get more log output.
* Get more help at https://help.gradle.org
Deprecated Gradle features were used in this build, making it incompatible with Gradle 8.0.
You can use '--warning-mode all' to show the individual deprecation warnings and determine if they come from your own scripts or plugins.
See https://docs.gradle.org/7.5.1/userguide/command_line_interface.html#sec:command_line_warnings
Execution optimizations have been disabled for 1 invalid unit(s) of work during this build to ensure correctness.
Please consult deprecation warnings for more details.
BUILD FAILED in 49m 10s
233 actionable tasks: 32 executed, 201 up-to-date
Publishing build scan...
https://gradle.com/s/eyfgmafhzaurg
Build step 'Invoke Gradle script' changed build result to FAILURE
Build step 'Invoke Gradle script' marked build as failure
---------------------------------------------------------------------
To unsubscribe, e-mail: builds-unsubscribe@beam.apache.org
For additional commands, e-mail: builds-help@beam.apache.org
Jenkins build is back to normal : beam_PostCommit_XVR_Direct #3644
Posted by Apache Jenkins Server <je...@builds.apache.org>.
See <https://ci-beam.apache.org/job/beam_PostCommit_XVR_Direct/3644/display/redirect?page=changes>
---------------------------------------------------------------------
To unsubscribe, e-mail: builds-unsubscribe@beam.apache.org
For additional commands, e-mail: builds-help@beam.apache.org