You are viewing a plain text version of this content. The canonical link for it is here.
Posted to commits@karaf.apache.org by Apache Jenkins Server <je...@builds.apache.org> on 2017/10/12 09:12:58 UTC
Build failed in Jenkins: karaf-master #4691
See <https://builds.apache.org/job/karaf-master/4691/display/redirect?page=changes>
Changes:
[pantinor] KARAF-5413 - Added missing version in features.xml descriptors
------------------------------------------
[...truncated 1.79 MB...]
[INFO] Building jar: <https://builds.apache.org/job/karaf-master/ws/itests/target/itests-4.2.0-SNAPSHOT-tests.jar>
[INFO]
[INFO] --- maven-install-plugin:2.5.2:install (default-install) @ itests ---
[INFO] Installing <https://builds.apache.org/job/karaf-master/ws/itests/target/itests-4.2.0-SNAPSHOT.jar> to <https://builds.apache.org/job/karaf-master/ws/.repository/org/apache/karaf/itests/itests/4.2.0-SNAPSHOT/itests-4.2.0-SNAPSHOT.jar>
[INFO] Installing <https://builds.apache.org/job/karaf-master/ws/itests/pom.xml> to <https://builds.apache.org/job/karaf-master/ws/.repository/org/apache/karaf/itests/itests/4.2.0-SNAPSHOT/itests-4.2.0-SNAPSHOT.pom>
[INFO] Installing <https://builds.apache.org/job/karaf-master/ws/itests/target/itests-4.2.0-SNAPSHOT-tests.jar> to <https://builds.apache.org/job/karaf-master/ws/.repository/org/apache/karaf/itests/itests/4.2.0-SNAPSHOT/itests-4.2.0-SNAPSHOT-tests.jar>
[INFO]
[INFO] --- maven-deploy-plugin:2.8.2:deploy (default-deploy) @ itests ---
[INFO] Downloading: https://repository.apache.org/content/repositories/snapshots/org/apache/karaf/itests/itests/4.2.0-SNAPSHOT/maven-metadata.xml
[INFO] Downloaded: https://repository.apache.org/content/repositories/snapshots/org/apache/karaf/itests/itests/4.2.0-SNAPSHOT/maven-metadata.xml (999 B at 1.0 KB/sec)
[INFO] Uploading: https://repository.apache.org/content/repositories/snapshots/org/apache/karaf/itests/itests/4.2.0-SNAPSHOT/itests-4.2.0-20171012.090650-359.jar
[INFO] Uploaded: https://repository.apache.org/content/repositories/snapshots/org/apache/karaf/itests/itests/4.2.0-SNAPSHOT/itests-4.2.0-20171012.090650-359.jar (13 KB at 13.4 KB/sec)
[INFO] Uploading: https://repository.apache.org/content/repositories/snapshots/org/apache/karaf/itests/itests/4.2.0-SNAPSHOT/itests-4.2.0-20171012.090650-359.pom
[INFO] Uploaded: https://repository.apache.org/content/repositories/snapshots/org/apache/karaf/itests/itests/4.2.0-SNAPSHOT/itests-4.2.0-20171012.090650-359.pom (13 KB at 13.1 KB/sec)
[INFO] Downloading: https://repository.apache.org/content/repositories/snapshots/org/apache/karaf/itests/itests/maven-metadata.xml
[INFO] Downloaded: https://repository.apache.org/content/repositories/snapshots/org/apache/karaf/itests/itests/maven-metadata.xml (674 B at 1.2 KB/sec)
[INFO] Uploading: https://repository.apache.org/content/repositories/snapshots/org/apache/karaf/itests/itests/4.2.0-SNAPSHOT/maven-metadata.xml
[INFO] Uploaded: https://repository.apache.org/content/repositories/snapshots/org/apache/karaf/itests/itests/4.2.0-SNAPSHOT/maven-metadata.xml (999 B at 1.1 KB/sec)
[INFO] Uploading: https://repository.apache.org/content/repositories/snapshots/org/apache/karaf/itests/itests/maven-metadata.xml
[INFO] Uploaded: https://repository.apache.org/content/repositories/snapshots/org/apache/karaf/itests/itests/maven-metadata.xml (674 B at 0.8 KB/sec)
[INFO] Uploading: https://repository.apache.org/content/repositories/snapshots/org/apache/karaf/itests/itests/4.2.0-SNAPSHOT/itests-4.2.0-20171012.090650-359-tests.jar
[INFO] Uploaded: https://repository.apache.org/content/repositories/snapshots/org/apache/karaf/itests/itests/4.2.0-SNAPSHOT/itests-4.2.0-20171012.090650-359-tests.jar (153 KB at 137.8 KB/sec)
[INFO] Uploading: https://repository.apache.org/content/repositories/snapshots/org/apache/karaf/itests/itests/4.2.0-SNAPSHOT/maven-metadata.xml
[INFO] Uploaded: https://repository.apache.org/content/repositories/snapshots/org/apache/karaf/itests/itests/4.2.0-SNAPSHOT/maven-metadata.xml (999 B at 1.1 KB/sec)
[INFO] ------------------------------------------------------------------------
[INFO] Reactor Summary:
[INFO]
[INFO] Apache Karaf ....................................... SUCCESS [ 10.309 s]
[INFO] Apache Karaf :: JAAS ............................... SUCCESS [ 5.322 s]
[INFO] Apache Karaf :: JAAS :: Boot ....................... SUCCESS [ 10.929 s]
[INFO] Apache Karaf :: Util ............................... SUCCESS [01:36 min]
[INFO] Apache Karaf :: Main ............................... SUCCESS [ 53.212 s]
[INFO] Apache Karaf :: Features ........................... SUCCESS [ 29.804 s]
[INFO] Apache Karaf :: Features :: Extension .............. SUCCESS [ 9.694 s]
[INFO] Apache Karaf :: Service ............................ SUCCESS [ 5.555 s]
[INFO] Apache Karaf :: Service :: Guard ................... SUCCESS [ 25.536 s]
[INFO] Apache Karaf :: Shell .............................. SUCCESS [ 5.548 s]
[INFO] Apache Karaf :: Shell :: Core ...................... SUCCESS [ 55.315 s]
[INFO] Apache Karaf :: Tooling ............................ SUCCESS [ 33.132 s]
[INFO] Apache Karaf :: Tooling :: Maven Karaf Plugin for Services Metadata SUCCESS [ 40.034 s]
[INFO] Apache Karaf :: Features :: Core ................... SUCCESS [ 16.619 s]
[INFO] Apache Karaf :: Features :: Command ................ SUCCESS [ 10.859 s]
[INFO] Apache Karaf :: KAR :: Core ........................ SUCCESS [ 9.776 s]
[INFO] Apache Karaf :: JAAS :: Config ..................... SUCCESS [ 17.868 s]
[INFO] Apache Karaf :: JAAS :: Modules .................... SUCCESS [03:12 min]
[INFO] Apache Karaf :: Bundle ............................. SUCCESS [ 32.617 s]
[INFO] Apache Karaf :: Bundle :: Core ..................... SUCCESS [ 49.510 s]
[INFO] Apache Karaf :: Bundle :: BlueprintStateService .... SUCCESS [ 32.104 s]
[INFO] Apache Karaf :: Bundle :: SpringStateService ....... SUCCESS [ 32.658 s]
[INFO] Apache Karaf :: ConfigAdmin :: Core ................ SUCCESS [ 48.715 s]
[INFO] Apache Karaf :: Tooling :: Utils ................... SUCCESS [ 57.102 s]
[INFO] Apache Karaf :: Deployer ........................... SUCCESS [ 32.905 s]
[INFO] Apache Karaf :: Deployer :: Blueprint .............. SUCCESS [ 45.425 s]
[INFO] Apache Karaf :: Deployer :: Spring ................. SUCCESS [ 37.309 s]
[INFO] Apache Karaf :: Demos :: Profiles :: Registry ...... SUCCESS [ 28.331 s]
[INFO] Apache Karaf :: Profile :: Core .................... SUCCESS [ 13.298 s]
[INFO] Apache Karaf :: Instance :: Core ................... SUCCESS [ 14.114 s]
[INFO] Apache Karaf :: Package :: Core .................... SUCCESS [ 20.954 s]
[INFO] Apache Karaf :: HTTP :: Core ....................... SUCCESS [ 9.137 s]
[INFO] Apache Karaf :: Service :: Core .................... SUCCESS [ 9.795 s]
[INFO] Apache Karaf :: Log :: Core ........................ SUCCESS [ 53.106 s]
[INFO] Apache Karaf :: Deployer :: Features ............... SUCCESS [ 28.666 s]
[INFO] Apache Karaf :: Deployer :: Karaf Archive (.kar) ... SUCCESS [ 9.719 s]
[INFO] Apache Karaf :: Deployer :: Wrap Non OSGi Jar ...... SUCCESS [ 7.998 s]
[INFO] Apache Karaf :: Shell :: Various Commands .......... SUCCESS [ 9.740 s]
[INFO] Apache Karaf :: Shell :: Console ................... SUCCESS [ 9.419 s]
[INFO] Apache Karaf :: Shell :: Table ..................... SUCCESS [ 8.791 s]
[INFO] Apache Karaf :: Shell :: SSH ....................... SUCCESS [01:22 min]
[INFO] Apache Karaf :: JAAS :: Jasypt Encryption .......... SUCCESS [ 8.957 s]
[INFO] Apache Karaf :: JAAS :: Command .................... SUCCESS [ 35.820 s]
[INFO] Apache Karaf :: JAAS :: Blueprint .................. SUCCESS [ 33.992 s]
[INFO] Apache Karaf :: JAAS :: Blueprint :: Config ........ SUCCESS [ 41.510 s]
[INFO] Apache Karaf :: JAAS :: Blueprint :: Jasypt ........ SUCCESS [ 10.672 s]
[INFO] Apache Karaf :: Client ............................. SUCCESS [ 11.571 s]
[INFO] Apache Karaf :: Management ......................... SUCCESS [ 6.360 s]
[INFO] Apache Karaf :: Management ......................... SUCCESS [ 21.870 s]
[INFO] Apache Karaf :: System :: Core ..................... SUCCESS [ 9.604 s]
[INFO] Apache Karaf :: Web :: Core ........................ SUCCESS [ 9.206 s]
[INFO] Apache Karaf :: Wrapper :: Core .................... SUCCESS [ 24.454 s]
[INFO] Apache Karaf :: Web Console ........................ SUCCESS [ 18.499 s]
[INFO] Apache Karaf :: Web Console :: Console ............. SUCCESS [ 18.381 s]
[INFO] Apache Karaf :: Web Console :: Features Plugin ..... SUCCESS [ 9.223 s]
[INFO] Apache Karaf :: Web Console :: Gogo Plugin ......... SUCCESS [ 9.387 s]
[INFO] Apache Karaf :: Web Console :: HTTP Plugin ......... SUCCESS [ 20.822 s]
[INFO] Apache Karaf :: Web Console :: Instance Plugin ..... SUCCESS [ 13.248 s]
[INFO] Apache Karaf :: Exception .......................... SUCCESS [ 7.586 s]
[INFO] Apache Karaf :: Scheduler :: Core .................. SUCCESS [ 10.389 s]
[INFO] Apache Karaf :: Declarative Services (DS) .......... SUCCESS [ 5.328 s]
[INFO] Apache Karaf :: SCR :: Management MBeans ........... SUCCESS [ 7.825 s]
[INFO] Apache Karaf :: SCR :: Bundle State ................ SUCCESS [ 8.303 s]
[INFO] Apache Karaf :: SCR :: Examples .................... SUCCESS [ 5.443 s]
[INFO] Apache Karaf :: SCR :: Examples :: Basic Service ... SUCCESS [ 7.735 s]
[INFO] Apache Karaf :: SCR :: Examples :: Managed Services SUCCESS [ 7.654 s]
[INFO] Apache Karaf :: SCR :: Examples :: Component Factories SUCCESS [ 7.768 s]
[INFO] Apache Karaf :: Diagnostic ......................... SUCCESS [ 5.247 s]
[INFO] Apache Karaf :: Diagnostic :: Boot ................. SUCCESS [ 7.791 s]
[INFO] Apache Karaf :: Diagnostic :: Core ................. SUCCESS [ 9.723 s]
[INFO] Apache Karaf :: OBR :: Core ........................ SUCCESS [ 8.629 s]
[INFO] Apache Karaf :: JNDI :: Core ....................... SUCCESS [ 8.637 s]
[INFO] Apache Karaf :: JDBC :: Core ....................... SUCCESS [ 8.694 s]
[INFO] Apache Karaf :: JMS :: Core ........................ SUCCESS [ 9.580 s]
[INFO] Apache Karaf :: JPA :: Parent ...................... SUCCESS [ 5.331 s]
[INFO] Apache Karaf :: JPA :: Hibernate ................... SUCCESS [ 7.740 s]
[INFO] Apache Karaf :: Maven :: Core ...................... SUCCESS [ 13.189 s]
[INFO] Apache Karaf :: Maven .............................. SUCCESS [ 5.479 s]
[INFO] Apache Karaf :: OSGi Services :: Coordinator ....... SUCCESS [ 8.138 s]
[INFO] Apache Karaf :: OSGi Services :: EventAdmin ........ SUCCESS [ 8.426 s]
[INFO] Apache Karaf :: OSGi Services :: Static ConfigAdmin SUCCESS [ 7.969 s]
[INFO] Apache Karaf :: OSGi Services ...................... SUCCESS [ 5.614 s]
[INFO] Apache Karaf :: Subsystem :: Core .................. SUCCESS [ 20.359 s]
[INFO] Apache Karaf :: OSGi Services :: Event ............. SUCCESS [ 9.479 s]
[INFO] Apache Karaf :: Tooling :: Maven Karaf Plugin ...... SUCCESS [04:24 min]
[INFO] Apache Karaf :: Assemblies ......................... SUCCESS [ 5.668 s]
[INFO] Apache Karaf :: Assemblies :: Features ............. SUCCESS [ 5.310 s]
[INFO] Apache Karaf :: Assemblies :: Features :: Base ..... SUCCESS [ 23.897 s]
[INFO] Apache Karaf :: Assemblies :: Features :: Framework SUCCESS [ 18.335 s]
[INFO] Apache Karaf :: Assemblies :: Features :: Static ... SUCCESS [ 22.214 s]
[INFO] Apache Karaf :: Assemblies :: Features :: Standard . SUCCESS [ 52.342 s]
[INFO] Apache Karaf :: Assemblies :: Features :: Spring ... SUCCESS [ 16.450 s]
[INFO] Apache Karaf :: Assemblies :: Features :: Spring Legacy SUCCESS [ 52.005 s]
[INFO] Apache Karaf :: Assemblies :: Features :: Enterprise SUCCESS [ 14.711 s]
[INFO] Apache Karaf :: Assemblies :: Features :: Enterprise Legacy SUCCESS [ 14.760 s]
[INFO] Apache Karaf :: Assemblies :: Demos ................ SUCCESS [ 14.303 s]
[INFO] Apache Karaf :: Assemblies :: Minimal Distribution . SUCCESS [ 20.347 s]
[INFO] Apache Karaf :: Assemblies :: Default Distribution . SUCCESS [ 23.610 s]
[INFO] Apache Karaf :: Demos .............................. SUCCESS [ 5.592 s]
[INFO] Apache Karaf :: Demos :: Web ....................... SUCCESS [ 26.450 s]
[INFO] Apache Karaf :: Demos :: Branding :: Shell ......... SUCCESS [ 7.757 s]
[INFO] Apache Karaf :: Demos :: Command :: Extend Console . SUCCESS [ 8.333 s]
[INFO] Apache Karaf :: Demos :: Demo Dump provider ........ SUCCESS [ 8.073 s]
[INFO] Apache Karaf :: Demos :: Deployer .................. SUCCESS [ 5.405 s]
[INFO] Apache Karaf :: Demos :: Deployer :: Kar ........... SUCCESS [ 8.666 s]
[INFO] Apache Karaf :: Demos :: Deployer :: Bundle ........ SUCCESS [ 7.680 s]
[INFO] Apache Karaf :: Demos :: Profiles :: Dynamic Assembly SUCCESS [ 34.296 s]
[INFO] Apache Karaf :: Demos :: Profiles :: Static Assembly SUCCESS [02:00 min]
[INFO] Apache Karaf :: Demos :: Profiles .................. SUCCESS [ 5.499 s]
[INFO] Apache Karaf :: Archetypes ......................... SUCCESS [ 5.342 s]
[INFO] Apache Karaf :: Archetypes :: Assembly Archetype ... SUCCESS [ 36.544 s]
[INFO] Apache Karaf :: Archetypes :: Command Archetype .... SUCCESS [ 12.965 s]
[INFO] Apache Karaf :: Archetypes :: Feature Archetype .... SUCCESS [ 11.340 s]
[INFO] Apache Karaf :: Archetypes :: Kar Archetype ........ SUCCESS [ 11.899 s]
[INFO] Apache Karaf :: Archetypes :: Bundle Archetype ..... SUCCESS [ 11.697 s]
[INFO] Apache Karaf :: Archetypes :: Blueprint Archetype .. SUCCESS [ 12.011 s]
[INFO] Apache Karaf :: Integration Tests .................. SUCCESS [12:46 min]
[INFO] ------------------------------------------------------------------------
[INFO] BUILD SUCCESS
[INFO] ------------------------------------------------------------------------
[INFO] Total time: 01:07 h
[INFO] Finished at: 2017-10-12T09:11:58+00:00
[INFO] Final Memory: 259M/5762M
[INFO] ------------------------------------------------------------------------
Waiting for Jenkins to finish collecting data
[JENKINS] Archiving <https://builds.apache.org/job/karaf-master/ws/archetypes/blueprint/pom.xml> to org.apache.karaf.archetypes/karaf-blueprint-archetype/4.2.0-SNAPSHOT/karaf-blueprint-archetype-4.2.0-SNAPSHOT.pom
[JENKINS] Archiving <https://builds.apache.org/job/karaf-master/ws/archetypes/blueprint/target/karaf-blueprint-archetype-4.2.0-SNAPSHOT.jar> to org.apache.karaf.archetypes/karaf-blueprint-archetype/4.2.0-20171012.085416-380/karaf-blueprint-archetype-4.2.0-20171012.085416-380.jar
[Fast Archiver] No artifacts from karaf-master » Apache Karaf :: Archetypes :: Blueprint Archetype #4690 to compare, so performing full copy of artifacts
[JENKINS] Archiving <https://builds.apache.org/job/karaf-master/ws/webconsole/gogo/pom.xml> to org.apache.karaf.webconsole/org.apache.karaf.webconsole.gogo/4.2.0-SNAPSHOT/org.apache.karaf.webconsole.gogo-4.2.0-SNAPSHOT.pom
[JENKINS] Archiving <https://builds.apache.org/job/karaf-master/ws/webconsole/gogo/target/org.apache.karaf.webconsole.gogo-4.2.0-SNAPSHOT.jar> to org.apache.karaf.webconsole/org.apache.karaf.webconsole.gogo/4.2.0-20171012.083256-396/org.apache.karaf.webconsole.gogo-4.2.0-20171012.083256-396.jar
[Fast Archiver] No artifacts from karaf-master » Apache Karaf :: Web Console :: Gogo Plugin #4690 to compare, so performing full copy of artifacts
[JENKINS] Archiving <https://builds.apache.org/job/karaf-master/ws/management/pom.xml> to org.apache.karaf.management/management/4.2.0-SNAPSHOT/management-4.2.0-SNAPSHOT.pom
[Fast Archiver] No artifacts from karaf-master » Apache Karaf :: Management #4690 to compare, so performing full copy of artifacts
[JENKINS] Archiving <https://builds.apache.org/job/karaf-master/ws/jpa/hibernate/pom.xml> to org.apache.karaf.jpa/hibernate/4.2.0-SNAPSHOT/hibernate-4.2.0-SNAPSHOT.pom
[JENKINS] Archiving <https://builds.apache.org/job/karaf-master/ws/jpa/hibernate/target/hibernate-4.2.0-SNAPSHOT.jar> to org.apache.karaf.jpa/hibernate/4.2.0-20171012.083632-396/hibernate-4.2.0-20171012.083632-396.jar
[Fast Archiver] No artifacts from karaf-master » Apache Karaf :: JPA :: Hibernate #4690 to compare, so performing full copy of artifacts
[JENKINS] Archiving <https://builds.apache.org/job/karaf-master/ws/archetypes/pom.xml> to org.apache.karaf/archetypes/4.2.0-SNAPSHOT/archetypes-4.2.0-SNAPSHOT.pom
[Fast Archiver] No artifacts from karaf-master » Apache Karaf :: Archetypes #4690 to compare, so performing full copy of artifacts
[JENKINS] Archiving <https://builds.apache.org/job/karaf-master/ws/demos/profiles/pom.xml> to org.apache.karaf.demos.profiles/profiles/4.2.0-SNAPSHOT/profiles-4.2.0-SNAPSHOT.pom
[Fast Archiver] No artifacts from karaf-master » Apache Karaf :: Demos :: Profiles #4690 to compare, so performing full copy of artifacts
[JENKINS] Archiving <https://builds.apache.org/job/karaf-master/ws/maven/pom.xml> to org.apache.karaf.maven/maven-parent/4.2.0-SNAPSHOT/maven-parent-4.2.0-SNAPSHOT.pom
[Fast Archiver] No artifacts from karaf-master » Apache Karaf :: Maven #4690 to compare, so performing full copy of artifacts
[JENKINS] Archiving <https://builds.apache.org/job/karaf-master/ws/assemblies/features/pom.xml> to org.apache.karaf.assemblies.features/features/4.2.0-SNAPSHOT/features-4.2.0-SNAPSHOT.pom
[Fast Archiver] No artifacts from karaf-master » Apache Karaf :: Assemblies :: Features #4690 to compare, so performing full copy of artifacts
[JENKINS] Archiving <https://builds.apache.org/job/karaf-master/ws/features/core/pom.xml> to org.apache.karaf.features/org.apache.karaf.features.core/4.2.0-SNAPSHOT/org.apache.karaf.features.core-4.2.0-SNAPSHOT.pom
[JENKINS] Archiving <https://builds.apache.org/job/karaf-master/ws/features/core/target/org.apache.karaf.features.core-4.2.0-SNAPSHOT.jar> to org.apache.karaf.features/org.apache.karaf.features.core/4.2.0-20171012.081141-408/org.apache.karaf.features.core-4.2.0-20171012.081141-408.jar
[Fast Archiver] No artifacts from karaf-master » Apache Karaf :: Features :: Core #4690 to compare, so performing full copy of artifacts
[JENKINS] Archiving <https://builds.apache.org/job/karaf-master/ws/demos/profiles/dynamic/pom.xml> to org.apache.karaf.demos.profiles/dynamic/4.2.0-SNAPSHOT/dynamic-4.2.0-SNAPSHOT.pom
[JENKINS] Archiving <https://builds.apache.org/job/karaf-master/ws/demos/profiles/dynamic/target/dynamic-4.2.0-SNAPSHOT.tar.gz> to org.apache.karaf.demos.profiles/dynamic/4.2.0-20171012.084959-382/dynamic-4.2.0-20171012.084959-382.tar.gz
[JENKINS] Archiving <https://builds.apache.org/job/karaf-master/ws/demos/profiles/dynamic/target/dynamic-4.2.0-SNAPSHOT.zip> to org.apache.karaf.demos.profiles/dynamic/4.2.0-20171012.084959-382/dynamic-4.2.0-20171012.084959-382.zip
[Fast Archiver] No artifacts from karaf-master » Apache Karaf :: Demos :: Profiles :: Dynamic Assembly #4690 to compare, so performing full copy of artifacts
Build timed out (after 70 minutes). Marking the build as aborted.
ERROR: Failed to parse POMs
java.io.IOException: java.lang.InterruptedException
at java.lang.Object.wait(Native Method)
at hudson.remoting.FastPipedInputStream.read(FastPipedInputStream.java:175)
Caused: java.io.IOException
at hudson.remoting.FastPipedInputStream.read(FastPipedInputStream.java:177)
at hudson.util.HeadBufferingStream.read(HeadBufferingStream.java:61)
at com.jcraft.jzlib.InflaterInputStream.fill(InflaterInputStream.java:175)
at com.jcraft.jzlib.InflaterInputStream.read(InflaterInputStream.java:106)
at org.apache.commons.compress.archivers.tar.TarArchiveInputStream.read(TarArchiveInputStream.java:614)
at java.io.InputStream.read(InputStream.java:101)
at org.apache.commons.io.IOUtils.copyLarge(IOUtils.java:1792)
at org.apache.commons.io.IOUtils.copyLarge(IOUtils.java:1769)
at org.apache.commons.io.IOUtils.copy(IOUtils.java:1744)
at hudson.util.IOUtils.copy(IOUtils.java:40)
at hudson.FilePath.readFromTar(FilePath.java:2297)
Caused: java.io.IOException: Failed to extract <https://builds.apache.org/job/karaf-master/ws/demos/profiles/dynamic/transfer> of 3 files
at hudson.FilePath.readFromTar(FilePath.java:2307)
at hudson.FilePath.copyRecursiveTo(FilePath.java:2217)
at jenkins.model.StandardArtifactManager.archive(StandardArtifactManager.java:61)
at com.cloudbees.jenkins.plugins.jsync.archiver.JSyncArtifactManager.remoteSync(JSyncArtifactManager.java:128)
at com.cloudbees.jenkins.plugins.jsync.archiver.JSyncArtifactManager.archive(JSyncArtifactManager.java:76)
at hudson.maven.MavenBuild$ProxyImpl.performArchiving(MavenBuild.java:512)
at hudson.maven.MavenModuleSetBuild$MavenModuleSetBuildExecution.doRun(MavenModuleSetBuild.java:881)
at hudson.model.AbstractBuild$AbstractBuildExecution.run(AbstractBuild.java:496)
at hudson.model.Run.execute(Run.java:1737)
at hudson.maven.MavenModuleSetBuild.run(MavenModuleSetBuild.java:543)
at hudson.model.ResourceController.execute(ResourceController.java:97)
at hudson.model.Executor.run(Executor.java:419)
at hudson.FilePath.copyRecursiveTo(FilePath.java:2224)
at jenkins.model.StandardArtifactManager.archive(StandardArtifactManager.java:61)
at com.cloudbees.jenkins.plugins.jsync.archiver.JSyncArtifactManager.remoteSync(JSyncArtifactManager.java:128)
at com.cloudbees.jenkins.plugins.jsync.archiver.JSyncArtifactManager.archive(JSyncArtifactManager.java:76)
at hudson.maven.MavenBuild$ProxyImpl.performArchiving(MavenBuild.java:512)
at hudson.maven.MavenModuleSetBuild$MavenModuleSetBuildExecution.doRun(MavenModuleSetBuild.java:881)
at hudson.model.AbstractBuild$AbstractBuildExecution.run(AbstractBuild.java:496)
at hudson.model.Run.execute(Run.java:1737)
at hudson.maven.MavenModuleSetBuild.run(MavenModuleSetBuild.java:543)
at hudson.model.ResourceController.execute(ResourceController.java:97)
at hudson.model.Executor.run(Executor.java:419)
Caused by: java.util.concurrent.ExecutionException: java.io.IOException: This archives contains unclosed entries.
at hudson.remoting.Channel$2.adapt(Channel.java:871)
at hudson.remoting.Channel$2.adapt(Channel.java:866)
at hudson.remoting.FutureAdapter.get(FutureAdapter.java:59)
at hudson.FilePath.copyRecursiveTo(FilePath.java:2220)
... 10 more
Caused by: java.io.IOException: This archives contains unclosed entries.
at org.apache.commons.compress.archivers.tar.TarArchiveOutputStream.finish(TarArchiveOutputStream.java:225)
at org.apache.commons.compress.archivers.tar.TarArchiveOutputStream.close(TarArchiveOutputStream.java:241)
at hudson.util.io.TarArchiver.close(TarArchiver.java:124)
at hudson.FilePath.writeToTar(FilePath.java:2271)
at hudson.FilePath.access$2100(FilePath.java:197)
at hudson.FilePath$45.invoke(FilePath.java:2212)
at hudson.FilePath$45.invoke(FilePath.java:2208)
at hudson.FilePath$FileCallableWrapper.call(FilePath.java:2750)
at hudson.remoting.UserRequest.perform(UserRequest.java:181)
at hudson.remoting.UserRequest.perform(UserRequest.java:52)
at hudson.remoting.Request$2.run(Request.java:336)
at hudson.remoting.InterceptingExecutorService$1.call(InterceptingExecutorService.java:68)
at java.util.concurrent.FutureTask.run(FutureTask.java:266)
at java.util.concurrent.ThreadPoolExecutor.runWorker(ThreadPoolExecutor.java:1142)
at java.util.concurrent.ThreadPoolExecutor$Worker.run(ThreadPoolExecutor.java:617)
at java.lang.Thread.run(Thread.java:748)
at ......remote call to ubuntu-6(Native Method)
at hudson.remoting.Channel.attachCallSiteStackTrace(Channel.java:1554)
at hudson.remoting.UserResponse.retrieve(UserRequest.java:281)
at hudson.remoting.Channel$2.adapt(Channel.java:869)
... 13 more
channel stopped