You are viewing a plain text version of this content. The canonical link for it is here.
Posted to notifications@maven.apache.org by Apache Jenkins Server <je...@builds.apache.org> on 2021/08/05 23:39:24 UTC
Build failed in Jenkins: Maven » Maven TLP » maven-javadoc-plugin » jetty-upgrade #9
See https://ci-maven.apache.org/job/Maven/job/maven-box/job/maven-javadoc-plugin/job/jetty-upgrade/9/
Changes:
* do not work on ASF nodes so force to localhost
All tests passed
Build log:
[...truncated 6473 lines...]
[INFO] run post-build script verify.groovy
[INFO] MJAVADOC-320/pom.xml ............................. SUCCESS (14.0 s)
[INFO] Building: MJAVADOC-498_aggr_modulepath/pom.xml
[INFO] run post-build script verify.groovy
[INFO] MJAVADOC-639_requires_ignored\pom.xml ............ SUCCESS (16.9 s)
[INFO] Building: MJAVADOC-661_mrjar\pom.xml
[INFO] run post-build script verify.bsh
[INFO] MJAVADOC-194/pom.xml ............................. SUCCESS (5.7 s)
[INFO] Building: MJAVADOC-497/pom.xml
[INFO] run post-build script verify.bsh
[INFO] MJAVADOC-497/pom.xml ............................. SUCCESS (5.1 s)
[INFO] Building: MJAVADOC-172/pom.xml
[withMaven] Publishers: Generated Artifacts Publisher: 76 ms, Junit Publisher: 128 ms, Open Task Scanner Publisher: 1 ms, Invoker Publisher: 24029 ms
[Pipeline] // withMaven
[Pipeline] cleanWs
[WS-CLEANUP] Deleting project workspace...
[WS-CLEANUP] Deferred wipeout is used...
[WS-CLEANUP] done
[Pipeline] }
[Pipeline] // stage
[Pipeline] }
[Pipeline] // ws
[Pipeline] }
[Pipeline] // node
[Pipeline] }
[INFO] run post-build script verify.groovy
[INFO] MJAVADOC-661_mrjar\pom.xml ....................... SUCCESS (9.5 s)
[INFO] Building: MJAVADOC-672_multiline-tag\pom.xml
[INFO] run post-build script verify.bsh
[INFO] MJAVADOC-172/pom.xml ............................. SUCCESS (8.7 s)
[INFO] Building: MJAVADOC-625_addstylesheet/pom.xml
[INFO] MJAVADOC-672_multiline-tag\pom.xml ............... SUCCESS (7.2 s)
[INFO] Building: site-failOnError\pom.xml
[INFO] run post-build script verify.groovy
[INFO] MJAVADOC-625_addstylesheet/pom.xml ............... SUCCESS (4.8 s)
[INFO] Building: MJAVADOC-369/pom.xml
[INFO] MJAVADOC-498_aggr_modulepath/pom.xml ............. SUCCESS (24.9 s)
[INFO] Building: examples/exclude-package-names/pom.xml
[INFO] examples/exclude-package-names/pom.xml ........... SKIPPED due to JRE version
[INFO] Building: examples/alternate-doclet/pom.xml
[INFO] examples/alternate-doclet/pom.xml ................ SKIPPED due to JRE version
[INFO] Building: MJAVADOC-599/pom.xml
[INFO] site-failOnError\pom.xml ......................... SUCCESS (8.5 s)
[INFO]
[INFO] --- mrm-maven-plugin:1.2.0:stop (repository) @ maven-javadoc-plugin ---
[INFO] Stopping Mock Repository Manager on http://localhost:57883
[INFO] Stopped SocketConnector@0.0.0.0:57883
[INFO] Mock Repository Manager http://localhost:57883 is stopped.
[INFO]
[INFO] --- mrm-maven-plugin:1.2.0:stop (3rdparty) @ maven-javadoc-plugin ---
[INFO] Stopping Mock Repository Manager on http://localhost:57884
[INFO] Stopped SocketConnector@0.0.0.0:57884
[INFO] Mock Repository Manager http://localhost:57884 is stopped.
[INFO]
[INFO] --- maven-checkstyle-plugin:3.0.0:check (checkstyle-check) @ maven-javadoc-plugin ---
[INFO] run post-build script verify.bsh
[INFO] MJAVADOC-369/pom.xml ............................. SUCCESS (8.0 s)
[INFO] Building: MJAVADOC-526_aggr-managedDeps/pom.xml
[INFO] There are 4 errors reported by Checkstyle 6.18 with config/maven_checks.xml ruleset.
[INFO] Ignored 4 errors, 0 violation remaining.
[INFO]
[INFO] --- maven-invoker-plugin:3.2.1:verify (integration-test) @ maven-javadoc-plugin ---
[INFO] -------------------------------------------------
[INFO] Build Summary:
[INFO] Passed: 75, Failed: 0, Errors: 0, Skipped: 7
[INFO] -------------------------------------------------
[INFO] ------------------------------------------------------------------------
[INFO] BUILD SUCCESS
[INFO] ------------------------------------------------------------------------
[INFO] Total time: 17:01 min
[INFO] Finished at: 2021-08-05T16:36:18-07:00
[INFO] ------------------------------------------------------------------------
[INFO] [jenkins-event-spy] Generated F:\jenkins\jenkins-slave\82467a7c\workspace\ven-javadoc-plugin_jetty-upgrade@2@tmp\withMaven8c92b67e\maven-spy-20210805-161917-616704924210032027499.log
[Pipeline] }
[Pipeline] // dir
[Pipeline] }
[withMaven] artifactsPublisher - Archive artifact windows-jdk11-m3.6.x_build\pom.xml under org\apache\maven\plugins\maven-javadoc-plugin\3.3.1-SNAPSHOT\maven-javadoc-plugin-3.3.1-SNAPSHOT.pom
[withMaven] artifactsPublisher - Archive artifact windows-jdk11-m3.6.x_build\target\maven-javadoc-plugin-3.3.1-SNAPSHOT.jar under org\apache\maven\plugins\maven-javadoc-plugin\3.3.1-SNAPSHOT\maven-javadoc-plugin-3.3.1-SNAPSHOT.jar
[Fast Archiver] No prior successful build to compare, so performing full copy of artifacts
[INFO] MJAVADOC-526_aggr-managedDeps/pom.xml ............ SUCCESS (5.4 s)
[INFO] Building: MJAVADOC-555_link-automatic-modules/pom.xml
[INFO] run post-build script verify.groovy
[INFO] MJAVADOC-599/pom.xml ............................. SUCCESS (11.4 s)
[INFO] Building: MJAVADOC-528/pom.xml
[withMaven] junitPublisher - Archive test results for Maven artifact org.apache.maven.plugins:maven-javadoc-plugin:maven-plugin:3.3.1-SNAPSHOT generated by maven-surefire-plugin:test (default-test): windows-jdk11-m3.6.x_build\target\surefire-reports\*.xml
Recording test results
[INFO] run post-build script verify.groovy
[INFO] MJAVADOC-555_link-automatic-modules/pom.xml ...... SUCCESS (7.2 s)
[INFO] Building: MJAVADOC-250/pom.xml
[withMaven] Jenkins Task Scanner Plugin not found, don't display results of source code scanning for 'TODO' and 'FIXME' in pipeline screen.
[withMaven] invokerPublisher - Archive invoker results for Maven artifact MavenArtifact{org.apache.maven.plugins:maven-javadoc-plugin:maven-plugin:3.3.1-SNAPSHOT(version: 3.3.1-SNAPSHOT, snapshot:false) } generated by PluginInvocation{org.apache.maven.plugins:maven-invoker-plugin:3.2.1@integration-test integration-test}: windows-jdk11-m3.6.x_build\target\invoker-reports\*.xml
[INFO] run post-build script verify.groovy
[INFO] MJAVADOC-528/pom.xml ............................. SUCCESS (11.4 s)
[INFO] Building: MJAVADOC-592_detectApiLink/pom.xml
[INFO] run post-build script verify.bsh
[INFO] MJAVADOC-250/pom.xml ............................. SUCCESS (6.6 s)
[INFO]
[INFO] --- mrm-maven-plugin:1.2.0:stop (repository) @ maven-javadoc-plugin ---
[INFO] Stopping Mock Repository Manager on http://localhost:43353
[INFO] Stopped SocketConnector@0.0.0.0:43353
[INFO] Mock Repository Manager http://localhost:43353 is stopped.
[INFO]
[INFO] --- mrm-maven-plugin:1.2.0:stop (3rdparty) @ maven-javadoc-plugin ---
[INFO] Stopping Mock Repository Manager on http://localhost:34043
[INFO] Stopped SocketConnector@0.0.0.0:34043
[INFO] Mock Repository Manager http://localhost:34043 is stopped.
[INFO]
[INFO] --- maven-checkstyle-plugin:3.0.0:check (checkstyle-check) @ maven-javadoc-plugin ---
[INFO] There are 4 errors reported by Checkstyle 6.18 with config/maven_checks.xml ruleset.
[INFO] Ignored 4 errors, 0 violation remaining.
[INFO]
[INFO] --- maven-invoker-plugin:3.2.1:verify (integration-test) @ maven-javadoc-plugin ---
[INFO] -------------------------------------------------
[INFO] Build Summary:
[INFO] Passed: 76, Failed: 0, Errors: 0, Skipped: 6
[INFO] -------------------------------------------------
[INFO] ------------------------------------------------------------------------
[INFO] BUILD SUCCESS
[INFO] ------------------------------------------------------------------------
[INFO] Total time: 16:48 min
[INFO] Finished at: 2021-08-05T23:36:40Z
[INFO] ------------------------------------------------------------------------
[INFO] [jenkins-event-spy] Generated /home/jenkins/jenkins-home/workspace/ven-javadoc-plugin_jetty-upgrade@2@tmp/withMavenddacfd28/maven-spy-20210805-231951-798478962060781822039.log
[Pipeline] }
[Pipeline] // dir
[Pipeline] }
[withMaven] artifactsPublisher - Archive artifact linux-jdk16-m3.6.x_build/pom.xml under org/apache/maven/plugins/maven-javadoc-plugin/3.3.1-SNAPSHOT/maven-javadoc-plugin-3.3.1-SNAPSHOT.pom
[withMaven] artifactsPublisher - Archive artifact linux-jdk16-m3.6.x_build/target/maven-javadoc-plugin-3.3.1-SNAPSHOT.jar under org/apache/maven/plugins/maven-javadoc-plugin/3.3.1-SNAPSHOT/maven-javadoc-plugin-3.3.1-SNAPSHOT.jar
[Fast Archiver] No prior successful build to compare, so performing full copy of artifacts
[withMaven] junitPublisher - Archive test results for Maven artifact org.apache.maven.plugins:maven-javadoc-plugin:maven-plugin:3.3.1-SNAPSHOT generated by maven-surefire-plugin:test (default-test): linux-jdk16-m3.6.x_build/target/surefire-reports/*.xml
Recording test results
[withMaven] Jenkins Task Scanner Plugin not found, don't display results of source code scanning for 'TODO' and 'FIXME' in pipeline screen.
[withMaven] invokerPublisher - Archive invoker results for Maven artifact MavenArtifact{org.apache.maven.plugins:maven-javadoc-plugin:maven-plugin:3.3.1-SNAPSHOT(version: 3.3.1-SNAPSHOT, snapshot:false) } generated by PluginInvocation{org.apache.maven.plugins:maven-invoker-plugin:3.2.1@integration-test integration-test}: linux-jdk16-m3.6.x_build/target/invoker-reports/*.xml
[INFO] run post-build script verify.groovy
[INFO] MJAVADOC-592_detectApiLink/pom.xml ............... SUCCESS (9.3 s)
[INFO] Building: MJAVADOC-514_3rdparty-doclettags/pom.xml
[INFO] MJAVADOC-514_3rdparty-doclettags/pom.xml ......... SUCCESS (8.2 s)
[INFO] Building: MJAVADOC-338_downloadSources/pom.xml
[withMaven] Publishers: Generated Artifacts Publisher: 66 ms, Junit Publisher: 129 ms, Open Task Scanner Publisher: 1 ms, Invoker Publisher: 22097 ms
[Pipeline] // withMaven
[Pipeline] cleanWs
[WS-CLEANUP] Deleting project workspace...
[WS-CLEANUP] Deferred wipeout is used...
[WS-CLEANUP] done
[Pipeline] }
[Pipeline] // stage
[Pipeline] }
[Pipeline] // ws
[Pipeline] }
[Pipeline] // node
[Pipeline] }
[INFO] run post-build script verify.groovy
[INFO] MJAVADOC-338_downloadSources/pom.xml ............. SUCCESS (16.3 s)
[INFO] Building: MJAVADOC-194/pom.xml
[INFO] run post-build script verify.bsh
[INFO] MJAVADOC-194/pom.xml ............................. SUCCESS (11.2 s)
[INFO] Building: MJAVADOC-497/pom.xml
[INFO] run post-build script verify.bsh
[INFO] MJAVADOC-497/pom.xml ............................. SUCCESS (11.7 s)
[INFO] Building: MJAVADOC-172/pom.xml
[INFO] run post-build script verify.bsh
[INFO] MJAVADOC-172/pom.xml ............................. SUCCESS (17.3 s)
[INFO] Building: MJAVADOC-625_addstylesheet/pom.xml
[INFO] run post-build script verify.groovy
[INFO] MJAVADOC-625_addstylesheet/pom.xml ............... SUCCESS (10.4 s)
[INFO] Building: MJAVADOC-369/pom.xml
[INFO] run post-build script verify.bsh
[INFO] MJAVADOC-369/pom.xml ............................. SUCCESS (17.7 s)
[INFO] Building: MJAVADOC-526_aggr-managedDeps/pom.xml
[INFO] MJAVADOC-526_aggr-managedDeps/pom.xml ............ SUCCESS (11.6 s)
[INFO] Building: MJAVADOC-555_link-automatic-modules/pom.xml
[INFO] MJAVADOC-555_link-automatic-modules/pom.xml ...... SKIPPED due to non-matching selectors
[INFO] Building: MJAVADOC-250/pom.xml
[INFO] run post-build script verify.bsh
[INFO] MJAVADOC-250/pom.xml ............................. SUCCESS (12.6 s)
[INFO]
[INFO] --- mrm-maven-plugin:1.2.0:stop (repository) @ maven-javadoc-plugin ---
[INFO] Stopping Mock Repository Manager on http://localhost:40993
[INFO] Stopped SocketConnector@0.0.0.0:40993
[INFO] Mock Repository Manager http://localhost:40993 is stopped.
[INFO]
[INFO] --- mrm-maven-plugin:1.2.0:stop (3rdparty) @ maven-javadoc-plugin ---
[INFO] Stopping Mock Repository Manager on http://localhost:39059
[INFO] Stopped SocketConnector@0.0.0.0:39059
[INFO] Mock Repository Manager http://localhost:39059 is stopped.
[INFO]
[INFO] --- maven-checkstyle-plugin:3.0.0:check (checkstyle-check) @ maven-javadoc-plugin ---
[INFO] There are 4 errors reported by Checkstyle 6.18 with config/maven_checks.xml ruleset.
[INFO] Ignored 4 errors, 0 violation remaining.
[INFO]
[INFO] --- maven-invoker-plugin:3.2.1:verify (integration-test) @ maven-javadoc-plugin ---
[INFO] -------------------------------------------------
[INFO] Build Summary:
[INFO] Passed: 74, Failed: 0, Errors: 0, Skipped: 8
[INFO] -------------------------------------------------
[INFO] ------------------------------------------------------------------------
[INFO] BUILD SUCCESS
[INFO] ------------------------------------------------------------------------
[INFO] Total time: 20:54 min
[INFO] Finished at: 2021-08-05T23:38:45Z
[INFO] ------------------------------------------------------------------------
[INFO] [jenkins-event-spy] Generated /home/jenkins/jenkins-home/workspace/ven-javadoc-plugin_jetty-upgrade@3@tmp/withMaven3609470c/maven-spy-20210805-231750-3436574461742219974691.log
[Pipeline] }
[Pipeline] // dir
[Pipeline] }
[withMaven] artifactsPublisher - Archive artifact linux-jdk11-m3.6.x_build/pom.xml under org/apache/maven/plugins/maven-javadoc-plugin/3.3.1-SNAPSHOT/maven-javadoc-plugin-3.3.1-SNAPSHOT.pom
[withMaven] artifactsPublisher - Archive artifact linux-jdk11-m3.6.x_build/target/maven-javadoc-plugin-3.3.1-SNAPSHOT.jar under org/apache/maven/plugins/maven-javadoc-plugin/3.3.1-SNAPSHOT/maven-javadoc-plugin-3.3.1-SNAPSHOT.jar
[Fast Archiver] No prior successful build to compare, so performing full copy of artifacts
[withMaven] junitPublisher - Archive test results for Maven artifact org.apache.maven.plugins:maven-javadoc-plugin:maven-plugin:3.3.1-SNAPSHOT generated by maven-surefire-plugin:test (default-test): linux-jdk11-m3.6.x_build/target/surefire-reports/*.xml
Recording test results
[withMaven] Jenkins Task Scanner Plugin not found, don't display results of source code scanning for 'TODO' and 'FIXME' in pipeline screen.
[withMaven] invokerPublisher - Archive invoker results for Maven artifact MavenArtifact{org.apache.maven.plugins:maven-javadoc-plugin:maven-plugin:3.3.1-SNAPSHOT(version: 3.3.1-SNAPSHOT, snapshot:false) } generated by PluginInvocation{org.apache.maven.plugins:maven-invoker-plugin:3.2.1@integration-test integration-test}: linux-jdk11-m3.6.x_build/target/invoker-reports/*.xml
[withMaven] Publishers: Generated Artifacts Publisher: 2628 ms, Junit Publisher: 8599 ms, Open Task Scanner Publisher: 12 ms, Invoker Publisher: 132444 ms
[Pipeline] // withMaven
[Pipeline] cleanWs
[WS-CLEANUP] Deleting project workspace...
[WS-CLEANUP] Deferred wipeout is used...
[WS-CLEANUP] done
[Pipeline] }
[Pipeline] // stage
[Pipeline] }
[Pipeline] // ws
[Pipeline] }
[Pipeline] // node
[Pipeline] }
[withMaven] Publishers: Generated Artifacts Publisher: 108 ms, Junit Publisher: 150 ms, Open Task Scanner Publisher: 1 ms, Invoker Publisher: 37822 ms
[Pipeline] // withMaven
[Pipeline] cleanWs
[WS-CLEANUP] Deleting project workspace...
[WS-CLEANUP] Deferred wipeout is used...
[WS-CLEANUP] done
[Pipeline] }
[Pipeline] // stage
[Pipeline] }
[Pipeline] // ws
[Pipeline] }
[Pipeline] // node
[Pipeline] }
[Pipeline] // parallel
[Pipeline] stage
[Pipeline] { (Notifications)
[Pipeline] echo
Build result: FAILURE
[Pipeline] jiraIssueSelector
[Pipeline] echo
The authors of changes [olamy].
[Pipeline] echo
Sending email ...
[Pipeline] emailext
Build failed in Jenkins: Maven » Maven TLP » maven-javadoc-plugin » jetty-upgrade #13
Posted by Apache Jenkins Server <je...@builds.apache.org>.
See https://ci-maven.apache.org/job/Maven/job/maven-box/job/maven-javadoc-plugin/job/jetty-upgrade/13/
Changes:
* some cleanup
2 tests failed.
FAILED: org.apache.maven.plugins.javadoc.JavadocReportTest.windows-jdk8-m3.2.x_build / Build windows-jdk8-m3.2.x_build / testProxy
Error Message:
Expecting:
" cmd.exe /X /C "f:\jenkins\tools\java\latest1.8\jre\..\bin\javadoc.exe -J-Dhttp.proxyHost=127.0.0.1 -J-Dhttp.proxyPort=80 -J-Dhttps.proxyHost=127.0.0.1 -J-Dhttps.proxyPort=80 -J-Dhttp.nonProxyHosts="www.google.com^|*.somewhere.com" @options @packages @argfile""
to contain:
"-J-Dhttp.nonProxyHosts=\"www.google.com^|*.somewhere.com\""
Stack Trace:
java.lang.AssertionError:
Expecting:
" cmd.exe /X /C "f:\jenkins\tools\java\latest1.8\jre\..\bin\javadoc.exe -J-Dhttp.proxyHost=127.0.0.1 -J-Dhttp.proxyPort=80 -J-Dhttps.proxyHost=127.0.0.1 -J-Dhttps.proxyPort=80 -J-Dhttp.nonProxyHosts="www.google.com^|*.somewhere.com" @options @packages @argfile""
to contain:
"-J-Dhttp.nonProxyHosts=\"www.google.com^|*.somewhere.com\""
at org.apache.maven.plugins.javadoc.JavadocReportTest.testProxy(JavadocReportTest.java:995)
at sun.reflect.NativeMethodAccessorImpl.invoke0(Native Method)
at sun.reflect.NativeMethodAccessorImpl.invoke(NativeMethodAccessorImpl.java:62)
at sun.reflect.DelegatingMethodAccessorImpl.invoke(DelegatingMethodAccessorImpl.java:43)
at java.lang.reflect.Method.invoke(Method.java:498)
at junit.framework.TestCase.runTest(TestCase.java:177)
at junit.framework.TestCase.runBare(TestCase.java:142)
at junit.framework.TestResult$1.protect(TestResult.java:122)
at junit.framework.TestResult.runProtected(TestResult.java:142)
at junit.framework.TestResult.run(TestResult.java:125)
at junit.framework.TestCase.run(TestCase.java:130)
at junit.framework.TestSuite.runTest(TestSuite.java:241)
at junit.framework.TestSuite.run(TestSuite.java:236)
at org.junit.internal.runners.JUnit38ClassRunner.run(JUnit38ClassRunner.java:90)
at org.apache.maven.surefire.junit4.JUnit4Provider.execute(JUnit4Provider.java:365)
at org.apache.maven.surefire.junit4.JUnit4Provider.executeWithRerun(JUnit4Provider.java:273)
at org.apache.maven.surefire.junit4.JUnit4Provider.executeTestSet(JUnit4Provider.java:238)
at org.apache.maven.surefire.junit4.JUnit4Provider.invoke(JUnit4Provider.java:159)
at org.apache.maven.surefire.booter.ForkedBooter.invokeProviderInSameClassLoader(ForkedBooter.java:383)
at org.apache.maven.surefire.booter.ForkedBooter.runSuitesInProcess(ForkedBooter.java:344)
at org.apache.maven.surefire.booter.ForkedBooter.execute(ForkedBooter.java:125)
at org.apache.maven.surefire.booter.ForkedBooter.main(ForkedBooter.java:417)
FAILED: org.apache.maven.plugins.javadoc.JavadocReportTest.windows-jdk8-m3.6.x_build / Build windows-jdk8-m3.6.x_build / testProxy
Error Message:
Expecting:
" cmd.exe /X /C "f:\jenkins\tools\java\latest1.8\jre\..\bin\javadoc.exe -J-Dhttp.proxyHost=127.0.0.1 -J-Dhttp.proxyPort=80 -J-Dhttps.proxyHost=127.0.0.1 -J-Dhttps.proxyPort=80 -J-Dhttp.nonProxyHosts="www.google.com^|*.somewhere.com" @options @packages @argfile""
to contain:
"-J-Dhttp.nonProxyHosts=\"www.google.com^|*.somewhere.com\""
Stack Trace:
java.lang.AssertionError:
Expecting:
" cmd.exe /X /C "f:\jenkins\tools\java\latest1.8\jre\..\bin\javadoc.exe -J-Dhttp.proxyHost=127.0.0.1 -J-Dhttp.proxyPort=80 -J-Dhttps.proxyHost=127.0.0.1 -J-Dhttps.proxyPort=80 -J-Dhttp.nonProxyHosts="www.google.com^|*.somewhere.com" @options @packages @argfile""
to contain:
"-J-Dhttp.nonProxyHosts=\"www.google.com^|*.somewhere.com\""
at org.apache.maven.plugins.javadoc.JavadocReportTest.testProxy(JavadocReportTest.java:995)
at sun.reflect.NativeMethodAccessorImpl.invoke0(Native Method)
at sun.reflect.NativeMethodAccessorImpl.invoke(NativeMethodAccessorImpl.java:62)
at sun.reflect.DelegatingMethodAccessorImpl.invoke(DelegatingMethodAccessorImpl.java:43)
at java.lang.reflect.Method.invoke(Method.java:498)
at junit.framework.TestCase.runTest(TestCase.java:177)
at junit.framework.TestCase.runBare(TestCase.java:142)
at junit.framework.TestResult$1.protect(TestResult.java:122)
at junit.framework.TestResult.runProtected(TestResult.java:142)
at junit.framework.TestResult.run(TestResult.java:125)
at junit.framework.TestCase.run(TestCase.java:130)
at junit.framework.TestSuite.runTest(TestSuite.java:241)
at junit.framework.TestSuite.run(TestSuite.java:236)
at org.junit.internal.runners.JUnit38ClassRunner.run(JUnit38ClassRunner.java:90)
at org.apache.maven.surefire.junit4.JUnit4Provider.execute(JUnit4Provider.java:365)
at org.apache.maven.surefire.junit4.JUnit4Provider.executeWithRerun(JUnit4Provider.java:273)
at org.apache.maven.surefire.junit4.JUnit4Provider.executeTestSet(JUnit4Provider.java:238)
at org.apache.maven.surefire.junit4.JUnit4Provider.invoke(JUnit4Provider.java:159)
at org.apache.maven.surefire.booter.ForkedBooter.invokeProviderInSameClassLoader(ForkedBooter.java:383)
at org.apache.maven.surefire.booter.ForkedBooter.runSuitesInProcess(ForkedBooter.java:344)
at org.apache.maven.surefire.booter.ForkedBooter.execute(ForkedBooter.java:125)
at org.apache.maven.surefire.booter.ForkedBooter.main(ForkedBooter.java:417)
Build log:
[...truncated 6692 lines...]
[INFO] Building: MJAVADOC-498_mm_modulepath/pom.xml
[INFO] MJAVADOC-556_hide-non-exported-packages/pom.xml .. SUCCESS (5.7 s)
[INFO] Building: MJAVADOC-568_export-to-testcase/pom.xml
[INFO] MJAVADOC-498_mm_modulepath/pom.xml ............... SUCCESS (8.5 s)
[INFO] Building: MJAVADOC-449_aggr_modulepath/pom.xml
[withMaven] Publishers: Generated Artifacts Publisher: 137 ms, Junit Publisher: 241 ms, Open Task Scanner Publisher: 1 ms, Invoker Publisher: 31694 ms
[Pipeline] // withMaven
[Pipeline] cleanWs
[WS-CLEANUP] Deleting project workspace...
[WS-CLEANUP] Deferred wipeout is used...
[WS-CLEANUP] done
[Pipeline] }
[Pipeline] // stage
[Pipeline] }
[Pipeline] // ws
[Pipeline] }
[Pipeline] // node
[Pipeline] }
[INFO] MJAVADOC-568_export-to-testcase/pom.xml .......... SUCCESS (9.9 s)
[INFO] Building: MJAVADOC-427/pom.xml
[INFO] run post-build script verify.groovy
[INFO] MJAVADOC-449_aggr_modulepath/pom.xml ............. SUCCESS (6.8 s)
[INFO] Building: MJAVADOC-556_hide-non-exported-packages/pom.xml
[INFO] run post-build script verify.groovy
[INFO] MJAVADOC-427/pom.xml ............................. SUCCESS (5.6 s)
[INFO] Building: MJAVADOC-320/pom.xml
[INFO] MJAVADOC-556_hide-non-exported-packages/pom.xml .. SUCCESS (6.1 s)
[INFO] Building: MJAVADOC-568_export-to-testcase/pom.xml
[INFO] artifact org.apache.geronimo.specs.geronimo-el_2.2_spec:1.0.1: checking for updates from central
[withMaven] Publishers: Generated Artifacts Publisher: 99 ms, Junit Publisher: 221 ms, Open Task Scanner Publisher: 1 ms, Invoker Publisher: 33522 ms
[Pipeline] // withMaven
[Pipeline] cleanWs
[WS-CLEANUP] Deleting project workspace...
[WS-CLEANUP] Deferred wipeout is used...
[WS-CLEANUP] done
[Pipeline] }
[Pipeline] // stage
[Pipeline] }
[Pipeline] // ws
[Pipeline] }
[Pipeline] // node
[Pipeline] }
[INFO] run post-build script verify.groovy
[INFO] MJAVADOC-320/pom.xml ............................. SUCCESS (7.2 s)
[INFO] Building: MJAVADOC-498_aggr_modulepath/pom.xml
[INFO] MJAVADOC-568_export-to-testcase/pom.xml .......... SUCCESS (10.2 s)
[INFO] Building: MJAVADOC-427/pom.xml
[INFO] run post-build script verify.groovy
[INFO] MJAVADOC-427/pom.xml ............................. SUCCESS (5.5 s)
[INFO] Building: MJAVADOC-320/pom.xml
[INFO] MJAVADOC-498_aggr_modulepath/pom.xml ............. SUCCESS (12.3 s)
[INFO] Building: examples/exclude-package-names/pom.xml
[INFO] examples/exclude-package-names/pom.xml ........... SKIPPED due to JRE version
[INFO] Building: examples/alternate-doclet/pom.xml
[INFO] examples/alternate-doclet/pom.xml ................ SKIPPED due to JRE version
[INFO] Building: MJAVADOC-599/pom.xml
[INFO] run post-build script verify.groovy
[INFO] MJAVADOC-599/pom.xml ............................. SUCCESS (5.4 s)
[INFO] Building: MJAVADOC-528/pom.xml
[INFO] run post-build script verify.groovy
[INFO] MJAVADOC-320/pom.xml ............................. SUCCESS (7.9 s)
[INFO] Building: MJAVADOC-498_aggr_modulepath/pom.xml
[INFO] run post-build script verify.groovy
[INFO] MJAVADOC-528/pom.xml ............................. SUCCESS (5.0 s)
[INFO] Building: MJAVADOC-592_detectApiLink/pom.xml
[INFO] run post-build script verify.groovy
[INFO] MJAVADOC-592_detectApiLink/pom.xml ............... SUCCESS (4.1 s)
[INFO] Building: MJAVADOC-514_3rdparty-doclettags/pom.xml
[INFO] MJAVADOC-514_3rdparty-doclettags/pom.xml ......... SKIPPED due to JRE version
[INFO] Building: MJAVADOC-338_downloadSources/pom.xml
[INFO] artifact org.apache.maven.plugins.javadoc.its.mjavadoc338-direct:1.0: checking for updates from central
[INFO] MJAVADOC-498_aggr_modulepath/pom.xml ............. SUCCESS (12.0 s)
[INFO] Building: examples/exclude-package-names/pom.xml
[INFO] examples/exclude-package-names/pom.xml ........... SKIPPED due to JRE version
[INFO] Building: examples/alternate-doclet/pom.xml
[INFO] examples/alternate-doclet/pom.xml ................ SKIPPED due to JRE version
[INFO] Building: MJAVADOC-599/pom.xml
[INFO] run post-build script verify.groovy
[INFO] MJAVADOC-338_downloadSources/pom.xml ............. SUCCESS (7.6 s)
[INFO] Building: MJAVADOC-194/pom.xml
[INFO] run post-build script verify.groovy
[INFO] MJAVADOC-599/pom.xml ............................. SUCCESS (5.8 s)
[INFO] Building: MJAVADOC-528/pom.xml
[INFO] run post-build script verify.groovy
[INFO] MJAVADOC-528/pom.xml ............................. SUCCESS (4.9 s)
[INFO] Building: MJAVADOC-592_detectApiLink/pom.xml
[INFO] run post-build script verify.bsh
[INFO] MJAVADOC-194/pom.xml ............................. SUCCESS (5.5 s)
[INFO] Building: MJAVADOC-497/pom.xml
[INFO] run post-build script verify.groovy
[INFO] MJAVADOC-592_detectApiLink/pom.xml ............... SUCCESS (4.2 s)
[INFO] Building: MJAVADOC-514_3rdparty-doclettags/pom.xml
[INFO] MJAVADOC-514_3rdparty-doclettags/pom.xml ......... SKIPPED due to JRE version
[INFO] Building: MJAVADOC-338_downloadSources/pom.xml
[INFO] run post-build script verify.bsh
[INFO] MJAVADOC-497/pom.xml ............................. SUCCESS (4.7 s)
[INFO] Building: MJAVADOC-172/pom.xml
[INFO] run post-build script verify.bsh
[INFO] MJAVADOC-172/pom.xml ............................. SUCCESS (8.2 s)
[INFO] Building: MJAVADOC-625_addstylesheet/pom.xml
[INFO] run post-build script verify.groovy
[INFO] MJAVADOC-338_downloadSources/pom.xml ............. SUCCESS (7.6 s)
[INFO] Building: MJAVADOC-194/pom.xml
[INFO] run post-build script verify.groovy
[INFO] MJAVADOC-625_addstylesheet/pom.xml ............... SUCCESS (4.6 s)
[INFO] Building: MJAVADOC-369/pom.xml
[INFO] run post-build script verify.bsh
[INFO] MJAVADOC-194/pom.xml ............................. SUCCESS (5.8 s)
[INFO] Building: MJAVADOC-497/pom.xml
[INFO] run post-build script verify.bsh
[INFO] MJAVADOC-497/pom.xml ............................. SUCCESS (5.3 s)
[INFO] Building: MJAVADOC-172/pom.xml
[INFO] run post-build script verify.bsh
[INFO] MJAVADOC-369/pom.xml ............................. SUCCESS (7.9 s)
[INFO] Building: MJAVADOC-526_aggr-managedDeps/pom.xml
[INFO] MJAVADOC-526_aggr-managedDeps/pom.xml ............ SUCCESS (5.9 s)
[INFO] Building: MJAVADOC-555_link-automatic-modules/pom.xml
[INFO] run post-build script verify.bsh
[INFO] MJAVADOC-172/pom.xml ............................. SUCCESS (8.9 s)
[INFO] Building: MJAVADOC-625_addstylesheet/pom.xml
[INFO] run post-build script verify.groovy
[INFO] MJAVADOC-625_addstylesheet/pom.xml ............... SUCCESS (4.8 s)
[INFO] Building: MJAVADOC-369/pom.xml
[INFO] run post-build script verify.groovy
[INFO] MJAVADOC-555_link-automatic-modules/pom.xml ...... SUCCESS (6.8 s)
[INFO] Building: MJAVADOC-250/pom.xml
[INFO] run post-build script verify.bsh
[INFO] MJAVADOC-250/pom.xml ............................. SUCCESS (6.3 s)
[INFO]
[INFO] --- mrm-maven-plugin:1.2.0:stop (repository) @ maven-javadoc-plugin ---
[INFO] Stopping Mock Repository Manager on http://localhost:33253
[INFO] Stopped SocketConnector@0.0.0.0:33253
[INFO] Mock Repository Manager http://localhost:33253 is stopped.
[INFO]
[INFO] --- mrm-maven-plugin:1.2.0:stop (3rdparty) @ maven-javadoc-plugin ---
[INFO] Stopping Mock Repository Manager on http://localhost:33485
[INFO] Stopped SocketConnector@0.0.0.0:33485
[INFO] Mock Repository Manager http://localhost:33485 is stopped.
[INFO]
[INFO] --- maven-checkstyle-plugin:3.0.0:check (checkstyle-check) @ maven-javadoc-plugin ---
[INFO] run post-build script verify.bsh
[INFO] MJAVADOC-369/pom.xml ............................. SUCCESS (8.2 s)
[INFO] Building: MJAVADOC-526_aggr-managedDeps/pom.xml
[INFO] There are 4 errors reported by Checkstyle 6.18 with config/maven_checks.xml ruleset.
[INFO] Ignored 4 errors, 0 violation remaining.
[INFO]
[INFO] --- maven-invoker-plugin:3.2.1:verify (integration-test) @ maven-javadoc-plugin ---
[INFO] -------------------------------------------------
[INFO] Build Summary:
[INFO] Passed: 76, Failed: 0, Errors: 0, Skipped: 6
[INFO] -------------------------------------------------
[INFO] ------------------------------------------------------------------------
[INFO] BUILD SUCCESS
[INFO] ------------------------------------------------------------------------
[INFO] Total time: 16:41 min
[INFO] Finished at: 2021-08-06T09:18:24Z
[INFO] ------------------------------------------------------------------------
[INFO] [jenkins-event-spy] Generated /home/jenkins/jenkins-home/workspace/ven-javadoc-plugin_jetty-upgrade@2@2@tmp/withMavence469074/maven-spy-20210806-090143-38810062572221091837931.log
[Pipeline] }
[Pipeline] // dir
[Pipeline] }
[withMaven] artifactsPublisher - Archive artifact linux-jdk16-m3.6.x_build/pom.xml under org/apache/maven/plugins/maven-javadoc-plugin/3.3.1-SNAPSHOT/maven-javadoc-plugin-3.3.1-SNAPSHOT.pom
[withMaven] artifactsPublisher - Archive artifact linux-jdk16-m3.6.x_build/target/maven-javadoc-plugin-3.3.1-SNAPSHOT.jar under org/apache/maven/plugins/maven-javadoc-plugin/3.3.1-SNAPSHOT/maven-javadoc-plugin-3.3.1-SNAPSHOT.jar
[Fast Archiver] No prior successful build to compare, so performing full copy of artifacts
[withMaven] junitPublisher - Archive test results for Maven artifact org.apache.maven.plugins:maven-javadoc-plugin:maven-plugin:3.3.1-SNAPSHOT generated by maven-surefire-plugin:test (default-test): linux-jdk16-m3.6.x_build/target/surefire-reports/*.xml
Recording test results
[withMaven] Jenkins Task Scanner Plugin not found, don't display results of source code scanning for 'TODO' and 'FIXME' in pipeline screen.
[withMaven] invokerPublisher - Archive invoker results for Maven artifact MavenArtifact{org.apache.maven.plugins:maven-javadoc-plugin:maven-plugin:3.3.1-SNAPSHOT(version: 3.3.1-SNAPSHOT, snapshot:false) } generated by PluginInvocation{org.apache.maven.plugins:maven-invoker-plugin:3.2.1@integration-test integration-test}: linux-jdk16-m3.6.x_build/target/invoker-reports/*.xml
[INFO] MJAVADOC-526_aggr-managedDeps/pom.xml ............ SUCCESS (6.0 s)
[INFO] Building: MJAVADOC-555_link-automatic-modules/pom.xml
[INFO] run post-build script verify.groovy
[INFO] MJAVADOC-555_link-automatic-modules/pom.xml ...... SUCCESS (7.0 s)
[INFO] Building: MJAVADOC-250/pom.xml
[INFO] run post-build script verify.bsh
[INFO] MJAVADOC-250/pom.xml ............................. SUCCESS (6.7 s)
[INFO]
[INFO] --- mrm-maven-plugin:1.2.0:stop (repository) @ maven-javadoc-plugin ---
[INFO] Stopping Mock Repository Manager on http://localhost:36911
[INFO] Stopped SocketConnector@0.0.0.0:36911
[INFO] Mock Repository Manager http://localhost:36911 is stopped.
[INFO]
[INFO] --- mrm-maven-plugin:1.2.0:stop (3rdparty) @ maven-javadoc-plugin ---
[INFO] Stopping Mock Repository Manager on http://localhost:32873
[INFO] Stopped SocketConnector@0.0.0.0:32873
[INFO] Mock Repository Manager http://localhost:32873 is stopped.
[INFO]
[INFO] --- maven-checkstyle-plugin:3.0.0:check (checkstyle-check) @ maven-javadoc-plugin ---
[INFO] There are 4 errors reported by Checkstyle 6.18 with config/maven_checks.xml ruleset.
[INFO] Ignored 4 errors, 0 violation remaining.
[INFO]
[INFO] --- maven-invoker-plugin:3.2.1:verify (integration-test) @ maven-javadoc-plugin ---
[INFO] -------------------------------------------------
[INFO] Build Summary:
[INFO] Passed: 76, Failed: 0, Errors: 0, Skipped: 6
[INFO] -------------------------------------------------
[INFO] ------------------------------------------------------------------------
[INFO] BUILD SUCCESS
[INFO] ------------------------------------------------------------------------
[INFO] Total time: 17:02 min
[INFO] Finished at: 2021-08-06T09:18:45Z
[INFO] ------------------------------------------------------------------------
[INFO] [jenkins-event-spy] Generated /home/jenkins/jenkins-home/workspace/ven-javadoc-plugin_jetty-upgrade@2@2@tmp/withMaven78684352/maven-spy-20210806-090142-99812988466529513881193.log
[Pipeline] }
[Pipeline] // dir
[Pipeline] }
[withMaven] artifactsPublisher - Archive artifact linux-jdk17-m3.6.x_build/pom.xml under org/apache/maven/plugins/maven-javadoc-plugin/3.3.1-SNAPSHOT/maven-javadoc-plugin-3.3.1-SNAPSHOT.pom
[withMaven] artifactsPublisher - Archive artifact linux-jdk17-m3.6.x_build/target/maven-javadoc-plugin-3.3.1-SNAPSHOT.jar under org/apache/maven/plugins/maven-javadoc-plugin/3.3.1-SNAPSHOT/maven-javadoc-plugin-3.3.1-SNAPSHOT.jar
[Fast Archiver] No prior successful build to compare, so performing full copy of artifacts
[withMaven] junitPublisher - Archive test results for Maven artifact org.apache.maven.plugins:maven-javadoc-plugin:maven-plugin:3.3.1-SNAPSHOT generated by maven-surefire-plugin:test (default-test): linux-jdk17-m3.6.x_build/target/surefire-reports/*.xml
Recording test results
[withMaven] Jenkins Task Scanner Plugin not found, don't display results of source code scanning for 'TODO' and 'FIXME' in pipeline screen.
[withMaven] invokerPublisher - Archive invoker results for Maven artifact MavenArtifact{org.apache.maven.plugins:maven-javadoc-plugin:maven-plugin:3.3.1-SNAPSHOT(version: 3.3.1-SNAPSHOT, snapshot:false) } generated by PluginInvocation{org.apache.maven.plugins:maven-invoker-plugin:3.2.1@integration-test integration-test}: linux-jdk17-m3.6.x_build/target/invoker-reports/*.xml
[withMaven] Publishers: Generated Artifacts Publisher: 72 ms, Junit Publisher: 162 ms, Open Task Scanner Publisher: 1 ms, Invoker Publisher: 21917 ms
[Pipeline] // withMaven
[Pipeline] cleanWs
[WS-CLEANUP] Deleting project workspace...
[WS-CLEANUP] Deferred wipeout is used...
[WS-CLEANUP] done
[Pipeline] }
[Pipeline] // stage
[Pipeline] }
[Pipeline] // ws
[Pipeline] }
[Pipeline] // node
[Pipeline] }
[withMaven] Publishers: Generated Artifacts Publisher: 82 ms, Junit Publisher: 158 ms, Open Task Scanner Publisher: 1 ms, Invoker Publisher: 23184 ms
[Pipeline] // withMaven
[Pipeline] cleanWs
[WS-CLEANUP] Deleting project workspace...
[WS-CLEANUP] Deferred wipeout is used...
[WS-CLEANUP] done
[Pipeline] }
[Pipeline] // stage
[Pipeline] }
[Pipeline] // ws
[Pipeline] }
[Pipeline] // node
[Pipeline] }
[Pipeline] // parallel
[Pipeline] stage
[Pipeline] { (Notifications)
[Pipeline] echo
Build result: FAILURE
[Pipeline] jiraIssueSelector
[Pipeline] echo
The authors of changes [olamy].
[Pipeline] echo
Sending email ...
[Pipeline] emailext
Build failed in Jenkins: Maven » Maven TLP » maven-javadoc-plugin » jetty-upgrade #12
Posted by Apache Jenkins Server <je...@builds.apache.org>.
See https://ci-maven.apache.org/job/Maven/job/maven-box/job/maven-javadoc-plugin/job/jetty-upgrade/12/
Changes:
* prefer logger over system.out
All tests passed
Build log:
[...truncated 5344 lines...]
[INFO] Mock Repository Manager http://localhost:41629 is stopped.
[INFO]
[INFO] --- maven-checkstyle-plugin:3.0.0:check (checkstyle-check) @ maven-javadoc-plugin ---
[INFO] artifact org.apache.geronimo.specs.geronimo-el_2.2_spec:1.0.1: checking for updates from central
[INFO] run post-build script verify.groovy
[INFO] MJAVADOC-427/pom.xml ............................. SUCCESS (10.3 s)
[INFO] Building: MJAVADOC-320/pom.xml
[INFO] There are 4 errors reported by Checkstyle 6.18 with config/maven_checks.xml ruleset.
[INFO] Ignored 4 errors, 0 violation remaining.
[INFO]
[INFO] --- maven-invoker-plugin:3.2.1:verify (integration-test) @ maven-javadoc-plugin ---
[INFO] -------------------------------------------------
[INFO] Build Summary:
[INFO] Passed: 76, Failed: 0, Errors: 0, Skipped: 6
[INFO] -------------------------------------------------
[INFO] ------------------------------------------------------------------------
[INFO] BUILD SUCCESS
[INFO] ------------------------------------------------------------------------
[INFO] Total time: 13:30 min
[INFO] Finished at: 2021-08-06T01:47:43Z
[INFO] ------------------------------------------------------------------------
[INFO] [jenkins-event-spy] Generated /home/jenkins/jenkins-home/workspace/ven-javadoc-plugin_jetty-upgrade@2@tmp/withMaven61a9fc4e/maven-spy-20210806-013413-36817161586294839087690.log
[Pipeline] }
[Pipeline] // dir
[Pipeline] }
[withMaven] artifactsPublisher - Archive artifact linux-jdk17-m3.6.x_build/pom.xml under org/apache/maven/plugins/maven-javadoc-plugin/3.3.1-SNAPSHOT/maven-javadoc-plugin-3.3.1-SNAPSHOT.pom
[withMaven] artifactsPublisher - Archive artifact linux-jdk17-m3.6.x_build/target/maven-javadoc-plugin-3.3.1-SNAPSHOT.jar under org/apache/maven/plugins/maven-javadoc-plugin/3.3.1-SNAPSHOT/maven-javadoc-plugin-3.3.1-SNAPSHOT.jar
[INFO] run post-build script verify.groovy
[INFO] MJAVADOC-320/pom.xml ............................. SUCCESS (11.5 s)
[INFO] Building: MJAVADOC-498_aggr_modulepath/pom.xml
[Fast Archiver] No prior successful build to compare, so performing full copy of artifacts
[withMaven] junitPublisher - Archive test results for Maven artifact org.apache.maven.plugins:maven-javadoc-plugin:maven-plugin:3.3.1-SNAPSHOT generated by maven-surefire-plugin:test (default-test): linux-jdk17-m3.6.x_build/target/surefire-reports/*.xml
Recording test results
[withMaven] Jenkins Task Scanner Plugin not found, don't display results of source code scanning for 'TODO' and 'FIXME' in pipeline screen.
[withMaven] invokerPublisher - Archive invoker results for Maven artifact MavenArtifact{org.apache.maven.plugins:maven-javadoc-plugin:maven-plugin:3.3.1-SNAPSHOT(version: 3.3.1-SNAPSHOT, snapshot:false) } generated by PluginInvocation{org.apache.maven.plugins:maven-invoker-plugin:3.2.1@integration-test integration-test}: linux-jdk17-m3.6.x_build/target/invoker-reports/*.xml
[INFO] artifact org.apache.geronimo.specs.geronimo-el_2.2_spec:1.0.1: checking for updates from central
[INFO] run post-build script verify.groovy
[INFO] MJAVADOC-320/pom.xml ............................. SUCCESS (15.3 s)
[INFO] Building: MJAVADOC-498_aggr_modulepath/pom.xml
[INFO] MJAVADOC-498_aggr_modulepath/pom.xml ............. SUCCESS (23.4 s)
[INFO] Building: examples/exclude-package-names/pom.xml
[INFO] examples/exclude-package-names/pom.xml ........... SKIPPED due to JRE version
[INFO] Building: examples/alternate-doclet/pom.xml
[INFO] examples/alternate-doclet/pom.xml ................ SKIPPED due to JRE version
[INFO] Building: MJAVADOC-599/pom.xml
[INFO] run post-build script verify.groovy
[INFO] MJAVADOC-599/pom.xml ............................. SUCCESS (9.8 s)
[INFO] Building: MJAVADOC-528/pom.xml
[withMaven] Publishers: Generated Artifacts Publisher: 169 ms, Junit Publisher: 160 ms, Open Task Scanner Publisher: 1 ms, Invoker Publisher: 33444 ms
[Pipeline] // withMaven
[Pipeline] cleanWs
[WS-CLEANUP] Deleting project workspace...
[WS-CLEANUP] Deferred wipeout is used...
[WS-CLEANUP] done
[Pipeline] }
[Pipeline] // stage
[Pipeline] }
[Pipeline] // ws
[Pipeline] }
[Pipeline] // node
[Pipeline] }
[INFO] MJAVADOC-498_aggr_modulepath/pom.xml ............. SUCCESS (22.8 s)
[INFO] Building: examples/exclude-package-names/pom.xml
[INFO] examples/exclude-package-names/pom.xml ........... SKIPPED due to JRE version
[INFO] Building: examples/alternate-doclet/pom.xml
[INFO] examples/alternate-doclet/pom.xml ................ SKIPPED due to JRE version
[INFO] Building: MJAVADOC-599/pom.xml
[INFO] run post-build script verify.groovy
[INFO] MJAVADOC-528/pom.xml ............................. SUCCESS (8.6 s)
[INFO] Building: MJAVADOC-592_detectApiLink/pom.xml
[INFO] run post-build script verify.groovy
[INFO] MJAVADOC-599/pom.xml ............................. SUCCESS (10.7 s)
[INFO] Building: MJAVADOC-528/pom.xml
[INFO] run post-build script verify.groovy
[INFO] MJAVADOC-592_detectApiLink/pom.xml ............... SUCCESS (7.5 s)
[INFO] Building: MJAVADOC-514_3rdparty-doclettags/pom.xml
[INFO] MJAVADOC-514_3rdparty-doclettags/pom.xml ......... SKIPPED due to JRE version
[INFO] Building: MJAVADOC-338_downloadSources/pom.xml
[INFO] artifact org.apache.maven.plugins.javadoc.its.mjavadoc338-direct:1.0: checking for updates from central
[INFO] run post-build script verify.groovy
[INFO] MJAVADOC-528/pom.xml ............................. SUCCESS (10.2 s)
[INFO] Building: MJAVADOC-592_detectApiLink/pom.xml
[INFO] run post-build script verify.groovy
[INFO] MJAVADOC-338_downloadSources/pom.xml ............. SUCCESS (13.8 s)
[INFO] Building: MJAVADOC-194/pom.xml
[INFO] run post-build script verify.groovy
[INFO] MJAVADOC-592_detectApiLink/pom.xml ............... SUCCESS (8.4 s)
[INFO] Building: MJAVADOC-514_3rdparty-doclettags/pom.xml
[INFO] artifact org.apache.maven.plugins.javadoc.its.doclet:1.0: checking for updates from central
[INFO] MJAVADOC-514_3rdparty-doclettags/pom.xml ......... SUCCESS (8.4 s)
[INFO] Building: MJAVADOC-338_downloadSources/pom.xml
[INFO] run post-build script verify.bsh
[INFO] MJAVADOC-194/pom.xml ............................. SUCCESS (10.2 s)
[INFO] Building: MJAVADOC-497/pom.xml
[INFO] artifact org.apache.maven.plugins.javadoc.its.mjavadoc338-direct:1.0: checking for updates from central
[INFO] run post-build script verify.bsh
[INFO] MJAVADOC-497/pom.xml ............................. SUCCESS (9.6 s)
[INFO] Building: MJAVADOC-172/pom.xml
[INFO] run post-build script verify.groovy
[INFO] MJAVADOC-338_downloadSources/pom.xml ............. SUCCESS (15.4 s)
[INFO] Building: MJAVADOC-194/pom.xml
[INFO] run post-build script verify.bsh
[INFO] MJAVADOC-172/pom.xml ............................. SUCCESS (15.2 s)
[INFO] Building: MJAVADOC-625_addstylesheet/pom.xml
[INFO] run post-build script verify.bsh
[INFO] MJAVADOC-194/pom.xml ............................. SUCCESS (11.0 s)
[INFO] Building: MJAVADOC-497/pom.xml
[INFO] run post-build script verify.groovy
[INFO] MJAVADOC-625_addstylesheet/pom.xml ............... SUCCESS (9.0 s)
[INFO] Building: MJAVADOC-369/pom.xml
[INFO] run post-build script verify.bsh
[INFO] MJAVADOC-497/pom.xml ............................. SUCCESS (10.7 s)
[INFO] Building: MJAVADOC-172/pom.xml
[INFO] run post-build script verify.bsh
[INFO] MJAVADOC-369/pom.xml ............................. SUCCESS (14.0 s)
[INFO] Building: MJAVADOC-526_aggr-managedDeps/pom.xml
[INFO] run post-build script verify.bsh
[INFO] MJAVADOC-172/pom.xml ............................. SUCCESS (16.3 s)
[INFO] Building: MJAVADOC-625_addstylesheet/pom.xml
[INFO] MJAVADOC-526_aggr-managedDeps/pom.xml ............ SUCCESS (10.8 s)
[INFO] Building: MJAVADOC-555_link-automatic-modules/pom.xml
[INFO] run post-build script verify.groovy
[INFO] MJAVADOC-625_addstylesheet/pom.xml ............... SUCCESS (9.5 s)
[INFO] Building: MJAVADOC-369/pom.xml
[INFO] run post-build script verify.groovy
[INFO] MJAVADOC-555_link-automatic-modules/pom.xml ...... SUCCESS (12.8 s)
[INFO] Building: MJAVADOC-250/pom.xml
[INFO] run post-build script verify.bsh
[INFO] MJAVADOC-369/pom.xml ............................. SUCCESS (15.1 s)
[INFO] Building: MJAVADOC-526_aggr-managedDeps/pom.xml
[INFO] run post-build script verify.bsh
[INFO] MJAVADOC-250/pom.xml ............................. SUCCESS (11.2 s)
[INFO]
[INFO] --- mrm-maven-plugin:1.2.0:stop (repository) @ maven-javadoc-plugin ---
[INFO] Stopping Mock Repository Manager on http://localhost:43373
[INFO] Stopped SocketConnector@0.0.0.0:43373
[INFO] Mock Repository Manager http://localhost:43373 is stopped.
[INFO]
[INFO] --- mrm-maven-plugin:1.2.0:stop (3rdparty) @ maven-javadoc-plugin ---
[INFO] Stopping Mock Repository Manager on http://localhost:38539
[INFO] Stopped SocketConnector@0.0.0.0:38539
[INFO] Mock Repository Manager http://localhost:38539 is stopped.
[INFO]
[INFO] --- maven-checkstyle-plugin:3.0.0:check (checkstyle-check) @ maven-javadoc-plugin ---
[INFO] There are 4 errors reported by Checkstyle 6.18 with config/maven_checks.xml ruleset.
[INFO] Ignored 4 errors, 0 violation remaining.
[INFO]
[INFO] --- maven-invoker-plugin:3.2.1:verify (integration-test) @ maven-javadoc-plugin ---
[INFO] -------------------------------------------------
[INFO] Build Summary:
[INFO] Passed: 76, Failed: 0, Errors: 0, Skipped: 6
[INFO] -------------------------------------------------
[INFO] ------------------------------------------------------------------------
[INFO] BUILD SUCCESS
[INFO] ------------------------------------------------------------------------
[INFO] Total time: 16:34 min
[INFO] Finished at: 2021-08-06T01:50:23Z
[INFO] ------------------------------------------------------------------------
[INFO] [jenkins-event-spy] Generated /home/jenkins/jenkins-home/workspace/ven-javadoc-plugin_jetty-upgrade@2@tmp/withMavenb3eb5012/maven-spy-20210806-013348-74815063927821186439642.log
[Pipeline] }
[Pipeline] // dir
[Pipeline] }
[withMaven] artifactsPublisher - Archive artifact linux-jdk16-m3.6.x_build/pom.xml under org/apache/maven/plugins/maven-javadoc-plugin/3.3.1-SNAPSHOT/maven-javadoc-plugin-3.3.1-SNAPSHOT.pom
[withMaven] artifactsPublisher - Archive artifact linux-jdk16-m3.6.x_build/target/maven-javadoc-plugin-3.3.1-SNAPSHOT.jar under org/apache/maven/plugins/maven-javadoc-plugin/3.3.1-SNAPSHOT/maven-javadoc-plugin-3.3.1-SNAPSHOT.jar
[Fast Archiver] No prior successful build to compare, so performing full copy of artifacts
[withMaven] junitPublisher - Archive test results for Maven artifact org.apache.maven.plugins:maven-javadoc-plugin:maven-plugin:3.3.1-SNAPSHOT generated by maven-surefire-plugin:test (default-test): linux-jdk16-m3.6.x_build/target/surefire-reports/*.xml
Recording test results
[withMaven] Jenkins Task Scanner Plugin not found, don't display results of source code scanning for 'TODO' and 'FIXME' in pipeline screen.
[withMaven] invokerPublisher - Archive invoker results for Maven artifact MavenArtifact{org.apache.maven.plugins:maven-javadoc-plugin:maven-plugin:3.3.1-SNAPSHOT(version: 3.3.1-SNAPSHOT, snapshot:false) } generated by PluginInvocation{org.apache.maven.plugins:maven-invoker-plugin:3.2.1@integration-test integration-test}: linux-jdk16-m3.6.x_build/target/invoker-reports/*.xml
[INFO] MJAVADOC-526_aggr-managedDeps/pom.xml ............ SUCCESS (9.7 s)
[INFO] Building: MJAVADOC-555_link-automatic-modules/pom.xml
[INFO] MJAVADOC-555_link-automatic-modules/pom.xml ...... SKIPPED due to non-matching selectors
[INFO] Building: MJAVADOC-250/pom.xml
[INFO] run post-build script verify.bsh
[INFO] MJAVADOC-250/pom.xml ............................. SUCCESS (13.2 s)
[INFO]
[INFO] --- mrm-maven-plugin:1.2.0:stop (repository) @ maven-javadoc-plugin ---
[INFO] Stopping Mock Repository Manager on http://localhost:40167
[INFO] Stopped SocketConnector@0.0.0.0:40167
[INFO] Mock Repository Manager http://localhost:40167 is stopped.
[INFO]
[INFO] --- mrm-maven-plugin:1.2.0:stop (3rdparty) @ maven-javadoc-plugin ---
[INFO] Stopping Mock Repository Manager on http://localhost:37087
[INFO] Stopped SocketConnector@0.0.0.0:37087
[INFO] Mock Repository Manager http://localhost:37087 is stopped.
[INFO]
[INFO] --- maven-checkstyle-plugin:3.0.0:check (checkstyle-check) @ maven-javadoc-plugin ---
[INFO] There are 4 errors reported by Checkstyle 6.18 with config/maven_checks.xml ruleset.
[INFO] Ignored 4 errors, 0 violation remaining.
[INFO]
[INFO] --- maven-invoker-plugin:3.2.1:verify (integration-test) @ maven-javadoc-plugin ---
[INFO] -------------------------------------------------
[INFO] Build Summary:
[INFO] Passed: 74, Failed: 0, Errors: 0, Skipped: 8
[INFO] -------------------------------------------------
[INFO] ------------------------------------------------------------------------
[INFO] BUILD SUCCESS
[INFO] ------------------------------------------------------------------------
[INFO] Total time: 18:28 min
[INFO] Finished at: 2021-08-06T01:50:42Z
[INFO] ------------------------------------------------------------------------
[INFO] [jenkins-event-spy] Generated /home/jenkins/jenkins-home/workspace/ven-javadoc-plugin_jetty-upgrade@2@tmp/withMavend3a0b2dd/maven-spy-20210806-013213-13016305845384523128975.log
[Pipeline] }
[Pipeline] // dir
[Pipeline] }
[withMaven] artifactsPublisher - Archive artifact linux-jdk11-m3.6.x_build/pom.xml under org/apache/maven/plugins/maven-javadoc-plugin/3.3.1-SNAPSHOT/maven-javadoc-plugin-3.3.1-SNAPSHOT.pom
[withMaven] artifactsPublisher - Archive artifact linux-jdk11-m3.6.x_build/target/maven-javadoc-plugin-3.3.1-SNAPSHOT.jar under org/apache/maven/plugins/maven-javadoc-plugin/3.3.1-SNAPSHOT/maven-javadoc-plugin-3.3.1-SNAPSHOT.jar
[Fast Archiver] No prior successful build to compare, so performing full copy of artifacts
[withMaven] junitPublisher - Archive test results for Maven artifact org.apache.maven.plugins:maven-javadoc-plugin:maven-plugin:3.3.1-SNAPSHOT generated by maven-surefire-plugin:test (default-test): linux-jdk11-m3.6.x_build/target/surefire-reports/*.xml
Recording test results
[withMaven] Jenkins Task Scanner Plugin not found, don't display results of source code scanning for 'TODO' and 'FIXME' in pipeline screen.
[withMaven] invokerPublisher - Archive invoker results for Maven artifact MavenArtifact{org.apache.maven.plugins:maven-javadoc-plugin:maven-plugin:3.3.1-SNAPSHOT(version: 3.3.1-SNAPSHOT, snapshot:false) } generated by PluginInvocation{org.apache.maven.plugins:maven-invoker-plugin:3.2.1@integration-test integration-test}: linux-jdk11-m3.6.x_build/target/invoker-reports/*.xml
[withMaven] Publishers: Generated Artifacts Publisher: 126 ms, Junit Publisher: 122 ms, Open Task Scanner Publisher: 1 ms, Invoker Publisher: 34019 ms
[Pipeline] // withMaven
[Pipeline] cleanWs
[WS-CLEANUP] Deleting project workspace...
[WS-CLEANUP] Deferred wipeout is used...
[WS-CLEANUP] done
[Pipeline] }
[Pipeline] // stage
[Pipeline] }
[Pipeline] // ws
[Pipeline] }
[Pipeline] // node
[Pipeline] }
[withMaven] Publishers: Generated Artifacts Publisher: 125 ms, Junit Publisher: 145 ms, Open Task Scanner Publisher: 2 ms, Invoker Publisher: 35384 ms
[Pipeline] // withMaven
[Pipeline] cleanWs
[WS-CLEANUP] Deleting project workspace...
[WS-CLEANUP] Deferred wipeout is used...
[WS-CLEANUP] done
[Pipeline] }
[Pipeline] // stage
[Pipeline] }
[Pipeline] // ws
[Pipeline] }
[Pipeline] // node
[Pipeline] }
[Pipeline] // parallel
[Pipeline] stage
[Pipeline] { (Notifications)
[Pipeline] echo
Build result: FAILURE
[Pipeline] jiraIssueSelector
[Pipeline] echo
The authors of changes [olamy].
[Pipeline] echo
Sending email ...
[Pipeline] emailext
Build failed in Jenkins: Maven » Maven TLP » maven-javadoc-plugin » jetty-upgrade #11
Posted by Apache Jenkins Server <je...@builds.apache.org>.
See https://ci-maven.apache.org/job/Maven/job/maven-box/job/maven-javadoc-plugin/job/jetty-upgrade/11/
Changes:
* add some log
All tests passed
Build log:
[...truncated 7495 lines...]
[INFO] Building: MJAVADOC-555_link-automatic-modules/pom.xml
[INFO] run post-build script verify.groovy
[INFO] MJAVADOC-580_detectLinks/pom.xml ................. SUCCESS (9.8 s)
[INFO] Building: MJAVADOC-498_mm_modulepath/pom.xml
[INFO] run post-build script verify.bsh
[INFO] MJAVADOC-620_top-level-package\pom.xml ........... SUCCESS (15.5 s)
[INFO] Building: MJAVADOC-625_addstylesheet\pom.xml
[INFO] run post-build script verify.groovy
[INFO] MJAVADOC-555_link-automatic-modules/pom.xml ...... SUCCESS (12.3 s)
[INFO] Building: MJAVADOC-250/pom.xml
[INFO] run post-build script verify.groovy
[INFO] MJAVADOC-625_addstylesheet\pom.xml ............... SUCCESS (8.2 s)
[INFO] Building: MJAVADOC-634-module-testreports\pom.xml
[INFO] MJAVADOC-498_mm_modulepath/pom.xml ............... SUCCESS (13.5 s)
[INFO] Building: MJAVADOC-449_aggr_modulepath/pom.xml
[INFO] run post-build script verify.bsh
[INFO] MJAVADOC-250/pom.xml ............................. SUCCESS (11.3 s)
[INFO]
[INFO] --- mrm-maven-plugin:1.2.0:stop (repository) @ maven-javadoc-plugin ---
[INFO] Stopping Mock Repository Manager on http://localhost:46063
[INFO] Stopped SocketConnector@0.0.0.0:46063
[INFO] Mock Repository Manager http://localhost:46063 is stopped.
[INFO]
[INFO] --- mrm-maven-plugin:1.2.0:stop (3rdparty) @ maven-javadoc-plugin ---
[INFO] Stopping Mock Repository Manager on http://localhost:34097
[INFO] Stopped SocketConnector@0.0.0.0:34097
[INFO] Mock Repository Manager http://localhost:34097 is stopped.
[INFO]
[INFO] --- maven-checkstyle-plugin:3.0.0:check (checkstyle-check) @ maven-javadoc-plugin ---
[INFO] MJAVADOC-634-module-testreports\pom.xml .......... SUCCESS (9.3 s)
[INFO] Building: MJAVADOC-636-aggregate_module_skipped\pom.xml
[INFO] There are 4 errors reported by Checkstyle 6.18 with config/maven_checks.xml ruleset.
[INFO] Ignored 4 errors, 0 violation remaining.
[INFO]
[INFO] --- maven-invoker-plugin:3.2.1:verify (integration-test) @ maven-javadoc-plugin ---
[INFO] -------------------------------------------------
[INFO] Build Summary:
[INFO] Passed: 76, Failed: 0, Errors: 0, Skipped: 6
[INFO] -------------------------------------------------
[INFO] ------------------------------------------------------------------------
[INFO] BUILD SUCCESS
[INFO] ------------------------------------------------------------------------
[INFO] Total time: 17:31 min
[INFO] Finished at: 2021-08-05T23:56:04Z
[INFO] ------------------------------------------------------------------------
[INFO] [jenkins-event-spy] Generated /home/jenkins/jenkins-home/workspace/ven-javadoc-plugin_jetty-upgrade@2@2@tmp/withMaven7ce5841f/maven-spy-20210805-233832-63810406014131472185934.log
[Pipeline] }
[Pipeline] // dir
[Pipeline] }
[withMaven] artifactsPublisher - Archive artifact linux-jdk16-m3.6.x_build/pom.xml under org/apache/maven/plugins/maven-javadoc-plugin/3.3.1-SNAPSHOT/maven-javadoc-plugin-3.3.1-SNAPSHOT.pom
[withMaven] artifactsPublisher - Archive artifact linux-jdk16-m3.6.x_build/target/maven-javadoc-plugin-3.3.1-SNAPSHOT.jar under org/apache/maven/plugins/maven-javadoc-plugin/3.3.1-SNAPSHOT/maven-javadoc-plugin-3.3.1-SNAPSHOT.jar
[Fast Archiver] No prior successful build to compare, so performing full copy of artifacts
[withMaven] junitPublisher - Archive test results for Maven artifact org.apache.maven.plugins:maven-javadoc-plugin:maven-plugin:3.3.1-SNAPSHOT generated by maven-surefire-plugin:test (default-test): linux-jdk16-m3.6.x_build/target/surefire-reports/*.xml
Recording test results
[withMaven] Jenkins Task Scanner Plugin not found, don't display results of source code scanning for 'TODO' and 'FIXME' in pipeline screen.
[withMaven] invokerPublisher - Archive invoker results for Maven artifact MavenArtifact{org.apache.maven.plugins:maven-javadoc-plugin:maven-plugin:3.3.1-SNAPSHOT(version: 3.3.1-SNAPSHOT, snapshot:false) } generated by PluginInvocation{org.apache.maven.plugins:maven-invoker-plugin:3.2.1@integration-test integration-test}: linux-jdk16-m3.6.x_build/target/invoker-reports/*.xml
[INFO] run post-build script verify.groovy
[INFO] MJAVADOC-449_aggr_modulepath/pom.xml ............. SUCCESS (11.7 s)
[INFO] Building: MJAVADOC-556_hide-non-exported-packages/pom.xml
[INFO] MJAVADOC-556_hide-non-exported-packages/pom.xml .. SUCCESS (10.5 s)
[INFO] Building: MJAVADOC-568_export-to-testcase/pom.xml
[INFO] MJAVADOC-568_export-to-testcase/pom.xml .......... SKIPPED due to JRE version
[INFO] Building: MJAVADOC-427/pom.xml
[INFO] run post-build script verify.groovy
[INFO] MJAVADOC-636-aggregate_module_skipped\pom.xml .... SUCCESS (21.2 s)
[INFO] Building: MJAVADOC-639_aggr_static_modulepath\pom.xml
[INFO] MJAVADOC-639_aggr_static_modulepath\pom.xml ...... SUCCESS (9.1 s)
[INFO] Building: MJAVADOC-639_requires_ignored\pom.xml
[INFO] run post-build script verify.groovy
[INFO] MJAVADOC-427/pom.xml ............................. SUCCESS (12.7 s)
[INFO] Building: MJAVADOC-320/pom.xml
[INFO] artifact org.apache.maven.plugins:maven-source-plugin: checking for updates from central
[withMaven] Publishers: Generated Artifacts Publisher: 107 ms, Junit Publisher: 145 ms, Open Task Scanner Publisher: 2 ms, Invoker Publisher: 34746 ms
[Pipeline] // withMaven
[Pipeline] cleanWs
[WS-CLEANUP] Deleting project workspace...
[WS-CLEANUP] Deferred wipeout is used...
[WS-CLEANUP] done
[Pipeline] }
[Pipeline] // stage
[Pipeline] }
[Pipeline] // ws
[Pipeline] }
[Pipeline] // node
[Pipeline] }
[INFO] run post-build script verify.groovy
[INFO] MJAVADOC-320/pom.xml ............................. SUCCESS (15.6 s)
[INFO] Building: MJAVADOC-498_aggr_modulepath/pom.xml
[INFO] run post-build script verify.groovy
[INFO] MJAVADOC-639_requires_ignored\pom.xml ............ SUCCESS (16.8 s)
[INFO] Building: MJAVADOC-661_mrjar\pom.xml
[INFO] run post-build script verify.groovy
[INFO] MJAVADOC-661_mrjar\pom.xml ....................... SUCCESS (9.2 s)
[INFO] Building: MJAVADOC-672_multiline-tag\pom.xml
[INFO] MJAVADOC-672_multiline-tag\pom.xml ............... SUCCESS (7.7 s)
[INFO] Building: site-failOnError\pom.xml
[INFO] MJAVADOC-498_aggr_modulepath/pom.xml ............. SUCCESS (27.0 s)
[INFO] Building: examples/exclude-package-names/pom.xml
[INFO] examples/exclude-package-names/pom.xml ........... SKIPPED due to JRE version
[INFO] Building: examples/alternate-doclet/pom.xml
[INFO] examples/alternate-doclet/pom.xml ................ SKIPPED due to JRE version
[INFO] Building: MJAVADOC-599/pom.xml
[INFO] site-failOnError\pom.xml ......................... SUCCESS (8.6 s)
[INFO]
[INFO] --- mrm-maven-plugin:1.2.0:stop (repository) @ maven-javadoc-plugin ---
[INFO] Stopping Mock Repository Manager on http://localhost:64042
[INFO] Stopped SocketConnector@0.0.0.0:64042
[INFO] Mock Repository Manager http://localhost:64042 is stopped.
[INFO]
[INFO] --- mrm-maven-plugin:1.2.0:stop (3rdparty) @ maven-javadoc-plugin ---
[INFO] Stopping Mock Repository Manager on http://localhost:64043
[INFO] Stopped SocketConnector@0.0.0.0:64043
[INFO] Mock Repository Manager http://localhost:64043 is stopped.
[INFO]
[INFO] --- maven-checkstyle-plugin:3.0.0:check (checkstyle-check) @ maven-javadoc-plugin ---
[INFO] There are 4 errors reported by Checkstyle 6.18 with config/maven_checks.xml ruleset.
[INFO] Ignored 4 errors, 0 violation remaining.
[INFO]
[INFO] --- maven-invoker-plugin:3.2.1:verify (integration-test) @ maven-javadoc-plugin ---
[INFO] -------------------------------------------------
[INFO] Build Summary:
[INFO] Passed: 75, Failed: 0, Errors: 0, Skipped: 7
[INFO] -------------------------------------------------
[INFO] ------------------------------------------------------------------------
[INFO] BUILD SUCCESS
[INFO] ------------------------------------------------------------------------
[INFO] Total time: 16:52 min
[INFO] Finished at: 2021-08-05T16:57:17-07:00
[INFO] ------------------------------------------------------------------------
[INFO] [jenkins-event-spy] Generated F:\jenkins\jenkins-slave\82467a7c\workspace\ven-javadoc-plugin_jetty-upgrade@2@tmp\withMaven152b931d\maven-spy-20210805-164024-493439615905618395680.log
[Pipeline] }
[Pipeline] // dir
[Pipeline] }
[withMaven] artifactsPublisher - Archive artifact windows-jdk11-m3.6.x_build\pom.xml under org\apache\maven\plugins\maven-javadoc-plugin\3.3.1-SNAPSHOT\maven-javadoc-plugin-3.3.1-SNAPSHOT.pom
[withMaven] artifactsPublisher - Archive artifact windows-jdk11-m3.6.x_build\target\maven-javadoc-plugin-3.3.1-SNAPSHOT.jar under org\apache\maven\plugins\maven-javadoc-plugin\3.3.1-SNAPSHOT\maven-javadoc-plugin-3.3.1-SNAPSHOT.jar
[Fast Archiver] No prior successful build to compare, so performing full copy of artifacts
[INFO] run post-build script verify.groovy
[INFO] MJAVADOC-599/pom.xml ............................. SUCCESS (7.4 s)
[INFO] Building: MJAVADOC-528/pom.xml
[withMaven] junitPublisher - Archive test results for Maven artifact org.apache.maven.plugins:maven-javadoc-plugin:maven-plugin:3.3.1-SNAPSHOT generated by maven-surefire-plugin:test (default-test): windows-jdk11-m3.6.x_build\target\surefire-reports\*.xml
Recording test results
[INFO] run post-build script verify.groovy
[INFO] MJAVADOC-528/pom.xml ............................. SUCCESS (10.2 s)
[INFO] Building: MJAVADOC-592_detectApiLink/pom.xml
[withMaven] Jenkins Task Scanner Plugin not found, don't display results of source code scanning for 'TODO' and 'FIXME' in pipeline screen.
[withMaven] invokerPublisher - Archive invoker results for Maven artifact MavenArtifact{org.apache.maven.plugins:maven-javadoc-plugin:maven-plugin:3.3.1-SNAPSHOT(version: 3.3.1-SNAPSHOT, snapshot:false) } generated by PluginInvocation{org.apache.maven.plugins:maven-invoker-plugin:3.2.1@integration-test integration-test}: windows-jdk11-m3.6.x_build\target\invoker-reports\*.xml
[INFO] run post-build script verify.groovy
[INFO] MJAVADOC-592_detectApiLink/pom.xml ............... SUCCESS (9.9 s)
[INFO] Building: MJAVADOC-514_3rdparty-doclettags/pom.xml
[INFO] MJAVADOC-514_3rdparty-doclettags/pom.xml ......... SUCCESS (8.5 s)
[INFO] Building: MJAVADOC-338_downloadSources/pom.xml
[INFO] run post-build script verify.groovy
[INFO] MJAVADOC-338_downloadSources/pom.xml ............. SUCCESS (16.4 s)
[INFO] Building: MJAVADOC-194/pom.xml
[INFO] run post-build script verify.bsh
[INFO] MJAVADOC-194/pom.xml ............................. SUCCESS (12.4 s)
[INFO] Building: MJAVADOC-497/pom.xml
[INFO] run post-build script verify.bsh
[INFO] MJAVADOC-497/pom.xml ............................. SUCCESS (11.0 s)
[INFO] Building: MJAVADOC-172/pom.xml
[INFO] run post-build script verify.bsh
[INFO] MJAVADOC-172/pom.xml ............................. SUCCESS (18.4 s)
[INFO] Building: MJAVADOC-625_addstylesheet/pom.xml
[INFO] run post-build script verify.groovy
[INFO] MJAVADOC-625_addstylesheet/pom.xml ............... SUCCESS (9.9 s)
[INFO] Building: MJAVADOC-369/pom.xml
[INFO] run post-build script verify.bsh
[INFO] MJAVADOC-369/pom.xml ............................. SUCCESS (15.5 s)
[INFO] Building: MJAVADOC-526_aggr-managedDeps/pom.xml
[INFO] MJAVADOC-526_aggr-managedDeps/pom.xml ............ SUCCESS (11.7 s)
[INFO] Building: MJAVADOC-555_link-automatic-modules/pom.xml
[INFO] MJAVADOC-555_link-automatic-modules/pom.xml ...... SKIPPED due to non-matching selectors
[INFO] Building: MJAVADOC-250/pom.xml
[INFO] run post-build script verify.bsh
[INFO] MJAVADOC-250/pom.xml ............................. SUCCESS (13.3 s)
[INFO]
[INFO] --- mrm-maven-plugin:1.2.0:stop (repository) @ maven-javadoc-plugin ---
[INFO] Stopping Mock Repository Manager on http://localhost:35437
[INFO] Stopped SocketConnector@0.0.0.0:35437
[INFO] Mock Repository Manager http://localhost:35437 is stopped.
[INFO]
[INFO] --- mrm-maven-plugin:1.2.0:stop (3rdparty) @ maven-javadoc-plugin ---
[INFO] Stopping Mock Repository Manager on http://localhost:35547
[INFO] Stopped SocketConnector@0.0.0.0:35547
[INFO] Mock Repository Manager http://localhost:35547 is stopped.
[INFO]
[INFO] --- maven-checkstyle-plugin:3.0.0:check (checkstyle-check) @ maven-javadoc-plugin ---
[withMaven] Publishers: Generated Artifacts Publisher: 2493 ms, Junit Publisher: 8175 ms, Open Task Scanner Publisher: 1 ms, Invoker Publisher: 126664 ms
[Pipeline] // withMaven
[Pipeline] cleanWs
[WS-CLEANUP] Deleting project workspace...
[WS-CLEANUP] Deferred wipeout is used...
[WS-CLEANUP] done
[Pipeline] }
[Pipeline] // stage
[Pipeline] }
[Pipeline] // ws
[Pipeline] }
[Pipeline] // node
[Pipeline] }
[INFO] There are 4 errors reported by Checkstyle 6.18 with config/maven_checks.xml ruleset.
[INFO] Ignored 4 errors, 0 violation remaining.
[INFO]
[INFO] --- maven-invoker-plugin:3.2.1:verify (integration-test) @ maven-javadoc-plugin ---
[INFO] -------------------------------------------------
[INFO] Build Summary:
[INFO] Passed: 74, Failed: 0, Errors: 0, Skipped: 8
[INFO] -------------------------------------------------
[INFO] ------------------------------------------------------------------------
[INFO] BUILD SUCCESS
[INFO] ------------------------------------------------------------------------
[INFO] Total time: 21:10 min
[INFO] Finished at: 2021-08-05T23:59:42Z
[INFO] ------------------------------------------------------------------------
[INFO] [jenkins-event-spy] Generated /home/jenkins/jenkins-home/workspace/ven-javadoc-plugin_jetty-upgrade@2@2@tmp/withMaven3626c6cb/maven-spy-20210805-233831-8854548510195931464803.log
[Pipeline] }
[Pipeline] // dir
[Pipeline] }
[withMaven] artifactsPublisher - Archive artifact linux-jdk11-m3.6.x_build/pom.xml under org/apache/maven/plugins/maven-javadoc-plugin/3.3.1-SNAPSHOT/maven-javadoc-plugin-3.3.1-SNAPSHOT.pom
[withMaven] artifactsPublisher - Archive artifact linux-jdk11-m3.6.x_build/target/maven-javadoc-plugin-3.3.1-SNAPSHOT.jar under org/apache/maven/plugins/maven-javadoc-plugin/3.3.1-SNAPSHOT/maven-javadoc-plugin-3.3.1-SNAPSHOT.jar
[Fast Archiver] No prior successful build to compare, so performing full copy of artifacts
[withMaven] junitPublisher - Archive test results for Maven artifact org.apache.maven.plugins:maven-javadoc-plugin:maven-plugin:3.3.1-SNAPSHOT generated by maven-surefire-plugin:test (default-test): linux-jdk11-m3.6.x_build/target/surefire-reports/*.xml
Recording test results
[withMaven] Jenkins Task Scanner Plugin not found, don't display results of source code scanning for 'TODO' and 'FIXME' in pipeline screen.
[withMaven] invokerPublisher - Archive invoker results for Maven artifact MavenArtifact{org.apache.maven.plugins:maven-javadoc-plugin:maven-plugin:3.3.1-SNAPSHOT(version: 3.3.1-SNAPSHOT, snapshot:false) } generated by PluginInvocation{org.apache.maven.plugins:maven-invoker-plugin:3.2.1@integration-test integration-test}: linux-jdk11-m3.6.x_build/target/invoker-reports/*.xml
[withMaven] Publishers: Generated Artifacts Publisher: 117 ms, Junit Publisher: 186 ms, Open Task Scanner Publisher: 16 ms, Invoker Publisher: 36179 ms
[Pipeline] // withMaven
[Pipeline] cleanWs
[WS-CLEANUP] Deleting project workspace...
[WS-CLEANUP] Deferred wipeout is used...
[WS-CLEANUP] done
[Pipeline] }
[Pipeline] // stage
[Pipeline] }
[Pipeline] // ws
[Pipeline] }
[Pipeline] // node
[Pipeline] }
[Pipeline] // parallel
[Pipeline] stage
[Pipeline] { (Notifications)
[Pipeline] echo
Build result: FAILURE
[Pipeline] jiraIssueSelector
[Pipeline] echo
The authors of changes [olamy].
[Pipeline] echo
Sending email ...
[Pipeline] emailext
Build failed in Jenkins: Maven » Maven TLP » maven-javadoc-plugin » jetty-upgrade #10
Posted by Apache Jenkins Server <je...@builds.apache.org>.
See https://ci-maven.apache.org/job/Maven/job/maven-box/job/maven-javadoc-plugin/job/jetty-upgrade/10/
Changes:
* try LoopbackAddress
All tests passed
Build log:
[...truncated 5272 lines...]
[INFO] Building: MJAVADOC-137_jar/pom.xml
[INFO] run post-build script verify.groovy
[INFO] MJAVADOC-420_fixparam/pom.xml .................... SUCCESS (8.6 s)
[INFO] Building: MJAVADOC-610_mrjar/pom.xml
[INFO] run post-build script verify.groovy
[INFO] MJAVADOC-610_mrjar/pom.xml ....................... SUCCESS (7.5 s)
[INFO] Building: MJAVADOC-636-aggregate_module_skipped/pom.xml
[INFO] run post-build script verify.bsh
[INFO] MJAVADOC-137_jar/pom.xml ......................... SUCCESS (15.0 s)
[INFO] Building: MJAVADOC-506_excl-module-info/pom.xml
[INFO] run post-build script verify.groovy
[INFO] MJAVADOC-506_excl-module-info/pom.xml ............ SUCCESS (11.6 s)
[INFO] Building: MJAVADOC-538/pom.xml
[INFO] run post-build script verify.groovy
[INFO] MJAVADOC-636-aggregate_module_skipped/pom.xml .... SUCCESS (17.3 s)
[INFO] Building: MJAVADOC-555_link-automatic-modules/pom.xml
[INFO] MJAVADOC-538/pom.xml ............................. SUCCESS (9.6 s)
[INFO] Building: MJAVADOC-562_release/pom.xml
[INFO] run post-build script verify.groovy
[INFO] MJAVADOC-555_link-automatic-modules/pom.xml ...... SUCCESS (10.3 s)
[INFO] Building: site-failOnError/pom.xml
[INFO] site-failOnError/pom.xml ......................... SUCCESS (10.1 s)
[INFO] Building: MJAVADOC-437/pom.xml
[INFO] MJAVADOC-562_release/pom.xml ..................... SUCCESS (17.4 s)
[INFO] Building: dependencySource-1/pom.xml
[INFO] run post-build script verify.bsh
[INFO] MJAVADOC-437/pom.xml ............................. SUCCESS (7.9 s)
[INFO] Building: MJAVADOC-620_no-dot-in-version/pom.xml
[INFO] run post-build script verify.bsh
[INFO] MJAVADOC-620_no-dot-in-version/pom.xml ........... SUCCESS (13.2 s)
[INFO] Building: MJAVADOC-338_downloadSources/pom.xml
[INFO] run post-build script verify.bsh
[INFO] dependencySource-1/pom.xml ....................... SUCCESS (19.4 s)
[INFO] Building: site-failOnError/pom.xml
[INFO] run post-build script verify.groovy
[INFO] MJAVADOC-338_downloadSources/pom.xml ............. SUCCESS (11.4 s)
[INFO] Building: MJAVADOC-134_multiaggregate/pom.xml
[INFO] site-failOnError/pom.xml ......................... SUCCESS (14.5 s)
[INFO] Building: dependencySource-4/pom.xml
[INFO] run post-build script verify.groovy
[INFO] MJAVADOC-134_multiaggregate/pom.xml .............. SUCCESS (25.4 s)
[INFO] Building: examples/exclude-package-names/pom.xml
[INFO] examples/exclude-package-names/pom.xml ........... SKIPPED due to JRE version
[INFO] Building: examples/alternate-doclet/pom.xml
[INFO] examples/alternate-doclet/pom.xml ................ SKIPPED due to JRE version
[INFO] Building: MJAVADOC-571_aggr-empty-sourcepaths/pom.xml
[INFO] run post-build script verify.bsh
[INFO] dependencySource-4/pom.xml ....................... SUCCESS (26.8 s)
[INFO] Building: additional-dependencies-non-aggregate/pom.xml
[INFO] MJAVADOC-571_aggr-empty-sourcepaths/pom.xml ...... SUCCESS (7.6 s)
[INFO] Building: MJAVADOC-494_aggregate-repositories/pom.xml
[INFO] MJAVADOC-494_aggregate-repositories/pom.xml ...... SUCCESS (7.7 s)
[INFO]
[INFO] --- mrm-maven-plugin:1.2.0:stop (repository) @ maven-javadoc-plugin ---
[INFO] Stopping Mock Repository Manager on http://localhost:45301
[INFO] Stopped SocketConnector@0.0.0.0:45301
[INFO] Mock Repository Manager http://localhost:45301 is stopped.
[INFO]
[INFO] --- mrm-maven-plugin:1.2.0:stop (3rdparty) @ maven-javadoc-plugin ---
[INFO] Stopping Mock Repository Manager on http://localhost:35959
[INFO] Stopped SocketConnector@0.0.0.0:35959
[INFO] Mock Repository Manager http://localhost:35959 is stopped.
[INFO]
[INFO] --- maven-checkstyle-plugin:3.0.0:check (checkstyle-check) @ maven-javadoc-plugin ---
[INFO] There are 4 errors reported by Checkstyle 6.18 with config/maven_checks.xml ruleset.
[INFO] Ignored 4 errors, 0 violation remaining.
[INFO]
[INFO] --- maven-invoker-plugin:3.2.1:verify (integration-test) @ maven-javadoc-plugin ---
[INFO] -------------------------------------------------
[INFO] Build Summary:
[INFO] Passed: 76, Failed: 0, Errors: 0, Skipped: 6
[INFO] -------------------------------------------------
[INFO] ------------------------------------------------------------------------
[INFO] BUILD SUCCESS
[INFO] ------------------------------------------------------------------------
[INFO] Total time: 12:53 min
[INFO] Finished at: 2021-08-05T23:42:35Z
[INFO] ------------------------------------------------------------------------
[INFO] [jenkins-event-spy] Generated /home/jenkins/h49-shared/82467a7c/workspace/ven-javadoc-plugin_jetty-upgrade@2@2@tmp/withMavenbbcf6195/maven-spy-20210805-232941-76417145208224009776999.log
[Pipeline] }
[Pipeline] // dir
[Pipeline] }
[withMaven] artifactsPublisher - Archive artifact linux-jdk16-m3.6.x_build/pom.xml under org/apache/maven/plugins/maven-javadoc-plugin/3.3.1-SNAPSHOT/maven-javadoc-plugin-3.3.1-SNAPSHOT.pom
[withMaven] artifactsPublisher - Archive artifact linux-jdk16-m3.6.x_build/target/maven-javadoc-plugin-3.3.1-SNAPSHOT.jar under org/apache/maven/plugins/maven-javadoc-plugin/3.3.1-SNAPSHOT/maven-javadoc-plugin-3.3.1-SNAPSHOT.jar
[Fast Archiver] No prior successful build to compare, so performing full copy of artifacts
[withMaven] junitPublisher - Archive test results for Maven artifact org.apache.maven.plugins:maven-javadoc-plugin:maven-plugin:3.3.1-SNAPSHOT generated by maven-surefire-plugin:test (default-test): linux-jdk16-m3.6.x_build/target/surefire-reports/*.xml
Recording test results
[INFO] run post-build script verify.bsh
[INFO] additional-dependencies-non-aggregate/pom.xml .... SUCCESS (16.0 s)
[INFO] Building: MJAVADOC-568_manifest-splitpackage/pom.xml
[INFO] MJAVADOC-568_manifest-splitpackage/pom.xml ....... SKIPPED due to JRE version
[INFO] Building: MJAVADOC-134_multiaggregate/pom.xml
[withMaven] Jenkins Task Scanner Plugin not found, don't display results of source code scanning for 'TODO' and 'FIXME' in pipeline screen.
[withMaven] invokerPublisher - Archive invoker results for Maven artifact MavenArtifact{org.apache.maven.plugins:maven-javadoc-plugin:maven-plugin:3.3.1-SNAPSHOT(version: 3.3.1-SNAPSHOT, snapshot:false) } generated by PluginInvocation{org.apache.maven.plugins:maven-invoker-plugin:3.2.1@integration-test integration-test}: linux-jdk16-m3.6.x_build/target/invoker-reports/*.xml
[INFO] run post-build script verify.groovy
[INFO] MJAVADOC-134_multiaggregate/pom.xml .............. SUCCESS (36.2 s)
[INFO] Building: MJAVADOC-661_mrjar/pom.xml
[INFO] run post-build script verify.groovy
[INFO] MJAVADOC-661_mrjar/pom.xml ....................... SUCCESS (11.9 s)
[INFO] Building: MJAVADOC-636-aggregate_module_skipped/pom.xml
[INFO] run post-build script verify.groovy
[INFO] MJAVADOC-636-aggregate_module_skipped/pom.xml .... SUCCESS (28.2 s)
[INFO] Building: MJAVADOC-407/pom.xml
[INFO] run post-build script verify.bsh
[INFO] MJAVADOC-407/pom.xml ............................. SUCCESS (12.2 s)
[INFO] Building: MJAVADOC-437/pom.xml
[withMaven] Publishers: Generated Artifacts Publisher: 631 ms, Junit Publisher: 2863 ms, Open Task Scanner Publisher: 1 ms, Invoker Publisher: 88458 ms, Pipeline Graph Publisher: 1 ms
[Pipeline] // withMaven
[Pipeline] cleanWs
[WS-CLEANUP] Deleting project workspace...
[WS-CLEANUP] Deferred wipeout is used...
[WS-CLEANUP] done
[Pipeline] }
[Pipeline] // stage
[Pipeline] }
[Pipeline] // ws
[Pipeline] }
[Pipeline] // node
[Pipeline] }
[INFO] run post-build script verify.bsh
[INFO] MJAVADOC-437/pom.xml ............................. SUCCESS (11.7 s)
[INFO] Building: MJAVADOC-180/pom.xml
[INFO] run post-build script verify.bsh
[INFO] MJAVADOC-180/pom.xml ............................. SUCCESS (9.7 s)
[INFO] Building: MJAVADOC-494_aggregate-repositories/pom.xml
[INFO] MJAVADOC-494_aggregate-repositories/pom.xml ...... SUCCESS (11.5 s)
[INFO] Building: MJAVADOC-634-module-testreports/pom.xml
[INFO] MJAVADOC-634-module-testreports/pom.xml .......... SUCCESS (13.2 s)
[INFO] Building: MJAVADOC-580_detectLinks/pom.xml
[INFO] run post-build script verify.groovy
[INFO] MJAVADOC-580_detectLinks/pom.xml ................. SUCCESS (9.8 s)
[INFO] Building: MJAVADOC-498_mm_modulepath/pom.xml
[INFO] MJAVADOC-498_mm_modulepath/pom.xml ............... SUCCESS (14.8 s)
[INFO] Building: MJAVADOC-449_aggr_modulepath/pom.xml
[INFO] run post-build script verify.groovy
[INFO] MJAVADOC-449_aggr_modulepath/pom.xml ............. SUCCESS (11.1 s)
[INFO] Building: MJAVADOC-556_hide-non-exported-packages/pom.xml
[INFO] MJAVADOC-556_hide-non-exported-packages/pom.xml .. SUCCESS (11.2 s)
[INFO] Building: MJAVADOC-568_export-to-testcase/pom.xml
[INFO] MJAVADOC-568_export-to-testcase/pom.xml .......... SKIPPED due to JRE version
[INFO] Building: MJAVADOC-427/pom.xml
[INFO] run post-build script verify.groovy
[INFO] MJAVADOC-427/pom.xml ............................. SUCCESS (11.9 s)
[INFO] Building: MJAVADOC-320/pom.xml
[INFO] run post-build script verify.groovy
[INFO] MJAVADOC-320/pom.xml ............................. SUCCESS (13.9 s)
[INFO] Building: MJAVADOC-498_aggr_modulepath/pom.xml
[INFO] MJAVADOC-498_aggr_modulepath/pom.xml ............. SUCCESS (18.0 s)
[INFO] Building: examples/exclude-package-names/pom.xml
[INFO] examples/exclude-package-names/pom.xml ........... SKIPPED due to JRE version
[INFO] Building: examples/alternate-doclet/pom.xml
[INFO] examples/alternate-doclet/pom.xml ................ SKIPPED due to JRE version
[INFO] Building: MJAVADOC-599/pom.xml
[INFO] run post-build script verify.groovy
[INFO] MJAVADOC-599/pom.xml ............................. SUCCESS (12.3 s)
[INFO] Building: MJAVADOC-528/pom.xml
[INFO] run post-build script verify.groovy
[INFO] MJAVADOC-528/pom.xml ............................. SUCCESS (10.8 s)
[INFO] Building: MJAVADOC-592_detectApiLink/pom.xml
[INFO] run post-build script verify.groovy
[INFO] MJAVADOC-592_detectApiLink/pom.xml ............... SUCCESS (8.8 s)
[INFO] Building: MJAVADOC-514_3rdparty-doclettags/pom.xml
[INFO] MJAVADOC-514_3rdparty-doclettags/pom.xml ......... SUCCESS (9.6 s)
[INFO] Building: MJAVADOC-338_downloadSources/pom.xml
[INFO] run post-build script verify.groovy
[INFO] MJAVADOC-338_downloadSources/pom.xml ............. SUCCESS (18.2 s)
[INFO] Building: MJAVADOC-194/pom.xml
[INFO] run post-build script verify.bsh
[INFO] MJAVADOC-194/pom.xml ............................. SUCCESS (12.1 s)
[INFO] Building: MJAVADOC-497/pom.xml
[INFO] run post-build script verify.bsh
[INFO] MJAVADOC-497/pom.xml ............................. SUCCESS (12.3 s)
[INFO] Building: MJAVADOC-172/pom.xml
[INFO] run post-build script verify.bsh
[INFO] MJAVADOC-172/pom.xml ............................. SUCCESS (17.8 s)
[INFO] Building: MJAVADOC-625_addstylesheet/pom.xml
[INFO] run post-build script verify.groovy
[INFO] MJAVADOC-625_addstylesheet/pom.xml ............... SUCCESS (9.7 s)
[INFO] Building: MJAVADOC-369/pom.xml
[INFO] run post-build script verify.bsh
[INFO] MJAVADOC-369/pom.xml ............................. SUCCESS (18.2 s)
[INFO] Building: MJAVADOC-526_aggr-managedDeps/pom.xml
[INFO] MJAVADOC-526_aggr-managedDeps/pom.xml ............ SUCCESS (12.9 s)
[INFO] Building: MJAVADOC-555_link-automatic-modules/pom.xml
[INFO] MJAVADOC-555_link-automatic-modules/pom.xml ...... SKIPPED due to non-matching selectors
[INFO] Building: MJAVADOC-250/pom.xml
[INFO] run post-build script verify.bsh
[INFO] MJAVADOC-250/pom.xml ............................. SUCCESS (13.5 s)
[INFO]
[INFO] --- mrm-maven-plugin:1.2.0:stop (repository) @ maven-javadoc-plugin ---
[INFO] Stopping Mock Repository Manager on http://localhost:35667
[INFO] Stopped SocketConnector@0.0.0.0:35667
[INFO] Mock Repository Manager http://localhost:35667 is stopped.
[INFO]
[INFO] --- mrm-maven-plugin:1.2.0:stop (3rdparty) @ maven-javadoc-plugin ---
[INFO] Stopping Mock Repository Manager on http://localhost:36217
[INFO] Stopped SocketConnector@0.0.0.0:36217
[INFO] Mock Repository Manager http://localhost:36217 is stopped.
[INFO]
[INFO] --- maven-checkstyle-plugin:3.0.0:check (checkstyle-check) @ maven-javadoc-plugin ---
[INFO] There are 4 errors reported by Checkstyle 6.18 with config/maven_checks.xml ruleset.
[INFO] Ignored 4 errors, 0 violation remaining.
[INFO]
[INFO] --- maven-invoker-plugin:3.2.1:verify (integration-test) @ maven-javadoc-plugin ---
[INFO] -------------------------------------------------
[INFO] Build Summary:
[INFO] Passed: 74, Failed: 0, Errors: 0, Skipped: 8
[INFO] -------------------------------------------------
[INFO] ------------------------------------------------------------------------
[INFO] BUILD SUCCESS
[INFO] ------------------------------------------------------------------------
[INFO] Total time: 20:18 min
[INFO] Finished at: 2021-08-05T23:49:03Z
[INFO] ------------------------------------------------------------------------
[INFO] [jenkins-event-spy] Generated /home/jenkins/jenkins-home/workspace/ven-javadoc-plugin_jetty-upgrade@2@2@tmp/withMavend4a2cb2c/maven-spy-20210805-232845-38913756118944750247231.log
[Pipeline] }
[Pipeline] // dir
[Pipeline] }
[withMaven] artifactsPublisher - Archive artifact linux-jdk11-m3.6.x_build/pom.xml under org/apache/maven/plugins/maven-javadoc-plugin/3.3.1-SNAPSHOT/maven-javadoc-plugin-3.3.1-SNAPSHOT.pom
[withMaven] artifactsPublisher - Archive artifact linux-jdk11-m3.6.x_build/target/maven-javadoc-plugin-3.3.1-SNAPSHOT.jar under org/apache/maven/plugins/maven-javadoc-plugin/3.3.1-SNAPSHOT/maven-javadoc-plugin-3.3.1-SNAPSHOT.jar
[Fast Archiver] No prior successful build to compare, so performing full copy of artifacts
[withMaven] junitPublisher - Archive test results for Maven artifact org.apache.maven.plugins:maven-javadoc-plugin:maven-plugin:3.3.1-SNAPSHOT generated by maven-surefire-plugin:test (default-test): linux-jdk11-m3.6.x_build/target/surefire-reports/*.xml
Recording test results
[withMaven] Jenkins Task Scanner Plugin not found, don't display results of source code scanning for 'TODO' and 'FIXME' in pipeline screen.
[withMaven] invokerPublisher - Archive invoker results for Maven artifact MavenArtifact{org.apache.maven.plugins:maven-javadoc-plugin:maven-plugin:3.3.1-SNAPSHOT(version: 3.3.1-SNAPSHOT, snapshot:false) } generated by PluginInvocation{org.apache.maven.plugins:maven-invoker-plugin:3.2.1@integration-test integration-test}: linux-jdk11-m3.6.x_build/target/invoker-reports/*.xml
[withMaven] Publishers: Generated Artifacts Publisher: 113 ms, Junit Publisher: 215 ms, Open Task Scanner Publisher: 1 ms, Invoker Publisher: 36979 ms, Pipeline Graph Publisher: 4 ms
[Pipeline] // withMaven
[Pipeline] cleanWs
[WS-CLEANUP] Deleting project workspace...
[WS-CLEANUP] Deferred wipeout is used...
[WS-CLEANUP] done
[Pipeline] }
[Pipeline] // stage
[Pipeline] }
[Pipeline] // ws
[Pipeline] }
[Pipeline] // node
[Pipeline] }
[Pipeline] // parallel
[Pipeline] stage
[Pipeline] { (Notifications)
[Pipeline] echo
Build result: FAILURE
[Pipeline] jiraIssueSelector
[Pipeline] echo
The authors of changes [olamy].
[Pipeline] echo
Sending email ...
[Pipeline] emailext