You are viewing a plain text version of this content. The canonical link for it is here.
Posted to dev@mahout.apache.org by Apache Jenkins Server <je...@builds.apache.org> on 2012/06/04 01:51:51 UTC

Build failed in Jenkins: mahout-nightly #895

See <https://builds.apache.org/job/mahout-nightly/895/changes>

Changes:

[robinanil] MAHOUT-1006 Increase default heapsize to 4G and create deprecation warnings for old naivebayes

------------------------------------------
[...truncated 1547 lines...]
Tests run: 2, Failures: 0, Errors: 0, Skipped: 0, Time elapsed: 0.002 sec
Running org.apache.mahout.classifier.naivebayes.NaiveBayesTest
Tests run: 2, Failures: 0, Errors: 2, Skipped: 0, Time elapsed: 2.108 sec <<< FAILURE!
Running org.apache.mahout.classifier.naivebayes.ComplementaryNaiveBayesClassifierTest
Tests run: 1, Failures: 0, Errors: 0, Skipped: 0, Time elapsed: 0.003 sec
Running org.apache.mahout.classifier.naivebayes.NaiveBayesModelTest
Tests run: 1, Failures: 0, Errors: 0, Skipped: 0, Time elapsed: 0.001 sec
Running org.apache.mahout.classifier.naivebayes.StandardNaiveBayesClassifierTest
Tests run: 1, Failures: 0, Errors: 0, Skipped: 0, Time elapsed: 0.002 sec
Running org.apache.mahout.classifier.naivebayes.training.IndexInstancesMapperTest
Tests run: 2, Failures: 0, Errors: 2, Skipped: 0, Time elapsed: 0.004 sec <<< FAILURE!
Running org.apache.mahout.classifier.naivebayes.training.ThetaMapperTest
Tests run: 1, Failures: 0, Errors: 0, Skipped: 0, Time elapsed: 0.014 sec
Running org.apache.mahout.classifier.naivebayes.training.WeightsMapperTest
Tests run: 1, Failures: 0, Errors: 0, Skipped: 0, Time elapsed: 0.003 sec
Running org.apache.mahout.classifier.evaluation.AucTest
Tests run: 3, Failures: 0, Errors: 0, Skipped: 0, Time elapsed: 0.268 sec
Running org.apache.mahout.classifier.discriminative.WinnowTrainerTest
Tests run: 1, Failures: 0, Errors: 0, Skipped: 0, Time elapsed: 0.004 sec
Running org.apache.mahout.classifier.discriminative.PerceptronTrainerTest
Tests run: 1, Failures: 0, Errors: 0, Skipped: 0, Time elapsed: 0.001 sec
Running org.apache.mahout.classifier.discriminative.LinearModelTest
Tests run: 3, Failures: 0, Errors: 0, Skipped: 0, Time elapsed: 0.001 sec
Running org.apache.mahout.clustering.kmeans.TestKmeansClustering
Tests run: 3, Failures: 0, Errors: 0, Skipped: 0, Time elapsed: 119.111 sec
Running org.apache.mahout.clustering.kmeans.TestRandomSeedGenerator
Tests run: 1, Failures: 0, Errors: 0, Skipped: 0, Time elapsed: 0.026 sec
Running org.apache.mahout.clustering.TestClusterInterface
Tests run: 12, Failures: 0, Errors: 0, Skipped: 0, Time elapsed: 0.008 sec
Running org.apache.mahout.clustering.lda.cvb.TestCVBModelTrainer
Tests run: 2, Failures: 0, Errors: 0, Skipped: 0, Time elapsed: 232.552 sec
Running org.apache.mahout.clustering.TestGaussianAccumulators
Tests run: 6, Failures: 0, Errors: 0, Skipped: 0, Time elapsed: 0.733 sec
Running org.apache.mahout.clustering.spectral.common.TestAffinityMatrixInputJob
Tests run: 2, Failures: 0, Errors: 0, Skipped: 0, Time elapsed: 0.011 sec
Running org.apache.mahout.clustering.spectral.common.TestVectorCache
Tests run: 3, Failures: 0, Errors: 0, Skipped: 0, Time elapsed: 0.023 sec
Running org.apache.mahout.clustering.spectral.common.TestUnitVectorizerJob
Tests run: 1, Failures: 0, Errors: 0, Skipped: 0, Time elapsed: 0.005 sec
Running org.apache.mahout.clustering.spectral.common.TestMatrixDiagonalizeJob
Tests run: 2, Failures: 0, Errors: 0, Skipped: 0, Time elapsed: 0.008 sec
Running org.apache.mahout.clustering.spectral.common.TestVectorMatrixMultiplicationJob
Tests run: 1, Failures: 0, Errors: 0, Skipped: 0, Time elapsed: 0.004 sec
Running org.apache.mahout.clustering.spectral.eigencuts.TestEigencutsAffinityCutsJob
Tests run: 3, Failures: 0, Errors: 0, Skipped: 0, Time elapsed: 0.026 sec
Running org.apache.mahout.clustering.spectral.eigencuts.TestEigencutsSensitivityJob
Tests run: 2, Failures: 0, Errors: 0, Skipped: 0, Time elapsed: 0.009 sec
Running org.apache.mahout.clustering.iterator.TestClusterClassifier
Tests run: 14, Failures: 0, Errors: 0, Skipped: 0, Time elapsed: 28.354 sec
Running org.apache.mahout.clustering.minhash.TestMinHashClustering
Tests run: 4, Failures: 0, Errors: 0, Skipped: 0, Time elapsed: 28.261 sec
Running org.apache.mahout.clustering.topdown.PathDirectoryTest
Tests run: 5, Failures: 0, Errors: 0, Skipped: 0, Time elapsed: 0.01 sec
Running org.apache.mahout.clustering.topdown.postprocessor.ClusterOutputPostProcessorTest
Tests run: 1, Failures: 0, Errors: 0, Skipped: 0, Time elapsed: 0.135 sec
Running org.apache.mahout.clustering.topdown.postprocessor.ClusterCountReaderTest
Tests run: 1, Failures: 0, Errors: 0, Skipped: 0, Time elapsed: 0.099 sec
Running org.apache.mahout.clustering.fuzzykmeans.TestFuzzyKmeansClustering
Tests run: 3, Failures: 0, Errors: 0, Skipped: 0, Time elapsed: 163.891 sec
Running org.apache.mahout.clustering.classify.ClusterClassificationDriverTest
Tests run: 3, Failures: 0, Errors: 0, Skipped: 0, Time elapsed: 11.193 sec
Running org.apache.mahout.clustering.dirichlet.TestMapReduce
Tests run: 4, Failures: 0, Errors: 0, Skipped: 0, Time elapsed: 79.339 sec
Running org.apache.mahout.clustering.dirichlet.TestDistributions
Tests run: 9, Failures: 0, Errors: 0, Skipped: 0, Time elapsed: 0.013 sec
Running org.apache.mahout.clustering.dirichlet.TestDirichletClustering
Tests run: 2, Failures: 0, Errors: 0, Skipped: 0, Time elapsed: 11.134 sec
Running org.apache.mahout.clustering.canopy.TestCanopyCreation
Tests run: 17, Failures: 0, Errors: 0, Skipped: 0, Time elapsed: 71.618 sec
Running org.apache.mahout.clustering.meanshift.TestMeanShift
Tests run: 8, Failures: 0, Errors: 0, Skipped: 0, Time elapsed: 62.574 sec
Running org.apache.mahout.fpm.pfpgrowth.FPGrowthTest
Tests run: 4, Failures: 0, Errors: 0, Skipped: 0, Time elapsed: 0.066 sec
Running org.apache.mahout.fpm.pfpgrowth.FPGrowthRetailDataTest
Tests run: 1, Failures: 0, Errors: 0, Skipped: 0, Time elapsed: 1.279 sec
Running org.apache.mahout.fpm.pfpgrowth.PFPGrowthTest
Tests run: 2, Failures: 0, Errors: 0, Skipped: 0, Time elapsed: 42.322 sec
Running org.apache.mahout.fpm.pfpgrowth.FPGrowthSyntheticDataTest
Tests run: 2, Failures: 0, Errors: 0, Skipped: 0, Time elapsed: 39.282 sec
Running org.apache.mahout.fpm.pfpgrowth.fpgrowth.FrequentPatternMaxHeapTest
Tests run: 1, Failures: 0, Errors: 0, Skipped: 0, Time elapsed: 0.033 sec
Running org.apache.mahout.fpm.pfpgrowth.PFPGrowthRetailDataTest
Tests run: 2, Failures: 0, Errors: 0, Skipped: 0, Time elapsed: 113.66 sec
Running org.apache.mahout.fpm.pfpgrowth.TransactionTreeTest
Tests run: 1, Failures: 0, Errors: 0, Skipped: 0, Time elapsed: 1.974 sec
Running org.apache.mahout.vectorizer.encoders.InteractionValueEncoderTest
Tests run: 3, Failures: 0, Errors: 0, Skipped: 0, Time elapsed: 0.004 sec
Running org.apache.mahout.vectorizer.encoders.ContinuousValueEncoderTest
Tests run: 2, Failures: 0, Errors: 0, Skipped: 0, Time elapsed: 0.002 sec
Running org.apache.mahout.vectorizer.encoders.TextValueEncoderTest
Tests run: 3, Failures: 0, Errors: 0, Skipped: 0, Time elapsed: 0.078 sec
Running org.apache.mahout.vectorizer.encoders.ConstantValueEncoderTest
Tests run: 2, Failures: 0, Errors: 0, Skipped: 0, Time elapsed: 0.004 sec
Running org.apache.mahout.vectorizer.encoders.WordLikeValueEncoderTest
Tests run: 4, Failures: 0, Errors: 0, Skipped: 0, Time elapsed: 0.01 sec
Running org.apache.mahout.vectorizer.DocumentProcessorTest
Tests run: 1, Failures: 0, Errors: 0, Skipped: 0, Time elapsed: 4.032 sec
Running org.apache.mahout.vectorizer.HighDFWordsPrunerTest
Tests run: 2, Failures: 0, Errors: 0, Skipped: 0, Time elapsed: 113.643 sec
Running org.apache.mahout.vectorizer.SparseVectorsFromSequenceFilesTest
Tests run: 6, Failures: 0, Errors: 0, Skipped: 0, Time elapsed: 305.379 sec
Running org.apache.mahout.vectorizer.DictionaryVectorizerTest
Tests run: 4, Failures: 0, Errors: 0, Skipped: 0, Time elapsed: 184.979 sec
Running org.apache.mahout.vectorizer.collocations.llr.CollocMapperTest
Tests run: 2, Failures: 0, Errors: 0, Skipped: 0, Time elapsed: 0.061 sec
Running org.apache.mahout.vectorizer.collocations.llr.GramKeyGroupComparatorTest
Tests run: 1, Failures: 0, Errors: 0, Skipped: 0, Time elapsed: 0.003 sec
Running org.apache.mahout.vectorizer.collocations.llr.GramTest
Tests run: 7, Failures: 0, Errors: 0, Skipped: 0, Time elapsed: 0.009 sec
Running org.apache.mahout.vectorizer.collocations.llr.LLRReducerTest
Tests run: 1, Failures: 0, Errors: 0, Skipped: 0, Time elapsed: 0.037 sec
Running org.apache.mahout.vectorizer.collocations.llr.GramKeyTest
Tests run: 2, Failures: 0, Errors: 0, Skipped: 0, Time elapsed: 0.003 sec
Running org.apache.mahout.vectorizer.collocations.llr.CollocReducerTest
Tests run: 1, Failures: 0, Errors: 0, Skipped: 0, Time elapsed: 0.009 sec
Running org.apache.mahout.vectorizer.collocations.llr.GramKeyPartitionerTest
Tests run: 1, Failures: 0, Errors: 0, Skipped: 0, Time elapsed: 0.002 sec
Running org.apache.mahout.vectorizer.EncodedVectorsFromSequenceFilesTest
Tests run: 4, Failures: 0, Errors: 0, Skipped: 0, Time elapsed: 16.223 sec
Running org.apache.mahout.common.StringUtilsTest
Tests run: 2, Failures: 0, Errors: 0, Skipped: 0, Time elapsed: 0.179 sec
Running org.apache.mahout.common.distance.TestMahalanobisDistanceMeasure
Tests run: 1, Failures: 0, Errors: 0, Skipped: 0, Time elapsed: 0.002 sec
Running org.apache.mahout.common.distance.TestChebyshevMeasure
Tests run: 1, Failures: 0, Errors: 0, Skipped: 0, Time elapsed: 0.003 sec
Running org.apache.mahout.common.distance.TestManhattanDistanceMeasure
Tests run: 1, Failures: 0, Errors: 0, Skipped: 0, Time elapsed: 0.003 sec
Running org.apache.mahout.common.distance.CosineDistanceMeasureTest
Tests run: 1, Failures: 0, Errors: 0, Skipped: 0, Time elapsed: 0.003 sec
Running org.apache.mahout.common.distance.TestWeightedEuclideanDistanceMeasureTest
Tests run: 2, Failures: 0, Errors: 0, Skipped: 0, Time elapsed: 0.005 sec
Running org.apache.mahout.common.distance.TestEuclideanDistanceMeasure
Tests run: 1, Failures: 0, Errors: 0, Skipped: 0, Time elapsed: 0.003 sec
Running org.apache.mahout.common.distance.TestMinkowskiMeasure
Tests run: 1, Failures: 0, Errors: 0, Skipped: 0, Time elapsed: 0.003 sec
Running org.apache.mahout.common.distance.TestWeightedManhattanDistanceMeasure
Tests run: 2, Failures: 0, Errors: 0, Skipped: 0, Time elapsed: 0.005 sec
Running org.apache.mahout.common.distance.TestTanimotoDistanceMeasure
Tests run: 2, Failures: 0, Errors: 0, Skipped: 0, Time elapsed: 0.005 sec
Running org.apache.mahout.common.IntPairWritableTest
Tests run: 3, Failures: 0, Errors: 0, Skipped: 0, Time elapsed: 0.013 sec
Running org.apache.mahout.common.iterator.TestStableFixedSizeSampler
Tests run: 5, Failures: 0, Errors: 0, Skipped: 0, Time elapsed: 0.016 sec
Running org.apache.mahout.common.iterator.TestSamplingIterator
Tests run: 5, Failures: 0, Errors: 0, Skipped: 0, Time elapsed: 0.072 sec
Running org.apache.mahout.common.iterator.CountingIteratorTest
Tests run: 2, Failures: 0, Errors: 0, Skipped: 0, Time elapsed: 0.011 sec
Running org.apache.mahout.common.iterator.TestFixedSizeSampler
Tests run: 5, Failures: 0, Errors: 0, Skipped: 0, Time elapsed: 0.026 sec
Running org.apache.mahout.common.AbstractJobTest
Tests run: 3, Failures: 0, Errors: 0, Skipped: 0, Time elapsed: 0.154 sec
Running org.apache.mahout.driver.MahoutDriverTest
Tests run: 1, Failures: 0, Errors: 0, Skipped: 0, Time elapsed: 0.102 sec

Results :

Tests in error: 
  toyData(org.apache.mahout.classifier.naivebayes.NaiveBayesTest): File /tmp/mahout-NaiveBayesTest-4769249123767374848/output/naiveBayesModel.bin does not exist.
  toyDataComplementary(org.apache.mahout.classifier.naivebayes.NaiveBayesTest): File /tmp/mahout-NaiveBayesTest-5087092584826938368/output/naiveBayesModel.bin does not exist.
  skip(org.apache.mahout.classifier.naivebayes.training.IndexInstancesMapperTest): 1
  index(org.apache.mahout.classifier.naivebayes.training.IndexInstancesMapperTest): 1

Tests run: 669, Failures: 0, Errors: 4, Skipped: 0

mojoFailed org.apache.maven.plugins:maven-surefire-plugin:2.8.1(default-test)
[JENKINS] Recording test results
projectFailed org.apache.mahout:mahout-core:0.7-SNAPSHOT
sessionEnded
[INFO] ------------------------------------------------------------------------
[INFO] Reactor Summary:
[INFO] 
[INFO] Apache Mahout ..................................... SUCCESS [11.946s]
[INFO] Mahout Build Tools ................................ SUCCESS [3.770s]
[INFO] Mahout Math ....................................... SUCCESS [36.121s]
[INFO] Mahout Core ....................................... FAILURE [49:25.226s]
[INFO] Mahout Integration ................................ SKIPPED
[INFO] Mahout Examples ................................... SKIPPED
[INFO] Mahout Release Package ............................ SKIPPED
[INFO] ------------------------------------------------------------------------
[INFO] BUILD FAILURE
[INFO] ------------------------------------------------------------------------
[INFO] Total time: 50:17.787s
[INFO] Finished at: Sun Jun 03 23:51:17 UTC 2012
[INFO] Final Memory: 42M/203M
[INFO] ------------------------------------------------------------------------
Projects to build: [MavenProject: org.apache.mahout:mahout:0.7-SNAPSHOT @ <https://builds.apache.org/job/mahout-nightly/ws/trunk/pom.xml,> MavenProject: org.apache.mahout:mahout-buildtools:0.7-SNAPSHOT @ <https://builds.apache.org/job/mahout-nightly/ws/trunk/buildtools/pom.xml,> MavenProject: org.apache.mahout:mahout-math:0.7-SNAPSHOT @ <https://builds.apache.org/job/mahout-nightly/ws/trunk/math/pom.xml,> MavenProject: org.apache.mahout:mahout-core:0.7-SNAPSHOT @ <https://builds.apache.org/job/mahout-nightly/ws/trunk/core/pom.xml,> MavenProject: org.apache.mahout:mahout-integration:0.7-SNAPSHOT @ <https://builds.apache.org/job/mahout-nightly/ws/trunk/integration/pom.xml,> MavenProject: org.apache.mahout:mahout-examples:0.7-SNAPSHOT @ <https://builds.apache.org/job/mahout-nightly/ws/trunk/examples/pom.xml,> MavenProject: org.apache.mahout:mahout-distribution:0.7-SNAPSHOT @ <https://builds.apache.org/job/mahout-nightly/ws/trunk/distribution/pom.xml]>
[JENKINS] Archiving <https://builds.apache.org/job/mahout-nightly/ws/trunk/buildtools/pom.xml> to /home/hudson/hudson/jobs/mahout-nightly/modules/org.apache.mahout$mahout-buildtools/builds/2012-06-03_23-00-55/archive/org.apache.mahout/mahout-buildtools/0.7-SNAPSHOT/mahout-buildtools-0.7-SNAPSHOT.pom
[JENKINS] Archiving <https://builds.apache.org/job/mahout-nightly/ws/trunk/buildtools/target/mahout-buildtools-0.7-SNAPSHOT.jar> to /home/hudson/hudson/jobs/mahout-nightly/modules/org.apache.mahout$mahout-buildtools/builds/2012-06-03_23-00-55/archive/org.apache.mahout/mahout-buildtools/0.7-20120603.230114-122/mahout-buildtools-0.7-20120603.230114-122.jar
[JENKINS] Archiving <https://builds.apache.org/job/mahout-nightly/ws/trunk/examples/pom.xml> to /home/hudson/hudson/jobs/mahout-nightly/modules/org.apache.mahout$mahout-examples/builds/2012-06-03_23-00-55/archive/org.apache.mahout/mahout-examples/0.7-SNAPSHOT/mahout-examples-0.7-SNAPSHOT.pom
[JENKINS] Archiving <https://builds.apache.org/job/mahout-nightly/ws/trunk/distribution/pom.xml> to /home/hudson/hudson/jobs/mahout-nightly/modules/org.apache.mahout$mahout-distribution/builds/2012-06-03_23-00-55/archive/org.apache.mahout/mahout-distribution/0.7-SNAPSHOT/mahout-distribution-0.7-SNAPSHOT.pom
[JENKINS] Archiving <https://builds.apache.org/job/mahout-nightly/ws/trunk/pom.xml> to /home/hudson/hudson/jobs/mahout-nightly/modules/org.apache.mahout$mahout/builds/2012-06-03_23-00-55/archive/org.apache.mahout/mahout/0.7-SNAPSHOT/mahout-0.7-SNAPSHOT.pom
[JENKINS] Archiving <https://builds.apache.org/job/mahout-nightly/ws/trunk/integration/pom.xml> to /home/hudson/hudson/jobs/mahout-nightly/modules/org.apache.mahout$mahout-integration/builds/2012-06-03_23-00-55/archive/org.apache.mahout/mahout-integration/0.7-SNAPSHOT/mahout-integration-0.7-SNAPSHOT.pom
[JENKINS] Archiving <https://builds.apache.org/job/mahout-nightly/ws/trunk/core/pom.xml> to /home/hudson/hudson/jobs/mahout-nightly/modules/org.apache.mahout$mahout-core/builds/2012-06-03_23-00-55/archive/org.apache.mahout/mahout-core/0.7-SNAPSHOT/mahout-core-0.7-SNAPSHOT.pom
[JENKINS] Archiving <https://builds.apache.org/job/mahout-nightly/ws/trunk/math/pom.xml> to /home/hudson/hudson/jobs/mahout-nightly/modules/org.apache.mahout$mahout-math/builds/2012-06-03_23-00-55/archive/org.apache.mahout/mahout-math/0.7-SNAPSHOT/mahout-math-0.7-SNAPSHOT.pom
[JENKINS] Archiving <https://builds.apache.org/job/mahout-nightly/ws/trunk/math/target/mahout-math-0.7-SNAPSHOT.jar> to /home/hudson/hudson/jobs/mahout-nightly/modules/org.apache.mahout$mahout-math/builds/2012-06-03_23-00-55/archive/org.apache.mahout/mahout-math/0.7-20120603.230149-121/mahout-math-0.7-20120603.230149-121.jar
[JENKINS] Archiving <https://builds.apache.org/job/mahout-nightly/ws/trunk/math/target/mahout-math-0.7-SNAPSHOT-tests.jar> to /home/hudson/hudson/jobs/mahout-nightly/modules/org.apache.mahout$mahout-math/builds/2012-06-03_23-00-55/archive/org.apache.mahout/mahout-math/0.7-20120603.230149-121/mahout-math-0.7-20120603.230149-121-tests.jar
[JENKINS] Archiving <https://builds.apache.org/job/mahout-nightly/ws/trunk/math/target/mahout-math-0.7-SNAPSHOT-sources.jar> to /home/hudson/hudson/jobs/mahout-nightly/modules/org.apache.mahout$mahout-math/builds/2012-06-03_23-00-55/archive/org.apache.mahout/mahout-math/0.7-20120603.230149-121/mahout-math-0.7-20120603.230149-121-sources.jar
Waiting for Jenkins to finish collecting data
mavenExecutionResult exceptions not empty
message : Failed to execute goal org.apache.maven.plugins:maven-surefire-plugin:2.8.1:test (default-test) on project mahout-core: There are test failures.

Please refer to <https://builds.apache.org/job/mahout-nightly/ws/trunk/core/target/surefire-reports> for the individual test results.
cause : There are test failures.

Please refer to <https://builds.apache.org/job/mahout-nightly/ws/trunk/core/target/surefire-reports> for the individual test results.
Stack trace : 
org.apache.maven.lifecycle.LifecycleExecutionException: Failed to execute goal org.apache.maven.plugins:maven-surefire-plugin:2.8.1:test (default-test) on project mahout-core: There are test failures.

Please refer to <https://builds.apache.org/job/mahout-nightly/ws/trunk/core/target/surefire-reports> for the individual test results.
	at org.apache.maven.lifecycle.internal.MojoExecutor.execute(MojoExecutor.java:213)
	at org.apache.maven.lifecycle.internal.MojoExecutor.execute(MojoExecutor.java:153)
	at org.apache.maven.lifecycle.internal.MojoExecutor.execute(MojoExecutor.java:145)
	at org.apache.maven.lifecycle.internal.LifecycleModuleBuilder.buildProject(LifecycleModuleBuilder.java:84)
	at org.apache.maven.lifecycle.internal.LifecycleModuleBuilder.buildProject(LifecycleModuleBuilder.java:59)
	at org.apache.maven.lifecycle.internal.LifecycleStarter.singleThreadedBuild(LifecycleStarter.java:183)
	at org.apache.maven.lifecycle.internal.LifecycleStarter.execute(LifecycleStarter.java:161)
	at org.apache.maven.DefaultMaven.doExecute(DefaultMaven.java:319)
	at org.apache.maven.DefaultMaven.execute(DefaultMaven.java:156)
	at org.jvnet.hudson.maven3.launcher.Maven3Launcher.main(Maven3Launcher.java:79)
	at sun.reflect.NativeMethodAccessorImpl.invoke0(Native Method)
	at sun.reflect.NativeMethodAccessorImpl.invoke(NativeMethodAccessorImpl.java:39)
	at sun.reflect.DelegatingMethodAccessorImpl.invoke(DelegatingMethodAccessorImpl.java:25)
	at java.lang.reflect.Method.invoke(Method.java:597)
	at org.codehaus.plexus.classworlds.launcher.Launcher.launchStandard(Launcher.java:329)
	at org.codehaus.plexus.classworlds.launcher.Launcher.launch(Launcher.java:239)
	at org.jvnet.hudson.maven3.agent.Maven3Main.launch(Maven3Main.java:158)
	at hudson.maven.Maven3Builder.call(Maven3Builder.java:98)
	at hudson.maven.Maven3Builder.call(Maven3Builder.java:64)
	at hudson.remoting.UserRequest.perform(UserRequest.java:118)
	at hudson.remoting.UserRequest.perform(UserRequest.java:48)
	at hudson.remoting.Request$2.run(Request.java:287)
	at hudson.remoting.InterceptingExecutorService$1.call(InterceptingExecutorService.java:72)
	at java.util.concurrent.FutureTask$Sync.innerRun(FutureTask.java:303)
	at java.util.concurrent.FutureTask.run(FutureTask.java:138)
	at java.util.concurrent.ThreadPoolExecutor$Worker.runTask(ThreadPoolExecutor.java:886)
	at java.util.concurrent.ThreadPoolExecutor$Worker.run(ThreadPoolExecutor.java:908)
	at java.lang.Thread.run(Thread.java:662)
Caused by: org.apache.maven.plugin.MojoFailureException: There are test failures.

Please refer to <https://builds.apache.org/job/mahout-nightly/ws/trunk/core/target/surefire-reports> for the individual test results.
	at org.apache.maven.plugin.surefire.SurefireHelper.reportExecution(SurefireHelper.java:74)
	at org.apache.maven.plugin.surefire.SurefirePlugin.writeSummary(SurefirePlugin.java:644)
	at org.apache.maven.plugin.surefire.SurefirePlugin.executeAfterPreconditionsChecked(SurefirePlugin.java:640)
	at org.apache.maven.plugin.surefire.AbstractSurefireMojo.execute(AbstractSurefireMojo.java:102)
	at org.apache.maven.plugin.DefaultBuildPluginManager.executeMojo(DefaultBuildPluginManager.java:101)
	at org.apache.maven.lifecycle.internal.MojoExecutor.execute(MojoExecutor.java:209)
	... 27 more
Sending e-mails to: dev@mahout.apache.org robin.anil@gmail.com
channel stopped