You are viewing a plain text version of this content. The canonical link for it is here.
Posted to commits@myfaces.apache.org by Apache Jenkins Server <je...@builds.apache.org> on 2014/06/09 20:15:43 UTC
Build failed in Jenkins: myfaces-current12 #1176
See <https://builds.apache.org/job/myfaces-current12/1176/>
------------------------------------------
[...truncated 1570 lines...]
Artifact: myfaces-api-1.2.13-SNAPSHOT.jar have META-INF/myfaces-metadata.xml
[INFO]
[INFO] --- myfaces-builder-plugin:1.0.8:make-config (makefacesconfig) @ myfaces-impl ---
[WARNING] *******************************************************************
[WARNING] RuntimeInstance initializing.
[WARNING] Default ResourceManager initializing. (class org.apache.velocity.runtime.resource.ResourceManagerImpl)
[WARNING] FileResourceLoader : initialization starting.
[WARNING] FileResourceLoader : initialization complete.
[WARNING] RelativeClasspathResourceLoader : initialization complete.
[INFO] RelativeClasspathResourceLoader : adding path 'META-INF'
[WARNING] RelativeClasspathResourceLoader : initialization complete.
[WARNING] Default ResourceManager initialization complete.
[WARNING] Velocimacro : initialization starting.
[WARNING] Velocimacro : VM library registration complete.
[WARNING] Velocimacro : Velocimacro : initialization complete.
[WARNING] RuntimeInstance successfully initialized.
[INFO] using base content file: F:\jenkins\jenkins-slave\workspace\myfaces-current12\current12\core\impl\src\main\conf\META-INF\standard-faces-config-base.xml
[INFO]
[INFO] --- myfaces-builder-plugin:1.0.8:make-tags (make_tags) @ myfaces-impl ---
[INFO] Using template from file loader: F:\jenkins\jenkins-slave\workspace\myfaces-current12\current12\core\impl\src\main\resources\META-INF\tagClass12.vm
[WARNING] *******************************************************************
[WARNING] RuntimeInstance initializing.
[WARNING] Default ResourceManager initializing. (class org.apache.velocity.runtime.resource.ResourceManagerImpl)
[WARNING] FileResourceLoader : initialization starting.
[WARNING] FileResourceLoader : initialization complete.
[WARNING] RelativeClasspathResourceLoader : initialization complete.
[INFO] RelativeClasspathResourceLoader : adding path 'META-INF'
[WARNING] RelativeClasspathResourceLoader : initialization complete.
[WARNING] Default ResourceManager initialization complete.
[WARNING] Velocimacro : initialization starting.
[WARNING] Velocimacro : VM library registration complete.
[WARNING] Velocimacro : Velocimacro : initialization complete.
[WARNING] RuntimeInstance successfully initialized.
[INFO] Generating tag class:org.apache.myfaces.taglib.html.HtmlInputHiddenTag
[INFO] Generating tag class:org.apache.myfaces.taglib.html.HtmlColumnTag
[INFO] Generating tag class:org.apache.myfaces.taglib.html.HtmlCommandButtonTag
[INFO] Generating tag class:org.apache.myfaces.taglib.html.HtmlCommandLinkTag
[INFO] Generating tag class:org.apache.myfaces.taglib.html.HtmlDataTableTag
[INFO] Generating tag class:org.apache.myfaces.taglib.html.HtmlFormTag
[INFO] Generating tag class:org.apache.myfaces.taglib.html.HtmlGraphicImageTag
[INFO] Generating tag class:org.apache.myfaces.taglib.html.HtmlInputSecretTag
[INFO] Generating tag class:org.apache.myfaces.taglib.html.HtmlInputTextTag
[INFO] Generating tag class:org.apache.myfaces.taglib.html.HtmlInputTextareaTag
[INFO] Generating tag class:org.apache.myfaces.taglib.html.HtmlMessageTag
[INFO] Generating tag class:org.apache.myfaces.taglib.html.HtmlMessagesTag
[INFO] Generating tag class:org.apache.myfaces.taglib.html.HtmlOutputFormatTag
[INFO] Generating tag class:org.apache.myfaces.taglib.html.HtmlOutputLabelTag
[INFO] Generating tag class:org.apache.myfaces.taglib.html.HtmlOutputLinkTag
[INFO] Generating tag class:org.apache.myfaces.taglib.html.HtmlOutputTextTag
[INFO] Generating tag class:org.apache.myfaces.taglib.html.HtmlPanelGridTag
[INFO] Generating tag class:org.apache.myfaces.taglib.html.HtmlPanelGroupTag
[INFO] Generating tag class:org.apache.myfaces.taglib.html.HtmlSelectBooleanCheckboxTag
[INFO] Generating tag class:org.apache.myfaces.taglib.html.HtmlSelectManyCheckboxTag
[INFO] Generating tag class:org.apache.myfaces.taglib.html.HtmlSelectManyListboxTag
[INFO] Generating tag class:org.apache.myfaces.taglib.html.HtmlSelectManyMenuTag
[INFO] Generating tag class:org.apache.myfaces.taglib.html.HtmlSelectOneListboxTag
[INFO] Generating tag class:org.apache.myfaces.taglib.html.HtmlSelectOneMenuTag
[INFO] Generating tag class:org.apache.myfaces.taglib.html.HtmlSelectOneRadioTag
[INFO]
[INFO] --- myfaces-builder-plugin:1.0.8:make-config (makecoretld) @ myfaces-impl ---
[WARNING] *******************************************************************
[WARNING] RuntimeInstance initializing.
[WARNING] Default ResourceManager initializing. (class org.apache.velocity.runtime.resource.ResourceManagerImpl)
[WARNING] FileResourceLoader : initialization starting.
[WARNING] FileResourceLoader : initialization complete.
[WARNING] RelativeClasspathResourceLoader : initialization complete.
[INFO] RelativeClasspathResourceLoader : adding path 'META-INF'
[WARNING] RelativeClasspathResourceLoader : initialization complete.
[WARNING] Default ResourceManager initialization complete.
[WARNING] Velocimacro : initialization starting.
[WARNING] Velocimacro : VM library registration complete.
[WARNING] Velocimacro : Velocimacro : initialization complete.
[WARNING] RuntimeInstance successfully initialized.
[INFO] using base content file: F:\jenkins\jenkins-slave\workspace\myfaces-current12\current12\core\impl\src\main\conf\META-INF\myfaces_core-base.tld
[INFO]
[INFO] --- myfaces-builder-plugin:1.0.8:make-config (makehtmltld) @ myfaces-impl ---
[WARNING] *******************************************************************
[WARNING] RuntimeInstance initializing.
[WARNING] Default ResourceManager initializing. (class org.apache.velocity.runtime.resource.ResourceManagerImpl)
[WARNING] FileResourceLoader : initialization starting.
[WARNING] FileResourceLoader : initialization complete.
[WARNING] RelativeClasspathResourceLoader : initialization complete.
[INFO] RelativeClasspathResourceLoader : adding path 'META-INF'
[WARNING] RelativeClasspathResourceLoader : initialization complete.
[WARNING] Default ResourceManager initialization complete.
[WARNING] Velocimacro : initialization starting.
[WARNING] Velocimacro : VM library registration complete.
[WARNING] Velocimacro : Velocimacro : initialization complete.
[WARNING] RuntimeInstance successfully initialized.
[INFO] using base content file: F:\jenkins\jenkins-slave\workspace\myfaces-current12\current12\core\impl\src\main\conf\META-INF\myfaces_html-base.tld
[WARNING] Failed to getClass for org.apache.maven.plugin.source.SourceJarMojo
[INFO]
[INFO] <<< maven-source-plugin:2.0.4:jar (attach-source) @ myfaces-impl <<<
[INFO]
[INFO] --- maven-source-plugin:2.0.4:jar (attach-source) @ myfaces-impl ---
[INFO] Building jar: F:\jenkins\jenkins-slave\workspace\myfaces-current12\current12\core\impl\target\myfaces-impl-1.2.13-SNAPSHOT-sources.jar
[INFO]
[INFO] --- maven-checkstyle-plugin:2.6:check (verify-style) @ myfaces-impl ---
[INFO]
[INFO]
[INFO] --- maven-install-plugin:2.3.1:install (default-install) @ myfaces-impl ---
[INFO] Installing F:\jenkins\jenkins-slave\workspace\myfaces-current12\current12\core\impl\target\myfaces-impl-1.2.13-SNAPSHOT.jar to f:\jenkins\jenkins-slave\maven-repositories\0\org\apache\myfaces\core\myfaces-impl\1.2.13-SNAPSHOT\myfaces-impl-1.2.13-SNAPSHOT.jar
[INFO] Installing F:\jenkins\jenkins-slave\workspace\myfaces-current12\current12\core\impl\pom.xml to f:\jenkins\jenkins-slave\maven-repositories\0\org\apache\myfaces\core\myfaces-impl\1.2.13-SNAPSHOT\myfaces-impl-1.2.13-SNAPSHOT.pom
[INFO] Installing F:\jenkins\jenkins-slave\workspace\myfaces-current12\current12\core\impl\target\myfaces-impl-1.2.13-SNAPSHOT-sources.jar to f:\jenkins\jenkins-slave\maven-repositories\0\org\apache\myfaces\core\myfaces-impl\1.2.13-SNAPSHOT\myfaces-impl-1.2.13-SNAPSHOT-sources.jar
[INFO]
[INFO] ------------------------------------------------------------------------
[INFO] Building Build Project 1.2.10-SNAPSHOT
[INFO] ------------------------------------------------------------------------
[INFO]
[INFO] --- maven-remote-resources-plugin:1.1:process (default) @ myfaces-base ---
[INFO] Setting property: classpath.resource.loader.class => 'org.codehaus.plexus.velocity.ContextClassLoaderResourceLoader'.
[INFO] Setting property: velocimacro.messages.on => 'false'.
[INFO] Setting property: resource.loader => 'classpath'.
[INFO] Setting property: resource.manager.logwhenfound => 'false'.
[INFO]
[INFO] --- maven-install-plugin:2.3:install (default-install) @ myfaces-base ---
[INFO] Installing <https://builds.apache.org/job/myfaces-current12/ws/current12\pom.xml> to f:\jenkins\jenkins-slave\maven-repositories\0\org\apache\myfaces\myfaces-base\1.2.10-SNAPSHOT\myfaces-base-1.2.10-SNAPSHOT.pom
[INFO] ------------------------------------------------------------------------
[INFO] Reactor Summary:
[INFO]
[INFO] Apache MyFaces Shared For JSF 1.2 - Project ....... SUCCESS [24.149s]
[INFO] Apache MyFaces Shared For JSF 1.2 - Core .......... SUCCESS [21.074s]
[INFO] MyFaces Shared Impl ............................... SUCCESS [19.172s]
[INFO] MyFaces Shared Tomahawk ........................... SUCCESS [12.502s]
[INFO] Apache MyFaces JSF-1.2 Core Project ............... SUCCESS [6.557s]
[INFO] Apache Myfaces JSF Core-1.2 API ................... SUCCESS [44.048s]
[INFO] Apache MyFaces JSF-1.2 Core Impl .................. SUCCESS [33.301s]
[INFO] Build Project ..................................... SUCCESS [2.593s]
[INFO] ------------------------------------------------------------------------
[INFO] BUILD SUCCESS
[INFO] ------------------------------------------------------------------------
[INFO] Total time: 2:52.132s
[INFO] Finished at: Mon Jun 09 11:15:26 PDT 2014
[INFO] Final Memory: 53M/127M
[INFO] ------------------------------------------------------------------------
Waiting for Jenkins to finish collecting data
[JENKINS] Archiving F:\jenkins\jenkins-slave\workspace\myfaces-current12\current12\shared\shared-tomahawk\pom.xml to org.apache.myfaces.shared/myfaces-shared-tomahawk/3.0.13-SNAPSHOT/myfaces-shared-tomahawk-3.0.13-SNAPSHOT.pom
[JENKINS] Archiving F:\jenkins\jenkins-slave\workspace\myfaces-current12\current12\shared\shared-tomahawk\target\myfaces-shared-tomahawk-3.0.13-SNAPSHOT.jar to org.apache.myfaces.shared/myfaces-shared-tomahawk/3.0.13-SNAPSHOT/myfaces-shared-tomahawk-3.0.13-SNAPSHOT.jar
[JENKINS] Archiving F:\jenkins\jenkins-slave\workspace\myfaces-current12\current12\shared\shared-tomahawk\target\myfaces-shared-tomahawk-3.0.13-SNAPSHOT-sources.jar to org.apache.myfaces.shared/myfaces-shared-tomahawk/3.0.13-SNAPSHOT/myfaces-shared-tomahawk-3.0.13-SNAPSHOT-sources.jar
Sending artifact delta relative to myfaces-current12 » MyFaces Shared Tomahawk #1175
Archived 3 artifacts
Archive block size is 32768
Received 0 blocks and 564372 bytes
Compression is 0.0%
Took 1.7 sec
[JENKINS] Archiving F:\jenkins\jenkins-slave\workspace\myfaces-current12\current12\core\impl\pom.xml to org.apache.myfaces.core/myfaces-impl/1.2.13-SNAPSHOT/myfaces-impl-1.2.13-SNAPSHOT.pom
[JENKINS] Archiving F:\jenkins\jenkins-slave\workspace\myfaces-current12\current12\core\impl\target\myfaces-impl-1.2.13-SNAPSHOT.jar to org.apache.myfaces.core/myfaces-impl/1.2.13-SNAPSHOT/myfaces-impl-1.2.13-SNAPSHOT.jar
[JENKINS] Archiving F:\jenkins\jenkins-slave\workspace\myfaces-current12\current12\core\impl\target\myfaces-impl-1.2.13-SNAPSHOT-sources.jar to org.apache.myfaces.core/myfaces-impl/1.2.13-SNAPSHOT/myfaces-impl-1.2.13-SNAPSHOT-sources.jar
Sending artifact delta relative to myfaces-current12 » Apache MyFaces JSF-1.2 Core Impl #1175
Archived 3 artifacts
Archive block size is 32768
Received 33 blocks and 530468 bytes
Compression is 67.1%
Took 0.43 sec
[JENKINS] Archiving F:\jenkins\jenkins-slave\workspace\myfaces-current12\current12\shared\shared-impl\pom.xml to org.apache.myfaces.shared/myfaces-shared-impl/3.0.13-SNAPSHOT/myfaces-shared-impl-3.0.13-SNAPSHOT.pom
[JENKINS] Archiving F:\jenkins\jenkins-slave\workspace\myfaces-current12\current12\shared\shared-impl\target\myfaces-shared-impl-3.0.13-SNAPSHOT.jar to org.apache.myfaces.shared/myfaces-shared-impl/3.0.13-SNAPSHOT/myfaces-shared-impl-3.0.13-SNAPSHOT.jar
[JENKINS] Archiving F:\jenkins\jenkins-slave\workspace\myfaces-current12\current12\shared\shared-impl\target\myfaces-shared-impl-3.0.13-SNAPSHOT-sources.jar to org.apache.myfaces.shared/myfaces-shared-impl/3.0.13-SNAPSHOT/myfaces-shared-impl-3.0.13-SNAPSHOT-sources.jar
Sending artifact delta relative to myfaces-current12 » MyFaces Shared Impl #1175
Archived 3 artifacts
Archive block size is 32768
Received 0 blocks and 560561 bytes
Compression is 0.0%
Took 0.37 sec
[JENKINS] Archiving F:\jenkins\jenkins-slave\workspace\myfaces-current12\current12\shared\core\pom.xml to org.apache.myfaces.shared/myfaces-shared-core/3.0.13-SNAPSHOT/myfaces-shared-core-3.0.13-SNAPSHOT.pom
[JENKINS] Archiving F:\jenkins\jenkins-slave\workspace\myfaces-current12\current12\shared\core\target\myfaces-shared-core-3.0.13-SNAPSHOT.jar to org.apache.myfaces.shared/myfaces-shared-core/3.0.13-SNAPSHOT/myfaces-shared-core-3.0.13-SNAPSHOT.jar
[JENKINS] Archiving F:\jenkins\jenkins-slave\workspace\myfaces-current12\current12\shared\core\target\myfaces-shared-core-3.0.13-SNAPSHOT-sources.jar to org.apache.myfaces.shared/myfaces-shared-core/3.0.13-SNAPSHOT/myfaces-shared-core-3.0.13-SNAPSHOT-sources.jar
Sending artifact delta relative to myfaces-current12 » Apache MyFaces Shared For JSF 1.2 - Core #1175
Archived 3 artifacts
Archive block size is 32768
Received 14 blocks and 104977 bytes
Compression is 81.4%
Took 0.53 sec
[JENKINS] Archiving F:\jenkins\jenkins-slave\workspace\myfaces-current12\current12\core\api\pom.xml to org.apache.myfaces.core/myfaces-api/1.2.13-SNAPSHOT/myfaces-api-1.2.13-SNAPSHOT.pom
[JENKINS] Archiving F:\jenkins\jenkins-slave\workspace\myfaces-current12\current12\core\api\target\myfaces-api-1.2.13-SNAPSHOT.jar to org.apache.myfaces.core/myfaces-api/1.2.13-SNAPSHOT/myfaces-api-1.2.13-SNAPSHOT.jar
[JENKINS] Archiving F:\jenkins\jenkins-slave\workspace\myfaces-current12\current12\core\api\target\myfaces-api-1.2.13-SNAPSHOT-sources.jar to org.apache.myfaces.core/myfaces-api/1.2.13-SNAPSHOT/myfaces-api-1.2.13-SNAPSHOT-sources.jar
[JENKINS] Archiving F:\jenkins\jenkins-slave\workspace\myfaces-current12\current12\core\api\target\myfaces-api-1.2.13-SNAPSHOT-tests.jar to org.apache.myfaces.core/myfaces-api/1.2.13-SNAPSHOT/myfaces-api-1.2.13-SNAPSHOT-tests.jar
Sending artifact delta relative to myfaces-current12 » Apache Myfaces JSF Core-1.2 API #1175
Archived 4 artifacts
Archive block size is 32768
Received 15 blocks and 525403 bytes
Compression is 48.3%
Took 2.1 sec
[JENKINS] Archiving F:\jenkins\jenkins-slave\workspace\myfaces-current12\current12\shared\pom.xml to org.apache.myfaces.shared/myfaces-shared-project/3.0.13-SNAPSHOT/myfaces-shared-project-3.0.13-SNAPSHOT.pom
[JENKINS] Archiving F:\jenkins\jenkins-slave\workspace\myfaces-current12\current12\shared\target\myfaces-shared-project-3.0.13-SNAPSHOT-site.xml to org.apache.myfaces.shared/myfaces-shared-project/3.0.13-SNAPSHOT/myfaces-shared-project-3.0.13-SNAPSHOT-site.xml
Sending artifact delta relative to myfaces-current12 » Apache MyFaces Shared For JSF 1.2 - Project #1175
Archived 2 artifacts
Archive block size is 32768
Received 0 blocks and 10524 bytes
Compression is 0.0%
Took 73 ms
[JENKINS] Archiving F:\jenkins\jenkins-slave\workspace\myfaces-current12\current12\core\pom.xml to org.apache.myfaces.core/myfaces-core-project/1.2.13-SNAPSHOT/myfaces-core-project-1.2.13-SNAPSHOT.pom
[JENKINS] Archiving F:\jenkins\jenkins-slave\workspace\myfaces-current12\current12\core\target\myfaces-core-project-1.2.13-SNAPSHOT-site.xml to org.apache.myfaces.core/myfaces-core-project/1.2.13-SNAPSHOT/myfaces-core-project-1.2.13-SNAPSHOT-site.xml
Sending artifact delta relative to myfaces-current12 » Apache MyFaces JSF-1.2 Core Project #1175
Archived 2 artifacts
Archive block size is 32768
Received 0 blocks and 24305 bytes
Compression is 0.0%
Took 52 ms
[JENKINS] Archiving <https://builds.apache.org/job/myfaces-current12/ws/current12\pom.xml> to org.apache.myfaces/myfaces-base/1.2.10-SNAPSHOT/myfaces-base-1.2.10-SNAPSHOT.pom
Sending artifact delta relative to myfaces-current12 » Build Project #1175
Archived 1 artifacts
Archive block size is 32768
Received 0 blocks and 1228 bytes
Compression is 0.0%
Took 28 ms
channel stopped
Maven RedeployPublisher use remote windows2 maven settings from : f:\jenkins\tools\maven\latest/conf/settings.xml
[ERROR] uniqueVersion == false is not anymore supported in maven 3
[INFO] Deployment in https://repository.apache.org/content/repositories/snapshots (id=apache.snapshots.https,uniqueVersion=false)
Deploying the main artifact myfaces-base-1.2.10-SNAPSHOT.pom
Downloading: https://repository.apache.org/content/repositories/snapshots/org/apache/myfaces/myfaces-base/1.2.10-SNAPSHOT/maven-metadata.xml
Downloaded: https://repository.apache.org/content/repositories/snapshots/org/apache/myfaces/myfaces-base/1.2.10-SNAPSHOT/maven-metadata.xml (613 B at 0.3 KB/sec)
Uploading: https://repository.apache.org/content/repositories/snapshots/org/apache/myfaces/myfaces-base/1.2.10-SNAPSHOT/myfaces-base-1.2.10-20140609.181539-556.pom
ERROR: Failed to deploy artifacts: Could not transfer artifact org.apache.myfaces:myfaces-base:pom:1.2.10-20140609.181539-556 from/to apache.snapshots.https (https://repository.apache.org/content/repositories/snapshots): Failed to transfer file: https://repository.apache.org/content/repositories/snapshots/org/apache/myfaces/myfaces-base/1.2.10-SNAPSHOT/myfaces-base-1.2.10-20140609.181539-556.pom. Return code is: 401, ReasonPhrase: Unauthorized.
org.apache.maven.artifact.deployer.ArtifactDeploymentException: Failed to deploy artifacts: Could not transfer artifact org.apache.myfaces:myfaces-base:pom:1.2.10-20140609.181539-556 from/to apache.snapshots.https (https://repository.apache.org/content/repositories/snapshots): Failed to transfer file: https://repository.apache.org/content/repositories/snapshots/org/apache/myfaces/myfaces-base/1.2.10-SNAPSHOT/myfaces-base-1.2.10-20140609.181539-556.pom. Return code is: 401, ReasonPhrase: Unauthorized.
at org.apache.maven.artifact.deployer.DefaultArtifactDeployer.deploy(DefaultArtifactDeployer.java:143)
at hudson.maven.reporters.MavenArtifactRecord.deploy(MavenArtifactRecord.java:193)
at hudson.maven.RedeployPublisher.perform(RedeployPublisher.java:176)
at hudson.tasks.BuildStepMonitor$1.perform(BuildStepMonitor.java:20)
at hudson.model.AbstractBuild$AbstractBuildExecution.perform(AbstractBuild.java:804)
at hudson.model.AbstractBuild$AbstractBuildExecution.performAllBuildSteps(AbstractBuild.java:776)
at hudson.maven.MavenModuleSetBuild$MavenModuleSetBuildExecution.post2(MavenModuleSetBuild.java:1040)
at hudson.model.AbstractBuild$AbstractBuildExecution.post(AbstractBuild.java:725)
at hudson.model.Run.execute(Run.java:1701)
at hudson.maven.MavenModuleSetBuild.run(MavenModuleSetBuild.java:529)
at hudson.model.ResourceController.execute(ResourceController.java:88)
at hudson.model.Executor.run(Executor.java:231)
Caused by: org.eclipse.aether.deployment.DeploymentException: Failed to deploy artifacts: Could not transfer artifact org.apache.myfaces:myfaces-base:pom:1.2.10-20140609.181539-556 from/to apache.snapshots.https (https://repository.apache.org/content/repositories/snapshots): Failed to transfer file: https://repository.apache.org/content/repositories/snapshots/org/apache/myfaces/myfaces-base/1.2.10-SNAPSHOT/myfaces-base-1.2.10-20140609.181539-556.pom. Return code is: 401, ReasonPhrase: Unauthorized.
at org.eclipse.aether.internal.impl.DefaultDeployer.deploy(DefaultDeployer.java:341)
at org.eclipse.aether.internal.impl.DefaultDeployer.deploy(DefaultDeployer.java:269)
at org.eclipse.aether.internal.impl.DefaultRepositorySystem.deploy(DefaultRepositorySystem.java:413)
at org.apache.maven.artifact.deployer.DefaultArtifactDeployer.deploy(DefaultArtifactDeployer.java:139)
... 11 more
Caused by: org.eclipse.aether.transfer.ArtifactTransferException: Could not transfer artifact org.apache.myfaces:myfaces-base:pom:1.2.10-20140609.181539-556 from/to apache.snapshots.https (https://repository.apache.org/content/repositories/snapshots): Failed to transfer file: https://repository.apache.org/content/repositories/snapshots/org/apache/myfaces/myfaces-base/1.2.10-SNAPSHOT/myfaces-base-1.2.10-20140609.181539-556.pom. Return code is: 401, ReasonPhrase: Unauthorized.
at org.eclipse.aether.connector.wagon.WagonRepositoryConnector$6.wrap(WagonRepositoryConnector.java:1016)
at org.eclipse.aether.connector.wagon.WagonRepositoryConnector$6.wrap(WagonRepositoryConnector.java:1004)
at org.eclipse.aether.connector.wagon.WagonRepositoryConnector$PutTask.run(WagonRepositoryConnector.java:895)
at org.eclipse.aether.connector.wagon.WagonRepositoryConnector.put(WagonRepositoryConnector.java:522)
at org.eclipse.aether.internal.impl.DefaultDeployer.deploy(DefaultDeployer.java:335)
... 14 more
Caused by: org.apache.maven.wagon.TransferFailedException: Failed to transfer file: https://repository.apache.org/content/repositories/snapshots/org/apache/myfaces/myfaces-base/1.2.10-SNAPSHOT/myfaces-base-1.2.10-20140609.181539-556.pom. Return code is: 401, ReasonPhrase: Unauthorized.
at org.apache.maven.wagon.shared.http4.AbstractHttpClientWagon.put(AbstractHttpClientWagon.java:626)
at org.apache.maven.wagon.shared.http4.AbstractHttpClientWagon.put(AbstractHttpClientWagon.java:524)
at org.apache.maven.wagon.shared.http4.AbstractHttpClientWagon.put(AbstractHttpClientWagon.java:505)
at org.apache.maven.wagon.shared.http4.AbstractHttpClientWagon.put(AbstractHttpClientWagon.java:485)
at org.eclipse.aether.connector.wagon.WagonRepositoryConnector$PutTask.run(WagonRepositoryConnector.java:871)
... 16 more
[INFO] Deployment failed after 3.1 sec
Build step 'Deploy artifacts to Maven repository' changed build result to FAILURE
Jenkins build is back to normal : myfaces-current12 #1183
Posted by Apache Jenkins Server <je...@builds.apache.org>.
See <https://builds.apache.org/job/myfaces-current12/1183/>
Build failed in Jenkins: myfaces-current12 #1182
Posted by Apache Jenkins Server <je...@builds.apache.org>.
See <https://builds.apache.org/job/myfaces-current12/1182/>
------------------------------------------
[...truncated 1572 lines...]
[INFO] --- myfaces-builder-plugin:1.0.8:build-metadata (makemyfacesmetadata) @ myfaces-impl ---
Artifact: myfaces-api-1.2.13-SNAPSHOT.jar have META-INF/myfaces-metadata.xml
[INFO]
[INFO] --- myfaces-builder-plugin:1.0.8:make-config (makefacesconfig) @ myfaces-impl ---
[WARNING] *******************************************************************
[WARNING] RuntimeInstance initializing.
[WARNING] Default ResourceManager initializing. (class org.apache.velocity.runtime.resource.ResourceManagerImpl)
[WARNING] FileResourceLoader : initialization starting.
[WARNING] FileResourceLoader : initialization complete.
[WARNING] RelativeClasspathResourceLoader : initialization complete.
[INFO] RelativeClasspathResourceLoader : adding path 'META-INF'
[WARNING] RelativeClasspathResourceLoader : initialization complete.
[WARNING] Default ResourceManager initialization complete.
[WARNING] Velocimacro : initialization starting.
[WARNING] Velocimacro : VM library registration complete.
[WARNING] Velocimacro : Velocimacro : initialization complete.
[WARNING] RuntimeInstance successfully initialized.
[INFO] using base content file: F:\jenkins\jenkins-slave\workspace\myfaces-current12\current12\core\impl\src\main\conf\META-INF\standard-faces-config-base.xml
[INFO]
[INFO] --- myfaces-builder-plugin:1.0.8:make-tags (make_tags) @ myfaces-impl ---
[INFO] Using template from file loader: F:\jenkins\jenkins-slave\workspace\myfaces-current12\current12\core\impl\src\main\resources\META-INF\tagClass12.vm
[WARNING] *******************************************************************
[WARNING] RuntimeInstance initializing.
[WARNING] Default ResourceManager initializing. (class org.apache.velocity.runtime.resource.ResourceManagerImpl)
[WARNING] FileResourceLoader : initialization starting.
[WARNING] FileResourceLoader : initialization complete.
[WARNING] RelativeClasspathResourceLoader : initialization complete.
[INFO] RelativeClasspathResourceLoader : adding path 'META-INF'
[WARNING] RelativeClasspathResourceLoader : initialization complete.
[WARNING] Default ResourceManager initialization complete.
[WARNING] Velocimacro : initialization starting.
[WARNING] Velocimacro : VM library registration complete.
[WARNING] Velocimacro : Velocimacro : initialization complete.
[WARNING] RuntimeInstance successfully initialized.
[INFO] Generating tag class:org.apache.myfaces.taglib.html.HtmlInputHiddenTag
[INFO] Generating tag class:org.apache.myfaces.taglib.html.HtmlColumnTag
[INFO] Generating tag class:org.apache.myfaces.taglib.html.HtmlCommandButtonTag
[INFO] Generating tag class:org.apache.myfaces.taglib.html.HtmlCommandLinkTag
[INFO] Generating tag class:org.apache.myfaces.taglib.html.HtmlDataTableTag
[INFO] Generating tag class:org.apache.myfaces.taglib.html.HtmlFormTag
[INFO] Generating tag class:org.apache.myfaces.taglib.html.HtmlGraphicImageTag
[INFO] Generating tag class:org.apache.myfaces.taglib.html.HtmlInputSecretTag
[INFO] Generating tag class:org.apache.myfaces.taglib.html.HtmlInputTextTag
[INFO] Generating tag class:org.apache.myfaces.taglib.html.HtmlInputTextareaTag
[INFO] Generating tag class:org.apache.myfaces.taglib.html.HtmlMessageTag
[INFO] Generating tag class:org.apache.myfaces.taglib.html.HtmlMessagesTag
[INFO] Generating tag class:org.apache.myfaces.taglib.html.HtmlOutputFormatTag
[INFO] Generating tag class:org.apache.myfaces.taglib.html.HtmlOutputLabelTag
[INFO] Generating tag class:org.apache.myfaces.taglib.html.HtmlOutputLinkTag
[INFO] Generating tag class:org.apache.myfaces.taglib.html.HtmlOutputTextTag
[INFO] Generating tag class:org.apache.myfaces.taglib.html.HtmlPanelGridTag
[INFO] Generating tag class:org.apache.myfaces.taglib.html.HtmlPanelGroupTag
[INFO] Generating tag class:org.apache.myfaces.taglib.html.HtmlSelectBooleanCheckboxTag
[INFO] Generating tag class:org.apache.myfaces.taglib.html.HtmlSelectManyCheckboxTag
[INFO] Generating tag class:org.apache.myfaces.taglib.html.HtmlSelectManyListboxTag
[INFO] Generating tag class:org.apache.myfaces.taglib.html.HtmlSelectManyMenuTag
[INFO] Generating tag class:org.apache.myfaces.taglib.html.HtmlSelectOneListboxTag
[INFO] Generating tag class:org.apache.myfaces.taglib.html.HtmlSelectOneMenuTag
[INFO] Generating tag class:org.apache.myfaces.taglib.html.HtmlSelectOneRadioTag
[INFO]
[INFO] --- myfaces-builder-plugin:1.0.8:make-config (makecoretld) @ myfaces-impl ---
[WARNING] *******************************************************************
[WARNING] RuntimeInstance initializing.
[WARNING] Default ResourceManager initializing. (class org.apache.velocity.runtime.resource.ResourceManagerImpl)
[WARNING] FileResourceLoader : initialization starting.
[WARNING] FileResourceLoader : initialization complete.
[WARNING] RelativeClasspathResourceLoader : initialization complete.
[INFO] RelativeClasspathResourceLoader : adding path 'META-INF'
[WARNING] RelativeClasspathResourceLoader : initialization complete.
[WARNING] Default ResourceManager initialization complete.
[WARNING] Velocimacro : initialization starting.
[WARNING] Velocimacro : VM library registration complete.
[WARNING] Velocimacro : Velocimacro : initialization complete.
[WARNING] RuntimeInstance successfully initialized.
[INFO] using base content file: F:\jenkins\jenkins-slave\workspace\myfaces-current12\current12\core\impl\src\main\conf\META-INF\myfaces_core-base.tld
[INFO]
[INFO] --- myfaces-builder-plugin:1.0.8:make-config (makehtmltld) @ myfaces-impl ---
[WARNING] *******************************************************************
[WARNING] RuntimeInstance initializing.
[WARNING] Default ResourceManager initializing. (class org.apache.velocity.runtime.resource.ResourceManagerImpl)
[WARNING] FileResourceLoader : initialization starting.
[WARNING] FileResourceLoader : initialization complete.
[WARNING] RelativeClasspathResourceLoader : initialization complete.
[INFO] RelativeClasspathResourceLoader : adding path 'META-INF'
[WARNING] RelativeClasspathResourceLoader : initialization complete.
[WARNING] Default ResourceManager initialization complete.
[WARNING] Velocimacro : initialization starting.
[WARNING] Velocimacro : VM library registration complete.
[WARNING] Velocimacro : Velocimacro : initialization complete.
[WARNING] RuntimeInstance successfully initialized.
[INFO] using base content file: F:\jenkins\jenkins-slave\workspace\myfaces-current12\current12\core\impl\src\main\conf\META-INF\myfaces_html-base.tld
[WARNING] Failed to getClass for org.apache.maven.plugin.source.SourceJarMojo
[INFO]
[INFO] <<< maven-source-plugin:2.0.4:jar (attach-source) @ myfaces-impl <<<
[INFO]
[INFO] --- maven-source-plugin:2.0.4:jar (attach-source) @ myfaces-impl ---
[INFO] Building jar: F:\jenkins\jenkins-slave\workspace\myfaces-current12\current12\core\impl\target\myfaces-impl-1.2.13-SNAPSHOT-sources.jar
[INFO]
[INFO] --- maven-checkstyle-plugin:2.6:check (verify-style) @ myfaces-impl ---
[INFO]
[INFO]
[INFO] --- maven-install-plugin:2.3.1:install (default-install) @ myfaces-impl ---
[INFO] Installing F:\jenkins\jenkins-slave\workspace\myfaces-current12\current12\core\impl\target\myfaces-impl-1.2.13-SNAPSHOT.jar to f:\jenkins\jenkins-slave\maven-repositories\0\org\apache\myfaces\core\myfaces-impl\1.2.13-SNAPSHOT\myfaces-impl-1.2.13-SNAPSHOT.jar
[INFO] Installing F:\jenkins\jenkins-slave\workspace\myfaces-current12\current12\core\impl\pom.xml to f:\jenkins\jenkins-slave\maven-repositories\0\org\apache\myfaces\core\myfaces-impl\1.2.13-SNAPSHOT\myfaces-impl-1.2.13-SNAPSHOT.pom
[INFO] Installing F:\jenkins\jenkins-slave\workspace\myfaces-current12\current12\core\impl\target\myfaces-impl-1.2.13-SNAPSHOT-sources.jar to f:\jenkins\jenkins-slave\maven-repositories\0\org\apache\myfaces\core\myfaces-impl\1.2.13-SNAPSHOT\myfaces-impl-1.2.13-SNAPSHOT-sources.jar
[INFO]
[INFO] ------------------------------------------------------------------------
[INFO] Building Build Project 1.2.10-SNAPSHOT
[INFO] ------------------------------------------------------------------------
[INFO]
[INFO] --- maven-remote-resources-plugin:1.1:process (default) @ myfaces-base ---
[INFO] Setting property: classpath.resource.loader.class => 'org.codehaus.plexus.velocity.ContextClassLoaderResourceLoader'.
[INFO] Setting property: velocimacro.messages.on => 'false'.
[INFO] Setting property: resource.loader => 'classpath'.
[INFO] Setting property: resource.manager.logwhenfound => 'false'.
[INFO]
[INFO] --- maven-install-plugin:2.3:install (default-install) @ myfaces-base ---
[INFO] Installing <https://builds.apache.org/job/myfaces-current12/ws/current12\pom.xml> to f:\jenkins\jenkins-slave\maven-repositories\0\org\apache\myfaces\myfaces-base\1.2.10-SNAPSHOT\myfaces-base-1.2.10-SNAPSHOT.pom
[INFO] ------------------------------------------------------------------------
[INFO] Reactor Summary:
[INFO]
[INFO] Apache MyFaces Shared For JSF 1.2 - Project ....... SUCCESS [20.367s]
[INFO] Apache MyFaces Shared For JSF 1.2 - Core .......... SUCCESS [24.093s]
[INFO] MyFaces Shared Impl ............................... SUCCESS [15.536s]
[INFO] MyFaces Shared Tomahawk ........................... SUCCESS [11.787s]
[INFO] Apache MyFaces JSF-1.2 Core Project ............... SUCCESS [5.609s]
[INFO] Apache Myfaces JSF Core-1.2 API ................... SUCCESS [36.729s]
[INFO] Apache MyFaces JSF-1.2 Core Impl .................. SUCCESS [31.779s]
[INFO] Build Project ..................................... SUCCESS [3.006s]
[INFO] ------------------------------------------------------------------------
[INFO] BUILD SUCCESS
[INFO] ------------------------------------------------------------------------
[INFO] Total time: 2:33.840s
[INFO] Finished at: Tue Jun 10 14:30:03 PDT 2014
[INFO] Final Memory: 57M/136M
[INFO] ------------------------------------------------------------------------
[JENKINS] Archiving F:\jenkins\jenkins-slave\workspace\myfaces-current12\current12\shared\shared-tomahawk\pom.xml to org.apache.myfaces.shared/myfaces-shared-tomahawk/3.0.13-SNAPSHOT/myfaces-shared-tomahawk-3.0.13-SNAPSHOT.pom
[JENKINS] Archiving F:\jenkins\jenkins-slave\workspace\myfaces-current12\current12\shared\shared-tomahawk\target\myfaces-shared-tomahawk-3.0.13-SNAPSHOT.jar to org.apache.myfaces.shared/myfaces-shared-tomahawk/3.0.13-SNAPSHOT/myfaces-shared-tomahawk-3.0.13-SNAPSHOT.jar
[JENKINS] Archiving F:\jenkins\jenkins-slave\workspace\myfaces-current12\current12\shared\shared-tomahawk\target\myfaces-shared-tomahawk-3.0.13-SNAPSHOT-sources.jar to org.apache.myfaces.shared/myfaces-shared-tomahawk/3.0.13-SNAPSHOT/myfaces-shared-tomahawk-3.0.13-SNAPSHOT-sources.jar
Sending artifact delta relative to myfaces-current12 » MyFaces Shared Tomahawk #1181
Archived 3 artifacts
Archive block size is 32768
Received 0 blocks and 564372 bytes
Compression is 0.0%
Took 0.22 sec
[JENKINS] Archiving F:\jenkins\jenkins-slave\workspace\myfaces-current12\current12\core\impl\pom.xml to org.apache.myfaces.core/myfaces-impl/1.2.13-SNAPSHOT/myfaces-impl-1.2.13-SNAPSHOT.pom
[JENKINS] Archiving F:\jenkins\jenkins-slave\workspace\myfaces-current12\current12\core\impl\target\myfaces-impl-1.2.13-SNAPSHOT.jar to org.apache.myfaces.core/myfaces-impl/1.2.13-SNAPSHOT/myfaces-impl-1.2.13-SNAPSHOT.jar
[JENKINS] Archiving F:\jenkins\jenkins-slave\workspace\myfaces-current12\current12\core\impl\target\myfaces-impl-1.2.13-SNAPSHOT-sources.jar to org.apache.myfaces.core/myfaces-impl/1.2.13-SNAPSHOT/myfaces-impl-1.2.13-SNAPSHOT-sources.jar
Sending artifact delta relative to myfaces-current12 » Apache MyFaces JSF-1.2 Core Impl #1181
Archived 3 artifacts
Archive block size is 32768
Received 33 blocks and 530467 bytes
Compression is 67.1%
Took 0.21 sec
[JENKINS] Archiving F:\jenkins\jenkins-slave\workspace\myfaces-current12\current12\shared\shared-impl\pom.xml to org.apache.myfaces.shared/myfaces-shared-impl/3.0.13-SNAPSHOT/myfaces-shared-impl-3.0.13-SNAPSHOT.pom
[JENKINS] Archiving F:\jenkins\jenkins-slave\workspace\myfaces-current12\current12\shared\shared-impl\target\myfaces-shared-impl-3.0.13-SNAPSHOT.jar to org.apache.myfaces.shared/myfaces-shared-impl/3.0.13-SNAPSHOT/myfaces-shared-impl-3.0.13-SNAPSHOT.jar
[JENKINS] Archiving F:\jenkins\jenkins-slave\workspace\myfaces-current12\current12\shared\shared-impl\target\myfaces-shared-impl-3.0.13-SNAPSHOT-sources.jar to org.apache.myfaces.shared/myfaces-shared-impl/3.0.13-SNAPSHOT/myfaces-shared-impl-3.0.13-SNAPSHOT-sources.jar
Sending artifact delta relative to myfaces-current12 » MyFaces Shared Impl #1181
Archived 3 artifacts
Archive block size is 32768
Received 0 blocks and 560561 bytes
Compression is 0.0%
Took 1.8 sec
[JENKINS] Archiving F:\jenkins\jenkins-slave\workspace\myfaces-current12\current12\shared\core\pom.xml to org.apache.myfaces.shared/myfaces-shared-core/3.0.13-SNAPSHOT/myfaces-shared-core-3.0.13-SNAPSHOT.pom
[JENKINS] Archiving F:\jenkins\jenkins-slave\workspace\myfaces-current12\current12\shared\core\target\myfaces-shared-core-3.0.13-SNAPSHOT.jar to org.apache.myfaces.shared/myfaces-shared-core/3.0.13-SNAPSHOT/myfaces-shared-core-3.0.13-SNAPSHOT.jar
[JENKINS] Archiving F:\jenkins\jenkins-slave\workspace\myfaces-current12\current12\shared\core\target\myfaces-shared-core-3.0.13-SNAPSHOT-sources.jar to org.apache.myfaces.shared/myfaces-shared-core/3.0.13-SNAPSHOT/myfaces-shared-core-3.0.13-SNAPSHOT-sources.jar
Sending artifact delta relative to myfaces-current12 » Apache MyFaces Shared For JSF 1.2 - Core #1181
Archived 3 artifacts
Archive block size is 32768
Received 14 blocks and 104977 bytes
Compression is 81.4%
Took 0.1 sec
[JENKINS] Archiving F:\jenkins\jenkins-slave\workspace\myfaces-current12\current12\core\api\pom.xml to org.apache.myfaces.core/myfaces-api/1.2.13-SNAPSHOT/myfaces-api-1.2.13-SNAPSHOT.pom
[JENKINS] Archiving F:\jenkins\jenkins-slave\workspace\myfaces-current12\current12\core\api\target\myfaces-api-1.2.13-SNAPSHOT.jar to org.apache.myfaces.core/myfaces-api/1.2.13-SNAPSHOT/myfaces-api-1.2.13-SNAPSHOT.jar
[JENKINS] Archiving F:\jenkins\jenkins-slave\workspace\myfaces-current12\current12\core\api\target\myfaces-api-1.2.13-SNAPSHOT-sources.jar to org.apache.myfaces.core/myfaces-api/1.2.13-SNAPSHOT/myfaces-api-1.2.13-SNAPSHOT-sources.jar
[JENKINS] Archiving F:\jenkins\jenkins-slave\workspace\myfaces-current12\current12\core\api\target\myfaces-api-1.2.13-SNAPSHOT-tests.jar to org.apache.myfaces.core/myfaces-api/1.2.13-SNAPSHOT/myfaces-api-1.2.13-SNAPSHOT-tests.jar
Sending artifact delta relative to myfaces-current12 » Apache Myfaces JSF Core-1.2 API #1181
Archived 4 artifacts
Archive block size is 32768
Received 15 blocks and 525395 bytes
Compression is 48.3%
Took 0.31 sec
[JENKINS] Archiving F:\jenkins\jenkins-slave\workspace\myfaces-current12\current12\shared\pom.xml to org.apache.myfaces.shared/myfaces-shared-project/3.0.13-SNAPSHOT/myfaces-shared-project-3.0.13-SNAPSHOT.pom
[JENKINS] Archiving F:\jenkins\jenkins-slave\workspace\myfaces-current12\current12\shared\target\myfaces-shared-project-3.0.13-SNAPSHOT-site.xml to org.apache.myfaces.shared/myfaces-shared-project/3.0.13-SNAPSHOT/myfaces-shared-project-3.0.13-SNAPSHOT-site.xml
Sending artifact delta relative to myfaces-current12 » Apache MyFaces Shared For JSF 1.2 - Project #1181
Archived 2 artifacts
Archive block size is 32768
Received 0 blocks and 10524 bytes
Compression is 0.0%
Took 67 ms
[JENKINS] Archiving F:\jenkins\jenkins-slave\workspace\myfaces-current12\current12\core\pom.xml to org.apache.myfaces.core/myfaces-core-project/1.2.13-SNAPSHOT/myfaces-core-project-1.2.13-SNAPSHOT.pom
[JENKINS] Archiving F:\jenkins\jenkins-slave\workspace\myfaces-current12\current12\core\target\myfaces-core-project-1.2.13-SNAPSHOT-site.xml to org.apache.myfaces.core/myfaces-core-project/1.2.13-SNAPSHOT/myfaces-core-project-1.2.13-SNAPSHOT-site.xml
Sending artifact delta relative to myfaces-current12 » Apache MyFaces JSF-1.2 Core Project #1181
Archived 2 artifacts
Archive block size is 32768
Received 0 blocks and 24305 bytes
Compression is 0.0%
Took 16 ms
[JENKINS] Archiving <https://builds.apache.org/job/myfaces-current12/ws/current12\pom.xml> to org.apache.myfaces/myfaces-base/1.2.10-SNAPSHOT/myfaces-base-1.2.10-SNAPSHOT.pom
Sending artifact delta relative to myfaces-current12 » Build Project #1181
Archived 1 artifacts
Archive block size is 32768
Received 0 blocks and 1228 bytes
Compression is 0.0%
Took 8 ms
channel stopped
Maven RedeployPublisher use remote windows2 maven settings from : f:\jenkins\tools\maven\latest/conf/settings.xml
[ERROR] uniqueVersion == false is not anymore supported in maven 3
[INFO] Deployment in https://repository.apache.org/content/repositories/snapshots (id=apache.snapshots.https,uniqueVersion=false)
Deploying the main artifact myfaces-base-1.2.10-SNAPSHOT.pom
Downloading: https://repository.apache.org/content/repositories/snapshots/org/apache/myfaces/myfaces-base/1.2.10-SNAPSHOT/maven-metadata.xml
Downloaded: https://repository.apache.org/content/repositories/snapshots/org/apache/myfaces/myfaces-base/1.2.10-SNAPSHOT/maven-metadata.xml (613 B at 2.3 KB/sec)
Uploading: https://repository.apache.org/content/repositories/snapshots/org/apache/myfaces/myfaces-base/1.2.10-SNAPSHOT/myfaces-base-1.2.10-20140610.213013-556.pom
ERROR: Failed to deploy artifacts: Could not transfer artifact org.apache.myfaces:myfaces-base:pom:1.2.10-20140610.213013-556 from/to apache.snapshots.https (https://repository.apache.org/content/repositories/snapshots): Failed to transfer file: https://repository.apache.org/content/repositories/snapshots/org/apache/myfaces/myfaces-base/1.2.10-SNAPSHOT/myfaces-base-1.2.10-20140610.213013-556.pom. Return code is: 401, ReasonPhrase: Unauthorized.
org.apache.maven.artifact.deployer.ArtifactDeploymentException: Failed to deploy artifacts: Could not transfer artifact org.apache.myfaces:myfaces-base:pom:1.2.10-20140610.213013-556 from/to apache.snapshots.https (https://repository.apache.org/content/repositories/snapshots): Failed to transfer file: https://repository.apache.org/content/repositories/snapshots/org/apache/myfaces/myfaces-base/1.2.10-SNAPSHOT/myfaces-base-1.2.10-20140610.213013-556.pom. Return code is: 401, ReasonPhrase: Unauthorized.
at org.apache.maven.artifact.deployer.DefaultArtifactDeployer.deploy(DefaultArtifactDeployer.java:143)
at hudson.maven.reporters.MavenArtifactRecord.deploy(MavenArtifactRecord.java:193)
at hudson.maven.RedeployPublisher.perform(RedeployPublisher.java:176)
at hudson.tasks.BuildStepMonitor$1.perform(BuildStepMonitor.java:20)
at hudson.model.AbstractBuild$AbstractBuildExecution.perform(AbstractBuild.java:804)
at hudson.model.AbstractBuild$AbstractBuildExecution.performAllBuildSteps(AbstractBuild.java:776)
at hudson.maven.MavenModuleSetBuild$MavenModuleSetBuildExecution.post2(MavenModuleSetBuild.java:1040)
at hudson.model.AbstractBuild$AbstractBuildExecution.post(AbstractBuild.java:725)
at hudson.model.Run.execute(Run.java:1701)
at hudson.maven.MavenModuleSetBuild.run(MavenModuleSetBuild.java:529)
at hudson.model.ResourceController.execute(ResourceController.java:88)
at hudson.model.Executor.run(Executor.java:231)
Caused by: org.eclipse.aether.deployment.DeploymentException: Failed to deploy artifacts: Could not transfer artifact org.apache.myfaces:myfaces-base:pom:1.2.10-20140610.213013-556 from/to apache.snapshots.https (https://repository.apache.org/content/repositories/snapshots): Failed to transfer file: https://repository.apache.org/content/repositories/snapshots/org/apache/myfaces/myfaces-base/1.2.10-SNAPSHOT/myfaces-base-1.2.10-20140610.213013-556.pom. Return code is: 401, ReasonPhrase: Unauthorized.
at org.eclipse.aether.internal.impl.DefaultDeployer.deploy(DefaultDeployer.java:341)
at org.eclipse.aether.internal.impl.DefaultDeployer.deploy(DefaultDeployer.java:269)
at org.eclipse.aether.internal.impl.DefaultRepositorySystem.deploy(DefaultRepositorySystem.java:413)
at org.apache.maven.artifact.deployer.DefaultArtifactDeployer.deploy(DefaultArtifactDeployer.java:139)
... 11 more
Caused by: org.eclipse.aether.transfer.ArtifactTransferException: Could not transfer artifact org.apache.myfaces:myfaces-base:pom:1.2.10-20140610.213013-556 from/to apache.snapshots.https (https://repository.apache.org/content/repositories/snapshots): Failed to transfer file: https://repository.apache.org/content/repositories/snapshots/org/apache/myfaces/myfaces-base/1.2.10-SNAPSHOT/myfaces-base-1.2.10-20140610.213013-556.pom. Return code is: 401, ReasonPhrase: Unauthorized.
at org.eclipse.aether.connector.wagon.WagonRepositoryConnector$6.wrap(WagonRepositoryConnector.java:1016)
at org.eclipse.aether.connector.wagon.WagonRepositoryConnector$6.wrap(WagonRepositoryConnector.java:1004)
at org.eclipse.aether.connector.wagon.WagonRepositoryConnector$PutTask.run(WagonRepositoryConnector.java:895)
at org.eclipse.aether.connector.wagon.WagonRepositoryConnector.put(WagonRepositoryConnector.java:522)
at org.eclipse.aether.internal.impl.DefaultDeployer.deploy(DefaultDeployer.java:335)
... 14 more
Caused by: org.apache.maven.wagon.TransferFailedException: Failed to transfer file: https://repository.apache.org/content/repositories/snapshots/org/apache/myfaces/myfaces-base/1.2.10-SNAPSHOT/myfaces-base-1.2.10-20140610.213013-556.pom. Return code is: 401, ReasonPhrase: Unauthorized.
at org.apache.maven.wagon.shared.http4.AbstractHttpClientWagon.put(AbstractHttpClientWagon.java:626)
at org.apache.maven.wagon.shared.http4.AbstractHttpClientWagon.put(AbstractHttpClientWagon.java:524)
at org.apache.maven.wagon.shared.http4.AbstractHttpClientWagon.put(AbstractHttpClientWagon.java:505)
at org.apache.maven.wagon.shared.http4.AbstractHttpClientWagon.put(AbstractHttpClientWagon.java:485)
at org.eclipse.aether.connector.wagon.WagonRepositoryConnector$PutTask.run(WagonRepositoryConnector.java:871)
... 16 more
[INFO] Deployment failed after 2.3 sec
Build step 'Deploy artifacts to Maven repository' changed build result to FAILURE
Build failed in Jenkins: myfaces-current12 #1181
Posted by Apache Jenkins Server <je...@builds.apache.org>.
See <https://builds.apache.org/job/myfaces-current12/1181/>
------------------------------------------
[...truncated 1567 lines...]
Artifact: myfaces-api-1.2.13-SNAPSHOT.jar have META-INF/myfaces-metadata.xml
[INFO]
[INFO] --- myfaces-builder-plugin:1.0.8:make-config (makefacesconfig) @ myfaces-impl ---
[WARNING] *******************************************************************
[WARNING] RuntimeInstance initializing.
[WARNING] Default ResourceManager initializing. (class org.apache.velocity.runtime.resource.ResourceManagerImpl)
[WARNING] FileResourceLoader : initialization starting.
[WARNING] FileResourceLoader : initialization complete.
[WARNING] RelativeClasspathResourceLoader : initialization complete.
[INFO] RelativeClasspathResourceLoader : adding path 'META-INF'
[WARNING] RelativeClasspathResourceLoader : initialization complete.
[WARNING] Default ResourceManager initialization complete.
[WARNING] Velocimacro : initialization starting.
[WARNING] Velocimacro : VM library registration complete.
[WARNING] Velocimacro : Velocimacro : initialization complete.
[WARNING] RuntimeInstance successfully initialized.
[INFO] using base content file: F:\jenkins\jenkins-slave\workspace\myfaces-current12\current12\core\impl\src\main\conf\META-INF\standard-faces-config-base.xml
[INFO]
[INFO] --- myfaces-builder-plugin:1.0.8:make-tags (make_tags) @ myfaces-impl ---
[INFO] Using template from file loader: F:\jenkins\jenkins-slave\workspace\myfaces-current12\current12\core\impl\src\main\resources\META-INF\tagClass12.vm
[WARNING] *******************************************************************
[WARNING] RuntimeInstance initializing.
[WARNING] Default ResourceManager initializing. (class org.apache.velocity.runtime.resource.ResourceManagerImpl)
[WARNING] FileResourceLoader : initialization starting.
[WARNING] FileResourceLoader : initialization complete.
[WARNING] RelativeClasspathResourceLoader : initialization complete.
[INFO] RelativeClasspathResourceLoader : adding path 'META-INF'
[WARNING] RelativeClasspathResourceLoader : initialization complete.
[WARNING] Default ResourceManager initialization complete.
[WARNING] Velocimacro : initialization starting.
[WARNING] Velocimacro : VM library registration complete.
[WARNING] Velocimacro : Velocimacro : initialization complete.
[WARNING] RuntimeInstance successfully initialized.
[INFO] Generating tag class:org.apache.myfaces.taglib.html.HtmlInputHiddenTag
[INFO] Generating tag class:org.apache.myfaces.taglib.html.HtmlColumnTag
[INFO] Generating tag class:org.apache.myfaces.taglib.html.HtmlCommandButtonTag
[INFO] Generating tag class:org.apache.myfaces.taglib.html.HtmlCommandLinkTag
[INFO] Generating tag class:org.apache.myfaces.taglib.html.HtmlDataTableTag
[INFO] Generating tag class:org.apache.myfaces.taglib.html.HtmlFormTag
[INFO] Generating tag class:org.apache.myfaces.taglib.html.HtmlGraphicImageTag
[INFO] Generating tag class:org.apache.myfaces.taglib.html.HtmlInputSecretTag
[INFO] Generating tag class:org.apache.myfaces.taglib.html.HtmlInputTextTag
[INFO] Generating tag class:org.apache.myfaces.taglib.html.HtmlInputTextareaTag
[INFO] Generating tag class:org.apache.myfaces.taglib.html.HtmlMessageTag
[INFO] Generating tag class:org.apache.myfaces.taglib.html.HtmlMessagesTag
[INFO] Generating tag class:org.apache.myfaces.taglib.html.HtmlOutputFormatTag
[INFO] Generating tag class:org.apache.myfaces.taglib.html.HtmlOutputLabelTag
[INFO] Generating tag class:org.apache.myfaces.taglib.html.HtmlOutputLinkTag
[INFO] Generating tag class:org.apache.myfaces.taglib.html.HtmlOutputTextTag
[INFO] Generating tag class:org.apache.myfaces.taglib.html.HtmlPanelGridTag
[INFO] Generating tag class:org.apache.myfaces.taglib.html.HtmlPanelGroupTag
[INFO] Generating tag class:org.apache.myfaces.taglib.html.HtmlSelectBooleanCheckboxTag
[INFO] Generating tag class:org.apache.myfaces.taglib.html.HtmlSelectManyCheckboxTag
[INFO] Generating tag class:org.apache.myfaces.taglib.html.HtmlSelectManyListboxTag
[INFO] Generating tag class:org.apache.myfaces.taglib.html.HtmlSelectManyMenuTag
[INFO] Generating tag class:org.apache.myfaces.taglib.html.HtmlSelectOneListboxTag
[INFO] Generating tag class:org.apache.myfaces.taglib.html.HtmlSelectOneMenuTag
[INFO] Generating tag class:org.apache.myfaces.taglib.html.HtmlSelectOneRadioTag
[INFO]
[INFO] --- myfaces-builder-plugin:1.0.8:make-config (makecoretld) @ myfaces-impl ---
[WARNING] *******************************************************************
[WARNING] RuntimeInstance initializing.
[WARNING] Default ResourceManager initializing. (class org.apache.velocity.runtime.resource.ResourceManagerImpl)
[WARNING] FileResourceLoader : initialization starting.
[WARNING] FileResourceLoader : initialization complete.
[WARNING] RelativeClasspathResourceLoader : initialization complete.
[INFO] RelativeClasspathResourceLoader : adding path 'META-INF'
[WARNING] RelativeClasspathResourceLoader : initialization complete.
[WARNING] Default ResourceManager initialization complete.
[WARNING] Velocimacro : initialization starting.
[WARNING] Velocimacro : VM library registration complete.
[WARNING] Velocimacro : Velocimacro : initialization complete.
[WARNING] RuntimeInstance successfully initialized.
[INFO] using base content file: F:\jenkins\jenkins-slave\workspace\myfaces-current12\current12\core\impl\src\main\conf\META-INF\myfaces_core-base.tld
[INFO]
[INFO] --- myfaces-builder-plugin:1.0.8:make-config (makehtmltld) @ myfaces-impl ---
[WARNING] *******************************************************************
[WARNING] RuntimeInstance initializing.
[WARNING] Default ResourceManager initializing. (class org.apache.velocity.runtime.resource.ResourceManagerImpl)
[WARNING] FileResourceLoader : initialization starting.
[WARNING] FileResourceLoader : initialization complete.
[WARNING] RelativeClasspathResourceLoader : initialization complete.
[INFO] RelativeClasspathResourceLoader : adding path 'META-INF'
[WARNING] RelativeClasspathResourceLoader : initialization complete.
[WARNING] Default ResourceManager initialization complete.
[WARNING] Velocimacro : initialization starting.
[WARNING] Velocimacro : VM library registration complete.
[WARNING] Velocimacro : Velocimacro : initialization complete.
[WARNING] RuntimeInstance successfully initialized.
[INFO] using base content file: F:\jenkins\jenkins-slave\workspace\myfaces-current12\current12\core\impl\src\main\conf\META-INF\myfaces_html-base.tld
[WARNING] Failed to getClass for org.apache.maven.plugin.source.SourceJarMojo
[INFO]
[INFO] <<< maven-source-plugin:2.0.4:jar (attach-source) @ myfaces-impl <<<
[INFO]
[INFO] --- maven-source-plugin:2.0.4:jar (attach-source) @ myfaces-impl ---
[INFO] Building jar: F:\jenkins\jenkins-slave\workspace\myfaces-current12\current12\core\impl\target\myfaces-impl-1.2.13-SNAPSHOT-sources.jar
[INFO]
[INFO] --- maven-checkstyle-plugin:2.6:check (verify-style) @ myfaces-impl ---
[INFO]
[INFO]
[INFO] --- maven-install-plugin:2.3.1:install (default-install) @ myfaces-impl ---
[INFO] Installing F:\jenkins\jenkins-slave\workspace\myfaces-current12\current12\core\impl\target\myfaces-impl-1.2.13-SNAPSHOT.jar to f:\jenkins\jenkins-slave\maven-repositories\1\org\apache\myfaces\core\myfaces-impl\1.2.13-SNAPSHOT\myfaces-impl-1.2.13-SNAPSHOT.jar
[INFO] Installing F:\jenkins\jenkins-slave\workspace\myfaces-current12\current12\core\impl\pom.xml to f:\jenkins\jenkins-slave\maven-repositories\1\org\apache\myfaces\core\myfaces-impl\1.2.13-SNAPSHOT\myfaces-impl-1.2.13-SNAPSHOT.pom
[INFO] Installing F:\jenkins\jenkins-slave\workspace\myfaces-current12\current12\core\impl\target\myfaces-impl-1.2.13-SNAPSHOT-sources.jar to f:\jenkins\jenkins-slave\maven-repositories\1\org\apache\myfaces\core\myfaces-impl\1.2.13-SNAPSHOT\myfaces-impl-1.2.13-SNAPSHOT-sources.jar
[INFO]
[INFO] ------------------------------------------------------------------------
[INFO] Building Build Project 1.2.10-SNAPSHOT
[INFO] ------------------------------------------------------------------------
[INFO]
[INFO] --- maven-remote-resources-plugin:1.1:process (default) @ myfaces-base ---
[INFO] Setting property: classpath.resource.loader.class => 'org.codehaus.plexus.velocity.ContextClassLoaderResourceLoader'.
[INFO] Setting property: velocimacro.messages.on => 'false'.
[INFO] Setting property: resource.loader => 'classpath'.
[INFO] Setting property: resource.manager.logwhenfound => 'false'.
[INFO]
[INFO] --- maven-install-plugin:2.3:install (default-install) @ myfaces-base ---
[INFO] Installing <https://builds.apache.org/job/myfaces-current12/ws/current12\pom.xml> to f:\jenkins\jenkins-slave\maven-repositories\1\org\apache\myfaces\myfaces-base\1.2.10-SNAPSHOT\myfaces-base-1.2.10-SNAPSHOT.pom
[INFO] ------------------------------------------------------------------------
[INFO] Reactor Summary:
[INFO]
[INFO] Apache MyFaces Shared For JSF 1.2 - Project ....... SUCCESS [14.910s]
[INFO] Apache MyFaces Shared For JSF 1.2 - Core .......... SUCCESS [21.124s]
[INFO] MyFaces Shared Impl ............................... SUCCESS [20.799s]
[INFO] MyFaces Shared Tomahawk ........................... SUCCESS [15.194s]
[INFO] Apache MyFaces JSF-1.2 Core Project ............... SUCCESS [6.028s]
[INFO] Apache Myfaces JSF Core-1.2 API ................... SUCCESS [1:08.463s]
[INFO] Apache MyFaces JSF-1.2 Core Impl .................. SUCCESS [55.219s]
[INFO] Build Project ..................................... SUCCESS [2.651s]
[INFO] ------------------------------------------------------------------------
[INFO] BUILD SUCCESS
[INFO] ------------------------------------------------------------------------
[INFO] Total time: 3:35.877s
[INFO] Finished at: Tue Jun 10 02:44:08 PDT 2014
[INFO] Final Memory: 53M/127M
[INFO] ------------------------------------------------------------------------
Waiting for Jenkins to finish collecting data
[JENKINS] Archiving F:\jenkins\jenkins-slave\workspace\myfaces-current12\current12\shared\shared-tomahawk\pom.xml to org.apache.myfaces.shared/myfaces-shared-tomahawk/3.0.13-SNAPSHOT/myfaces-shared-tomahawk-3.0.13-SNAPSHOT.pom
[JENKINS] Archiving F:\jenkins\jenkins-slave\workspace\myfaces-current12\current12\shared\shared-tomahawk\target\myfaces-shared-tomahawk-3.0.13-SNAPSHOT.jar to org.apache.myfaces.shared/myfaces-shared-tomahawk/3.0.13-SNAPSHOT/myfaces-shared-tomahawk-3.0.13-SNAPSHOT.jar
[JENKINS] Archiving F:\jenkins\jenkins-slave\workspace\myfaces-current12\current12\shared\shared-tomahawk\target\myfaces-shared-tomahawk-3.0.13-SNAPSHOT-sources.jar to org.apache.myfaces.shared/myfaces-shared-tomahawk/3.0.13-SNAPSHOT/myfaces-shared-tomahawk-3.0.13-SNAPSHOT-sources.jar
Sending artifact delta relative to myfaces-current12 » MyFaces Shared Tomahawk #1180
Archived 3 artifacts
Archive block size is 32768
Received 0 blocks and 564372 bytes
Compression is 0.0%
Took 0.24 sec
[JENKINS] Archiving F:\jenkins\jenkins-slave\workspace\myfaces-current12\current12\core\impl\pom.xml to org.apache.myfaces.core/myfaces-impl/1.2.13-SNAPSHOT/myfaces-impl-1.2.13-SNAPSHOT.pom
[JENKINS] Archiving F:\jenkins\jenkins-slave\workspace\myfaces-current12\current12\core\impl\target\myfaces-impl-1.2.13-SNAPSHOT.jar to org.apache.myfaces.core/myfaces-impl/1.2.13-SNAPSHOT/myfaces-impl-1.2.13-SNAPSHOT.jar
[JENKINS] Archiving F:\jenkins\jenkins-slave\workspace\myfaces-current12\current12\core\impl\target\myfaces-impl-1.2.13-SNAPSHOT-sources.jar to org.apache.myfaces.core/myfaces-impl/1.2.13-SNAPSHOT/myfaces-impl-1.2.13-SNAPSHOT-sources.jar
Sending artifact delta relative to myfaces-current12 » Apache MyFaces JSF-1.2 Core Impl #1180
Archived 3 artifacts
Archive block size is 32768
Received 33 blocks and 530469 bytes
Compression is 67.1%
Took 0.24 sec
[JENKINS] Archiving F:\jenkins\jenkins-slave\workspace\myfaces-current12\current12\shared\shared-impl\pom.xml to org.apache.myfaces.shared/myfaces-shared-impl/3.0.13-SNAPSHOT/myfaces-shared-impl-3.0.13-SNAPSHOT.pom
[JENKINS] Archiving F:\jenkins\jenkins-slave\workspace\myfaces-current12\current12\shared\shared-impl\target\myfaces-shared-impl-3.0.13-SNAPSHOT.jar to org.apache.myfaces.shared/myfaces-shared-impl/3.0.13-SNAPSHOT/myfaces-shared-impl-3.0.13-SNAPSHOT.jar
[JENKINS] Archiving F:\jenkins\jenkins-slave\workspace\myfaces-current12\current12\shared\shared-impl\target\myfaces-shared-impl-3.0.13-SNAPSHOT-sources.jar to org.apache.myfaces.shared/myfaces-shared-impl/3.0.13-SNAPSHOT/myfaces-shared-impl-3.0.13-SNAPSHOT-sources.jar
Sending artifact delta relative to myfaces-current12 » MyFaces Shared Impl #1180
Archived 3 artifacts
Archive block size is 32768
Received 0 blocks and 560561 bytes
Compression is 0.0%
Took 0.34 sec
[JENKINS] Archiving F:\jenkins\jenkins-slave\workspace\myfaces-current12\current12\shared\core\pom.xml to org.apache.myfaces.shared/myfaces-shared-core/3.0.13-SNAPSHOT/myfaces-shared-core-3.0.13-SNAPSHOT.pom
[JENKINS] Archiving F:\jenkins\jenkins-slave\workspace\myfaces-current12\current12\shared\core\target\myfaces-shared-core-3.0.13-SNAPSHOT.jar to org.apache.myfaces.shared/myfaces-shared-core/3.0.13-SNAPSHOT/myfaces-shared-core-3.0.13-SNAPSHOT.jar
[JENKINS] Archiving F:\jenkins\jenkins-slave\workspace\myfaces-current12\current12\shared\core\target\myfaces-shared-core-3.0.13-SNAPSHOT-sources.jar to org.apache.myfaces.shared/myfaces-shared-core/3.0.13-SNAPSHOT/myfaces-shared-core-3.0.13-SNAPSHOT-sources.jar
Sending artifact delta relative to myfaces-current12 » Apache MyFaces Shared For JSF 1.2 - Core #1180
Archived 3 artifacts
Archive block size is 32768
Received 14 blocks and 104977 bytes
Compression is 81.4%
Took 1.9 sec
[JENKINS] Archiving F:\jenkins\jenkins-slave\workspace\myfaces-current12\current12\core\api\pom.xml to org.apache.myfaces.core/myfaces-api/1.2.13-SNAPSHOT/myfaces-api-1.2.13-SNAPSHOT.pom
[JENKINS] Archiving F:\jenkins\jenkins-slave\workspace\myfaces-current12\current12\core\api\target\myfaces-api-1.2.13-SNAPSHOT.jar to org.apache.myfaces.core/myfaces-api/1.2.13-SNAPSHOT/myfaces-api-1.2.13-SNAPSHOT.jar
[JENKINS] Archiving F:\jenkins\jenkins-slave\workspace\myfaces-current12\current12\core\api\target\myfaces-api-1.2.13-SNAPSHOT-sources.jar to org.apache.myfaces.core/myfaces-api/1.2.13-SNAPSHOT/myfaces-api-1.2.13-SNAPSHOT-sources.jar
[JENKINS] Archiving F:\jenkins\jenkins-slave\workspace\myfaces-current12\current12\core\api\target\myfaces-api-1.2.13-SNAPSHOT-tests.jar to org.apache.myfaces.core/myfaces-api/1.2.13-SNAPSHOT/myfaces-api-1.2.13-SNAPSHOT-tests.jar
Sending artifact delta relative to myfaces-current12 » Apache Myfaces JSF Core-1.2 API #1180
Archived 4 artifacts
Archive block size is 32768
Received 15 blocks and 525403 bytes
Compression is 48.3%
Took 0.45 sec
[JENKINS] Archiving F:\jenkins\jenkins-slave\workspace\myfaces-current12\current12\shared\pom.xml to org.apache.myfaces.shared/myfaces-shared-project/3.0.13-SNAPSHOT/myfaces-shared-project-3.0.13-SNAPSHOT.pom
[JENKINS] Archiving F:\jenkins\jenkins-slave\workspace\myfaces-current12\current12\shared\target\myfaces-shared-project-3.0.13-SNAPSHOT-site.xml to org.apache.myfaces.shared/myfaces-shared-project/3.0.13-SNAPSHOT/myfaces-shared-project-3.0.13-SNAPSHOT-site.xml
Sending artifact delta relative to myfaces-current12 » Apache MyFaces Shared For JSF 1.2 - Project #1180
Archived 2 artifacts
Archive block size is 32768
Received 0 blocks and 10524 bytes
Compression is 0.0%
Took 91 ms
[JENKINS] Archiving F:\jenkins\jenkins-slave\workspace\myfaces-current12\current12\core\pom.xml to org.apache.myfaces.core/myfaces-core-project/1.2.13-SNAPSHOT/myfaces-core-project-1.2.13-SNAPSHOT.pom
[JENKINS] Archiving F:\jenkins\jenkins-slave\workspace\myfaces-current12\current12\core\target\myfaces-core-project-1.2.13-SNAPSHOT-site.xml to org.apache.myfaces.core/myfaces-core-project/1.2.13-SNAPSHOT/myfaces-core-project-1.2.13-SNAPSHOT-site.xml
Sending artifact delta relative to myfaces-current12 » Apache MyFaces JSF-1.2 Core Project #1180
Archived 2 artifacts
Archive block size is 32768
Received 0 blocks and 24305 bytes
Compression is 0.0%
Took 52 ms
[JENKINS] Archiving <https://builds.apache.org/job/myfaces-current12/ws/current12\pom.xml> to org.apache.myfaces/myfaces-base/1.2.10-SNAPSHOT/myfaces-base-1.2.10-SNAPSHOT.pom
Sending artifact delta relative to myfaces-current12 » Build Project #1180
Archived 1 artifacts
Archive block size is 32768
Received 0 blocks and 1228 bytes
Compression is 0.0%
Took 75 ms
channel stopped
Maven RedeployPublisher use remote windows2 maven settings from : f:\jenkins\tools\maven\latest/conf/settings.xml
[ERROR] uniqueVersion == false is not anymore supported in maven 3
[INFO] Deployment in https://repository.apache.org/content/repositories/snapshots (id=apache.snapshots.https,uniqueVersion=false)
Deploying the main artifact myfaces-base-1.2.10-SNAPSHOT.pom
Downloading: https://repository.apache.org/content/repositories/snapshots/org/apache/myfaces/myfaces-base/1.2.10-SNAPSHOT/maven-metadata.xml
Downloaded: https://repository.apache.org/content/repositories/snapshots/org/apache/myfaces/myfaces-base/1.2.10-SNAPSHOT/maven-metadata.xml (613 B at 1.2 KB/sec)
Uploading: https://repository.apache.org/content/repositories/snapshots/org/apache/myfaces/myfaces-base/1.2.10-SNAPSHOT/myfaces-base-1.2.10-20140610.094419-556.pom
ERROR: Failed to deploy artifacts: Could not transfer artifact org.apache.myfaces:myfaces-base:pom:1.2.10-20140610.094419-556 from/to apache.snapshots.https (https://repository.apache.org/content/repositories/snapshots): Failed to transfer file: https://repository.apache.org/content/repositories/snapshots/org/apache/myfaces/myfaces-base/1.2.10-SNAPSHOT/myfaces-base-1.2.10-20140610.094419-556.pom. Return code is: 401, ReasonPhrase: Unauthorized.
org.apache.maven.artifact.deployer.ArtifactDeploymentException: Failed to deploy artifacts: Could not transfer artifact org.apache.myfaces:myfaces-base:pom:1.2.10-20140610.094419-556 from/to apache.snapshots.https (https://repository.apache.org/content/repositories/snapshots): Failed to transfer file: https://repository.apache.org/content/repositories/snapshots/org/apache/myfaces/myfaces-base/1.2.10-SNAPSHOT/myfaces-base-1.2.10-20140610.094419-556.pom. Return code is: 401, ReasonPhrase: Unauthorized.
at org.apache.maven.artifact.deployer.DefaultArtifactDeployer.deploy(DefaultArtifactDeployer.java:143)
at hudson.maven.reporters.MavenArtifactRecord.deploy(MavenArtifactRecord.java:193)
at hudson.maven.RedeployPublisher.perform(RedeployPublisher.java:176)
at hudson.tasks.BuildStepMonitor$1.perform(BuildStepMonitor.java:20)
at hudson.model.AbstractBuild$AbstractBuildExecution.perform(AbstractBuild.java:804)
at hudson.model.AbstractBuild$AbstractBuildExecution.performAllBuildSteps(AbstractBuild.java:776)
at hudson.maven.MavenModuleSetBuild$MavenModuleSetBuildExecution.post2(MavenModuleSetBuild.java:1040)
at hudson.model.AbstractBuild$AbstractBuildExecution.post(AbstractBuild.java:725)
at hudson.model.Run.execute(Run.java:1701)
at hudson.maven.MavenModuleSetBuild.run(MavenModuleSetBuild.java:529)
at hudson.model.ResourceController.execute(ResourceController.java:88)
at hudson.model.Executor.run(Executor.java:231)
Caused by: org.eclipse.aether.deployment.DeploymentException: Failed to deploy artifacts: Could not transfer artifact org.apache.myfaces:myfaces-base:pom:1.2.10-20140610.094419-556 from/to apache.snapshots.https (https://repository.apache.org/content/repositories/snapshots): Failed to transfer file: https://repository.apache.org/content/repositories/snapshots/org/apache/myfaces/myfaces-base/1.2.10-SNAPSHOT/myfaces-base-1.2.10-20140610.094419-556.pom. Return code is: 401, ReasonPhrase: Unauthorized.
at org.eclipse.aether.internal.impl.DefaultDeployer.deploy(DefaultDeployer.java:341)
at org.eclipse.aether.internal.impl.DefaultDeployer.deploy(DefaultDeployer.java:269)
at org.eclipse.aether.internal.impl.DefaultRepositorySystem.deploy(DefaultRepositorySystem.java:413)
at org.apache.maven.artifact.deployer.DefaultArtifactDeployer.deploy(DefaultArtifactDeployer.java:139)
... 11 more
Caused by: org.eclipse.aether.transfer.ArtifactTransferException: Could not transfer artifact org.apache.myfaces:myfaces-base:pom:1.2.10-20140610.094419-556 from/to apache.snapshots.https (https://repository.apache.org/content/repositories/snapshots): Failed to transfer file: https://repository.apache.org/content/repositories/snapshots/org/apache/myfaces/myfaces-base/1.2.10-SNAPSHOT/myfaces-base-1.2.10-20140610.094419-556.pom. Return code is: 401, ReasonPhrase: Unauthorized.
at org.eclipse.aether.connector.wagon.WagonRepositoryConnector$6.wrap(WagonRepositoryConnector.java:1016)
at org.eclipse.aether.connector.wagon.WagonRepositoryConnector$6.wrap(WagonRepositoryConnector.java:1004)
at org.eclipse.aether.connector.wagon.WagonRepositoryConnector$PutTask.run(WagonRepositoryConnector.java:895)
at org.eclipse.aether.connector.wagon.WagonRepositoryConnector.put(WagonRepositoryConnector.java:522)
at org.eclipse.aether.internal.impl.DefaultDeployer.deploy(DefaultDeployer.java:335)
... 14 more
Caused by: org.apache.maven.wagon.TransferFailedException: Failed to transfer file: https://repository.apache.org/content/repositories/snapshots/org/apache/myfaces/myfaces-base/1.2.10-SNAPSHOT/myfaces-base-1.2.10-20140610.094419-556.pom. Return code is: 401, ReasonPhrase: Unauthorized.
at org.apache.maven.wagon.shared.http4.AbstractHttpClientWagon.put(AbstractHttpClientWagon.java:626)
at org.apache.maven.wagon.shared.http4.AbstractHttpClientWagon.put(AbstractHttpClientWagon.java:524)
at org.apache.maven.wagon.shared.http4.AbstractHttpClientWagon.put(AbstractHttpClientWagon.java:505)
at org.apache.maven.wagon.shared.http4.AbstractHttpClientWagon.put(AbstractHttpClientWagon.java:485)
at org.eclipse.aether.connector.wagon.WagonRepositoryConnector$PutTask.run(WagonRepositoryConnector.java:871)
... 16 more
[INFO] Deployment failed after 0.97 sec
Build step 'Deploy artifacts to Maven repository' changed build result to FAILURE
Build failed in Jenkins: myfaces-current12 #1180
Posted by Apache Jenkins Server <je...@builds.apache.org>.
See <https://builds.apache.org/job/myfaces-current12/1180/>
------------------------------------------
[...truncated 1569 lines...]
Artifact: myfaces-api-1.2.13-SNAPSHOT.jar have META-INF/myfaces-metadata.xml
[INFO]
[INFO] --- myfaces-builder-plugin:1.0.8:make-config (makefacesconfig) @ myfaces-impl ---
[WARNING] *******************************************************************
[WARNING] RuntimeInstance initializing.
[WARNING] Default ResourceManager initializing. (class org.apache.velocity.runtime.resource.ResourceManagerImpl)
[WARNING] FileResourceLoader : initialization starting.
[WARNING] FileResourceLoader : initialization complete.
[WARNING] RelativeClasspathResourceLoader : initialization complete.
[INFO] RelativeClasspathResourceLoader : adding path 'META-INF'
[WARNING] RelativeClasspathResourceLoader : initialization complete.
[WARNING] Default ResourceManager initialization complete.
[WARNING] Velocimacro : initialization starting.
[WARNING] Velocimacro : VM library registration complete.
[WARNING] Velocimacro : Velocimacro : initialization complete.
[WARNING] RuntimeInstance successfully initialized.
[INFO] using base content file: F:\jenkins\jenkins-slave\workspace\myfaces-current12\current12\core\impl\src\main\conf\META-INF\standard-faces-config-base.xml
[INFO]
[INFO] --- myfaces-builder-plugin:1.0.8:make-tags (make_tags) @ myfaces-impl ---
[INFO] Using template from file loader: F:\jenkins\jenkins-slave\workspace\myfaces-current12\current12\core\impl\src\main\resources\META-INF\tagClass12.vm
[WARNING] *******************************************************************
[WARNING] RuntimeInstance initializing.
[WARNING] Default ResourceManager initializing. (class org.apache.velocity.runtime.resource.ResourceManagerImpl)
[WARNING] FileResourceLoader : initialization starting.
[WARNING] FileResourceLoader : initialization complete.
[WARNING] RelativeClasspathResourceLoader : initialization complete.
[INFO] RelativeClasspathResourceLoader : adding path 'META-INF'
[WARNING] RelativeClasspathResourceLoader : initialization complete.
[WARNING] Default ResourceManager initialization complete.
[WARNING] Velocimacro : initialization starting.
[WARNING] Velocimacro : VM library registration complete.
[WARNING] Velocimacro : Velocimacro : initialization complete.
[WARNING] RuntimeInstance successfully initialized.
[INFO] Generating tag class:org.apache.myfaces.taglib.html.HtmlInputHiddenTag
[INFO] Generating tag class:org.apache.myfaces.taglib.html.HtmlColumnTag
[INFO] Generating tag class:org.apache.myfaces.taglib.html.HtmlCommandButtonTag
[INFO] Generating tag class:org.apache.myfaces.taglib.html.HtmlCommandLinkTag
[INFO] Generating tag class:org.apache.myfaces.taglib.html.HtmlDataTableTag
[INFO] Generating tag class:org.apache.myfaces.taglib.html.HtmlFormTag
[INFO] Generating tag class:org.apache.myfaces.taglib.html.HtmlGraphicImageTag
[INFO] Generating tag class:org.apache.myfaces.taglib.html.HtmlInputSecretTag
[INFO] Generating tag class:org.apache.myfaces.taglib.html.HtmlInputTextTag
[INFO] Generating tag class:org.apache.myfaces.taglib.html.HtmlInputTextareaTag
[INFO] Generating tag class:org.apache.myfaces.taglib.html.HtmlMessageTag
[INFO] Generating tag class:org.apache.myfaces.taglib.html.HtmlMessagesTag
[INFO] Generating tag class:org.apache.myfaces.taglib.html.HtmlOutputFormatTag
[INFO] Generating tag class:org.apache.myfaces.taglib.html.HtmlOutputLabelTag
[INFO] Generating tag class:org.apache.myfaces.taglib.html.HtmlOutputLinkTag
[INFO] Generating tag class:org.apache.myfaces.taglib.html.HtmlOutputTextTag
[INFO] Generating tag class:org.apache.myfaces.taglib.html.HtmlPanelGridTag
[INFO] Generating tag class:org.apache.myfaces.taglib.html.HtmlPanelGroupTag
[INFO] Generating tag class:org.apache.myfaces.taglib.html.HtmlSelectBooleanCheckboxTag
[INFO] Generating tag class:org.apache.myfaces.taglib.html.HtmlSelectManyCheckboxTag
[INFO] Generating tag class:org.apache.myfaces.taglib.html.HtmlSelectManyListboxTag
[INFO] Generating tag class:org.apache.myfaces.taglib.html.HtmlSelectManyMenuTag
[INFO] Generating tag class:org.apache.myfaces.taglib.html.HtmlSelectOneListboxTag
[INFO] Generating tag class:org.apache.myfaces.taglib.html.HtmlSelectOneMenuTag
[INFO] Generating tag class:org.apache.myfaces.taglib.html.HtmlSelectOneRadioTag
[INFO]
[INFO] --- myfaces-builder-plugin:1.0.8:make-config (makecoretld) @ myfaces-impl ---
[WARNING] *******************************************************************
[WARNING] RuntimeInstance initializing.
[WARNING] Default ResourceManager initializing. (class org.apache.velocity.runtime.resource.ResourceManagerImpl)
[WARNING] FileResourceLoader : initialization starting.
[WARNING] FileResourceLoader : initialization complete.
[WARNING] RelativeClasspathResourceLoader : initialization complete.
[INFO] RelativeClasspathResourceLoader : adding path 'META-INF'
[WARNING] RelativeClasspathResourceLoader : initialization complete.
[WARNING] Default ResourceManager initialization complete.
[WARNING] Velocimacro : initialization starting.
[WARNING] Velocimacro : VM library registration complete.
[WARNING] Velocimacro : Velocimacro : initialization complete.
[WARNING] RuntimeInstance successfully initialized.
[INFO] using base content file: F:\jenkins\jenkins-slave\workspace\myfaces-current12\current12\core\impl\src\main\conf\META-INF\myfaces_core-base.tld
[INFO]
[INFO] --- myfaces-builder-plugin:1.0.8:make-config (makehtmltld) @ myfaces-impl ---
[WARNING] *******************************************************************
[WARNING] RuntimeInstance initializing.
[WARNING] Default ResourceManager initializing. (class org.apache.velocity.runtime.resource.ResourceManagerImpl)
[WARNING] FileResourceLoader : initialization starting.
[WARNING] FileResourceLoader : initialization complete.
[WARNING] RelativeClasspathResourceLoader : initialization complete.
[INFO] RelativeClasspathResourceLoader : adding path 'META-INF'
[WARNING] RelativeClasspathResourceLoader : initialization complete.
[WARNING] Default ResourceManager initialization complete.
[WARNING] Velocimacro : initialization starting.
[WARNING] Velocimacro : VM library registration complete.
[WARNING] Velocimacro : Velocimacro : initialization complete.
[WARNING] RuntimeInstance successfully initialized.
[INFO] using base content file: F:\jenkins\jenkins-slave\workspace\myfaces-current12\current12\core\impl\src\main\conf\META-INF\myfaces_html-base.tld
[WARNING] Failed to getClass for org.apache.maven.plugin.source.SourceJarMojo
[INFO]
[INFO] <<< maven-source-plugin:2.0.4:jar (attach-source) @ myfaces-impl <<<
[INFO]
[INFO] --- maven-source-plugin:2.0.4:jar (attach-source) @ myfaces-impl ---
[INFO] Building jar: F:\jenkins\jenkins-slave\workspace\myfaces-current12\current12\core\impl\target\myfaces-impl-1.2.13-SNAPSHOT-sources.jar
[INFO]
[INFO] --- maven-checkstyle-plugin:2.6:check (verify-style) @ myfaces-impl ---
[INFO]
[INFO]
[INFO] --- maven-install-plugin:2.3.1:install (default-install) @ myfaces-impl ---
[INFO] Installing F:\jenkins\jenkins-slave\workspace\myfaces-current12\current12\core\impl\target\myfaces-impl-1.2.13-SNAPSHOT.jar to f:\jenkins\jenkins-slave\maven-repositories\1\org\apache\myfaces\core\myfaces-impl\1.2.13-SNAPSHOT\myfaces-impl-1.2.13-SNAPSHOT.jar
[INFO] Installing F:\jenkins\jenkins-slave\workspace\myfaces-current12\current12\core\impl\pom.xml to f:\jenkins\jenkins-slave\maven-repositories\1\org\apache\myfaces\core\myfaces-impl\1.2.13-SNAPSHOT\myfaces-impl-1.2.13-SNAPSHOT.pom
[INFO] Installing F:\jenkins\jenkins-slave\workspace\myfaces-current12\current12\core\impl\target\myfaces-impl-1.2.13-SNAPSHOT-sources.jar to f:\jenkins\jenkins-slave\maven-repositories\1\org\apache\myfaces\core\myfaces-impl\1.2.13-SNAPSHOT\myfaces-impl-1.2.13-SNAPSHOT-sources.jar
[INFO]
[INFO] ------------------------------------------------------------------------
[INFO] Building Build Project 1.2.10-SNAPSHOT
[INFO] ------------------------------------------------------------------------
[INFO]
[INFO] --- maven-remote-resources-plugin:1.1:process (default) @ myfaces-base ---
[INFO] Setting property: classpath.resource.loader.class => 'org.codehaus.plexus.velocity.ContextClassLoaderResourceLoader'.
[INFO] Setting property: velocimacro.messages.on => 'false'.
[INFO] Setting property: resource.loader => 'classpath'.
[INFO] Setting property: resource.manager.logwhenfound => 'false'.
[INFO]
[INFO] --- maven-install-plugin:2.3:install (default-install) @ myfaces-base ---
[INFO] Installing <https://builds.apache.org/job/myfaces-current12/ws/current12\pom.xml> to f:\jenkins\jenkins-slave\maven-repositories\1\org\apache\myfaces\myfaces-base\1.2.10-SNAPSHOT\myfaces-base-1.2.10-SNAPSHOT.pom
[INFO] ------------------------------------------------------------------------
[INFO] Reactor Summary:
[INFO]
[INFO] Apache MyFaces Shared For JSF 1.2 - Project ....... SUCCESS [20.959s]
[INFO] Apache MyFaces Shared For JSF 1.2 - Core .......... SUCCESS [29.733s]
[INFO] MyFaces Shared Impl ............................... SUCCESS [20.354s]
[INFO] MyFaces Shared Tomahawk ........................... SUCCESS [16.883s]
[INFO] Apache MyFaces JSF-1.2 Core Project ............... SUCCESS [5.770s]
[INFO] Apache Myfaces JSF Core-1.2 API ................... SUCCESS [1:00.794s]
[INFO] Apache MyFaces JSF-1.2 Core Impl .................. SUCCESS [56.672s]
[INFO] Build Project ..................................... SUCCESS [7.222s]
[INFO] ------------------------------------------------------------------------
[INFO] BUILD SUCCESS
[INFO] ------------------------------------------------------------------------
[INFO] Total time: 3:49.477s
[INFO] Finished at: Tue Jun 10 01:29:04 PDT 2014
[INFO] Final Memory: 57M/136M
[INFO] ------------------------------------------------------------------------
Waiting for Jenkins to finish collecting data
[JENKINS] Archiving F:\jenkins\jenkins-slave\workspace\myfaces-current12\current12\shared\shared-tomahawk\pom.xml to org.apache.myfaces.shared/myfaces-shared-tomahawk/3.0.13-SNAPSHOT/myfaces-shared-tomahawk-3.0.13-SNAPSHOT.pom
[JENKINS] Archiving F:\jenkins\jenkins-slave\workspace\myfaces-current12\current12\shared\shared-tomahawk\target\myfaces-shared-tomahawk-3.0.13-SNAPSHOT.jar to org.apache.myfaces.shared/myfaces-shared-tomahawk/3.0.13-SNAPSHOT/myfaces-shared-tomahawk-3.0.13-SNAPSHOT.jar
[JENKINS] Archiving F:\jenkins\jenkins-slave\workspace\myfaces-current12\current12\shared\shared-tomahawk\target\myfaces-shared-tomahawk-3.0.13-SNAPSHOT-sources.jar to org.apache.myfaces.shared/myfaces-shared-tomahawk/3.0.13-SNAPSHOT/myfaces-shared-tomahawk-3.0.13-SNAPSHOT-sources.jar
Sending artifact delta relative to myfaces-current12 » MyFaces Shared Tomahawk #1179
Archived 3 artifacts
Archive block size is 32768
Received 0 blocks and 564372 bytes
Compression is 0.0%
Took 0.42 sec
[JENKINS] Archiving F:\jenkins\jenkins-slave\workspace\myfaces-current12\current12\core\impl\pom.xml to org.apache.myfaces.core/myfaces-impl/1.2.13-SNAPSHOT/myfaces-impl-1.2.13-SNAPSHOT.pom
[JENKINS] Archiving F:\jenkins\jenkins-slave\workspace\myfaces-current12\current12\core\impl\target\myfaces-impl-1.2.13-SNAPSHOT.jar to org.apache.myfaces.core/myfaces-impl/1.2.13-SNAPSHOT/myfaces-impl-1.2.13-SNAPSHOT.jar
[JENKINS] Archiving F:\jenkins\jenkins-slave\workspace\myfaces-current12\current12\core\impl\target\myfaces-impl-1.2.13-SNAPSHOT-sources.jar to org.apache.myfaces.core/myfaces-impl/1.2.13-SNAPSHOT/myfaces-impl-1.2.13-SNAPSHOT-sources.jar
Sending artifact delta relative to myfaces-current12 » Apache MyFaces JSF-1.2 Core Impl #1179
Archived 3 artifacts
Archive block size is 32768
Received 33 blocks and 530469 bytes
Compression is 67.1%
Took 0.25 sec
[JENKINS] Archiving F:\jenkins\jenkins-slave\workspace\myfaces-current12\current12\shared\shared-impl\pom.xml to org.apache.myfaces.shared/myfaces-shared-impl/3.0.13-SNAPSHOT/myfaces-shared-impl-3.0.13-SNAPSHOT.pom
[JENKINS] Archiving F:\jenkins\jenkins-slave\workspace\myfaces-current12\current12\shared\shared-impl\target\myfaces-shared-impl-3.0.13-SNAPSHOT.jar to org.apache.myfaces.shared/myfaces-shared-impl/3.0.13-SNAPSHOT/myfaces-shared-impl-3.0.13-SNAPSHOT.jar
[JENKINS] Archiving F:\jenkins\jenkins-slave\workspace\myfaces-current12\current12\shared\shared-impl\target\myfaces-shared-impl-3.0.13-SNAPSHOT-sources.jar to org.apache.myfaces.shared/myfaces-shared-impl/3.0.13-SNAPSHOT/myfaces-shared-impl-3.0.13-SNAPSHOT-sources.jar
Sending artifact delta relative to myfaces-current12 » MyFaces Shared Impl #1179
Archived 3 artifacts
Archive block size is 32768
Received 0 blocks and 560561 bytes
Compression is 0.0%
Took 0.27 sec
[JENKINS] Archiving F:\jenkins\jenkins-slave\workspace\myfaces-current12\current12\shared\core\pom.xml to org.apache.myfaces.shared/myfaces-shared-core/3.0.13-SNAPSHOT/myfaces-shared-core-3.0.13-SNAPSHOT.pom
[JENKINS] Archiving F:\jenkins\jenkins-slave\workspace\myfaces-current12\current12\shared\core\target\myfaces-shared-core-3.0.13-SNAPSHOT.jar to org.apache.myfaces.shared/myfaces-shared-core/3.0.13-SNAPSHOT/myfaces-shared-core-3.0.13-SNAPSHOT.jar
[JENKINS] Archiving F:\jenkins\jenkins-slave\workspace\myfaces-current12\current12\shared\core\target\myfaces-shared-core-3.0.13-SNAPSHOT-sources.jar to org.apache.myfaces.shared/myfaces-shared-core/3.0.13-SNAPSHOT/myfaces-shared-core-3.0.13-SNAPSHOT-sources.jar
Sending artifact delta relative to myfaces-current12 » Apache MyFaces Shared For JSF 1.2 - Core #1179
Archived 3 artifacts
Archive block size is 32768
Received 14 blocks and 104977 bytes
Compression is 81.4%
Took 0.14 sec
[JENKINS] Archiving F:\jenkins\jenkins-slave\workspace\myfaces-current12\current12\core\api\pom.xml to org.apache.myfaces.core/myfaces-api/1.2.13-SNAPSHOT/myfaces-api-1.2.13-SNAPSHOT.pom
[JENKINS] Archiving F:\jenkins\jenkins-slave\workspace\myfaces-current12\current12\core\api\target\myfaces-api-1.2.13-SNAPSHOT.jar to org.apache.myfaces.core/myfaces-api/1.2.13-SNAPSHOT/myfaces-api-1.2.13-SNAPSHOT.jar
[JENKINS] Archiving F:\jenkins\jenkins-slave\workspace\myfaces-current12\current12\core\api\target\myfaces-api-1.2.13-SNAPSHOT-sources.jar to org.apache.myfaces.core/myfaces-api/1.2.13-SNAPSHOT/myfaces-api-1.2.13-SNAPSHOT-sources.jar
[JENKINS] Archiving F:\jenkins\jenkins-slave\workspace\myfaces-current12\current12\core\api\target\myfaces-api-1.2.13-SNAPSHOT-tests.jar to org.apache.myfaces.core/myfaces-api/1.2.13-SNAPSHOT/myfaces-api-1.2.13-SNAPSHOT-tests.jar
Sending artifact delta relative to myfaces-current12 » Apache Myfaces JSF Core-1.2 API #1179
Archived 4 artifacts
Archive block size is 32768
Received 15 blocks and 525397 bytes
Compression is 48.3%
Took 2.6 sec
[JENKINS] Archiving F:\jenkins\jenkins-slave\workspace\myfaces-current12\current12\shared\pom.xml to org.apache.myfaces.shared/myfaces-shared-project/3.0.13-SNAPSHOT/myfaces-shared-project-3.0.13-SNAPSHOT.pom
[JENKINS] Archiving F:\jenkins\jenkins-slave\workspace\myfaces-current12\current12\shared\target\myfaces-shared-project-3.0.13-SNAPSHOT-site.xml to org.apache.myfaces.shared/myfaces-shared-project/3.0.13-SNAPSHOT/myfaces-shared-project-3.0.13-SNAPSHOT-site.xml
Sending artifact delta relative to myfaces-current12 » Apache MyFaces Shared For JSF 1.2 - Project #1179
Archived 2 artifacts
Archive block size is 32768
Received 0 blocks and 10524 bytes
Compression is 0.0%
Took 0.18 sec
[JENKINS] Archiving F:\jenkins\jenkins-slave\workspace\myfaces-current12\current12\core\pom.xml to org.apache.myfaces.core/myfaces-core-project/1.2.13-SNAPSHOT/myfaces-core-project-1.2.13-SNAPSHOT.pom
[JENKINS] Archiving F:\jenkins\jenkins-slave\workspace\myfaces-current12\current12\core\target\myfaces-core-project-1.2.13-SNAPSHOT-site.xml to org.apache.myfaces.core/myfaces-core-project/1.2.13-SNAPSHOT/myfaces-core-project-1.2.13-SNAPSHOT-site.xml
Sending artifact delta relative to myfaces-current12 » Apache MyFaces JSF-1.2 Core Project #1179
Archived 2 artifacts
Archive block size is 32768
Received 0 blocks and 24305 bytes
Compression is 0.0%
Took 50 ms
[JENKINS] Archiving <https://builds.apache.org/job/myfaces-current12/ws/current12\pom.xml> to org.apache.myfaces/myfaces-base/1.2.10-SNAPSHOT/myfaces-base-1.2.10-SNAPSHOT.pom
Sending artifact delta relative to myfaces-current12 » Build Project #1179
Archived 1 artifacts
Archive block size is 32768
Received 0 blocks and 1228 bytes
Compression is 0.0%
Took 53 ms
channel stopped
Maven RedeployPublisher use remote windows2 maven settings from : f:\jenkins\tools\maven\latest/conf/settings.xml
[ERROR] uniqueVersion == false is not anymore supported in maven 3
[INFO] Deployment in https://repository.apache.org/content/repositories/snapshots (id=apache.snapshots.https,uniqueVersion=false)
Deploying the main artifact myfaces-base-1.2.10-SNAPSHOT.pom
Downloading: https://repository.apache.org/content/repositories/snapshots/org/apache/myfaces/myfaces-base/1.2.10-SNAPSHOT/maven-metadata.xml
Downloaded: https://repository.apache.org/content/repositories/snapshots/org/apache/myfaces/myfaces-base/1.2.10-SNAPSHOT/maven-metadata.xml (613 B at 0.1 KB/sec)
Uploading: https://repository.apache.org/content/repositories/snapshots/org/apache/myfaces/myfaces-base/1.2.10-SNAPSHOT/myfaces-base-1.2.10-20140610.082922-556.pom
ERROR: Failed to deploy artifacts: Could not transfer artifact org.apache.myfaces:myfaces-base:pom:1.2.10-20140610.082922-556 from/to apache.snapshots.https (https://repository.apache.org/content/repositories/snapshots): Failed to transfer file: https://repository.apache.org/content/repositories/snapshots/org/apache/myfaces/myfaces-base/1.2.10-SNAPSHOT/myfaces-base-1.2.10-20140610.082922-556.pom. Return code is: 401, ReasonPhrase: Unauthorized.
org.apache.maven.artifact.deployer.ArtifactDeploymentException: Failed to deploy artifacts: Could not transfer artifact org.apache.myfaces:myfaces-base:pom:1.2.10-20140610.082922-556 from/to apache.snapshots.https (https://repository.apache.org/content/repositories/snapshots): Failed to transfer file: https://repository.apache.org/content/repositories/snapshots/org/apache/myfaces/myfaces-base/1.2.10-SNAPSHOT/myfaces-base-1.2.10-20140610.082922-556.pom. Return code is: 401, ReasonPhrase: Unauthorized.
at org.apache.maven.artifact.deployer.DefaultArtifactDeployer.deploy(DefaultArtifactDeployer.java:143)
at hudson.maven.reporters.MavenArtifactRecord.deploy(MavenArtifactRecord.java:193)
at hudson.maven.RedeployPublisher.perform(RedeployPublisher.java:176)
at hudson.tasks.BuildStepMonitor$1.perform(BuildStepMonitor.java:20)
at hudson.model.AbstractBuild$AbstractBuildExecution.perform(AbstractBuild.java:804)
at hudson.model.AbstractBuild$AbstractBuildExecution.performAllBuildSteps(AbstractBuild.java:776)
at hudson.maven.MavenModuleSetBuild$MavenModuleSetBuildExecution.post2(MavenModuleSetBuild.java:1040)
at hudson.model.AbstractBuild$AbstractBuildExecution.post(AbstractBuild.java:725)
at hudson.model.Run.execute(Run.java:1701)
at hudson.maven.MavenModuleSetBuild.run(MavenModuleSetBuild.java:529)
at hudson.model.ResourceController.execute(ResourceController.java:88)
at hudson.model.Executor.run(Executor.java:231)
Caused by: org.eclipse.aether.deployment.DeploymentException: Failed to deploy artifacts: Could not transfer artifact org.apache.myfaces:myfaces-base:pom:1.2.10-20140610.082922-556 from/to apache.snapshots.https (https://repository.apache.org/content/repositories/snapshots): Failed to transfer file: https://repository.apache.org/content/repositories/snapshots/org/apache/myfaces/myfaces-base/1.2.10-SNAPSHOT/myfaces-base-1.2.10-20140610.082922-556.pom. Return code is: 401, ReasonPhrase: Unauthorized.
at org.eclipse.aether.internal.impl.DefaultDeployer.deploy(DefaultDeployer.java:341)
at org.eclipse.aether.internal.impl.DefaultDeployer.deploy(DefaultDeployer.java:269)
at org.eclipse.aether.internal.impl.DefaultRepositorySystem.deploy(DefaultRepositorySystem.java:413)
at org.apache.maven.artifact.deployer.DefaultArtifactDeployer.deploy(DefaultArtifactDeployer.java:139)
... 11 more
Caused by: org.eclipse.aether.transfer.ArtifactTransferException: Could not transfer artifact org.apache.myfaces:myfaces-base:pom:1.2.10-20140610.082922-556 from/to apache.snapshots.https (https://repository.apache.org/content/repositories/snapshots): Failed to transfer file: https://repository.apache.org/content/repositories/snapshots/org/apache/myfaces/myfaces-base/1.2.10-SNAPSHOT/myfaces-base-1.2.10-20140610.082922-556.pom. Return code is: 401, ReasonPhrase: Unauthorized.
at org.eclipse.aether.connector.wagon.WagonRepositoryConnector$6.wrap(WagonRepositoryConnector.java:1016)
at org.eclipse.aether.connector.wagon.WagonRepositoryConnector$6.wrap(WagonRepositoryConnector.java:1004)
at org.eclipse.aether.connector.wagon.WagonRepositoryConnector$PutTask.run(WagonRepositoryConnector.java:895)
at org.eclipse.aether.connector.wagon.WagonRepositoryConnector.put(WagonRepositoryConnector.java:522)
at org.eclipse.aether.internal.impl.DefaultDeployer.deploy(DefaultDeployer.java:335)
... 14 more
Caused by: org.apache.maven.wagon.TransferFailedException: Failed to transfer file: https://repository.apache.org/content/repositories/snapshots/org/apache/myfaces/myfaces-base/1.2.10-SNAPSHOT/myfaces-base-1.2.10-20140610.082922-556.pom. Return code is: 401, ReasonPhrase: Unauthorized.
at org.apache.maven.wagon.shared.http4.AbstractHttpClientWagon.put(AbstractHttpClientWagon.java:626)
at org.apache.maven.wagon.shared.http4.AbstractHttpClientWagon.put(AbstractHttpClientWagon.java:524)
at org.apache.maven.wagon.shared.http4.AbstractHttpClientWagon.put(AbstractHttpClientWagon.java:505)
at org.apache.maven.wagon.shared.http4.AbstractHttpClientWagon.put(AbstractHttpClientWagon.java:485)
at org.eclipse.aether.connector.wagon.WagonRepositoryConnector$PutTask.run(WagonRepositoryConnector.java:871)
... 16 more
[INFO] Deployment failed after 5.7 sec
Build step 'Deploy artifacts to Maven repository' changed build result to FAILURE
Build failed in Jenkins: myfaces-current12 #1179
Posted by Apache Jenkins Server <je...@builds.apache.org>.
See <https://builds.apache.org/job/myfaces-current12/1179/>
------------------------------------------
[...truncated 1566 lines...]
Artifact: myfaces-api-1.2.13-SNAPSHOT.jar have META-INF/myfaces-metadata.xml
[INFO]
[INFO] --- myfaces-builder-plugin:1.0.8:make-config (makefacesconfig) @ myfaces-impl ---
[WARNING] *******************************************************************
[WARNING] RuntimeInstance initializing.
[WARNING] Default ResourceManager initializing. (class org.apache.velocity.runtime.resource.ResourceManagerImpl)
[WARNING] FileResourceLoader : initialization starting.
[WARNING] FileResourceLoader : initialization complete.
[WARNING] RelativeClasspathResourceLoader : initialization complete.
[INFO] RelativeClasspathResourceLoader : adding path 'META-INF'
[WARNING] RelativeClasspathResourceLoader : initialization complete.
[WARNING] Default ResourceManager initialization complete.
[WARNING] Velocimacro : initialization starting.
[WARNING] Velocimacro : VM library registration complete.
[WARNING] Velocimacro : Velocimacro : initialization complete.
[WARNING] RuntimeInstance successfully initialized.
[INFO] using base content file: F:\jenkins\jenkins-slave\workspace\myfaces-current12\current12\core\impl\src\main\conf\META-INF\standard-faces-config-base.xml
[INFO]
[INFO] --- myfaces-builder-plugin:1.0.8:make-tags (make_tags) @ myfaces-impl ---
[INFO] Using template from file loader: F:\jenkins\jenkins-slave\workspace\myfaces-current12\current12\core\impl\src\main\resources\META-INF\tagClass12.vm
[WARNING] *******************************************************************
[WARNING] RuntimeInstance initializing.
[WARNING] Default ResourceManager initializing. (class org.apache.velocity.runtime.resource.ResourceManagerImpl)
[WARNING] FileResourceLoader : initialization starting.
[WARNING] FileResourceLoader : initialization complete.
[WARNING] RelativeClasspathResourceLoader : initialization complete.
[INFO] RelativeClasspathResourceLoader : adding path 'META-INF'
[WARNING] RelativeClasspathResourceLoader : initialization complete.
[WARNING] Default ResourceManager initialization complete.
[WARNING] Velocimacro : initialization starting.
[WARNING] Velocimacro : VM library registration complete.
[WARNING] Velocimacro : Velocimacro : initialization complete.
[WARNING] RuntimeInstance successfully initialized.
[INFO] Generating tag class:org.apache.myfaces.taglib.html.HtmlInputHiddenTag
[INFO] Generating tag class:org.apache.myfaces.taglib.html.HtmlColumnTag
[INFO] Generating tag class:org.apache.myfaces.taglib.html.HtmlCommandButtonTag
[INFO] Generating tag class:org.apache.myfaces.taglib.html.HtmlCommandLinkTag
[INFO] Generating tag class:org.apache.myfaces.taglib.html.HtmlDataTableTag
[INFO] Generating tag class:org.apache.myfaces.taglib.html.HtmlFormTag
[INFO] Generating tag class:org.apache.myfaces.taglib.html.HtmlGraphicImageTag
[INFO] Generating tag class:org.apache.myfaces.taglib.html.HtmlInputSecretTag
[INFO] Generating tag class:org.apache.myfaces.taglib.html.HtmlInputTextTag
[INFO] Generating tag class:org.apache.myfaces.taglib.html.HtmlInputTextareaTag
[INFO] Generating tag class:org.apache.myfaces.taglib.html.HtmlMessageTag
[INFO] Generating tag class:org.apache.myfaces.taglib.html.HtmlMessagesTag
[INFO] Generating tag class:org.apache.myfaces.taglib.html.HtmlOutputFormatTag
[INFO] Generating tag class:org.apache.myfaces.taglib.html.HtmlOutputLabelTag
[INFO] Generating tag class:org.apache.myfaces.taglib.html.HtmlOutputLinkTag
[INFO] Generating tag class:org.apache.myfaces.taglib.html.HtmlOutputTextTag
[INFO] Generating tag class:org.apache.myfaces.taglib.html.HtmlPanelGridTag
[INFO] Generating tag class:org.apache.myfaces.taglib.html.HtmlPanelGroupTag
[INFO] Generating tag class:org.apache.myfaces.taglib.html.HtmlSelectBooleanCheckboxTag
[INFO] Generating tag class:org.apache.myfaces.taglib.html.HtmlSelectManyCheckboxTag
[INFO] Generating tag class:org.apache.myfaces.taglib.html.HtmlSelectManyListboxTag
[INFO] Generating tag class:org.apache.myfaces.taglib.html.HtmlSelectManyMenuTag
[INFO] Generating tag class:org.apache.myfaces.taglib.html.HtmlSelectOneListboxTag
[INFO] Generating tag class:org.apache.myfaces.taglib.html.HtmlSelectOneMenuTag
[INFO] Generating tag class:org.apache.myfaces.taglib.html.HtmlSelectOneRadioTag
[INFO]
[INFO] --- myfaces-builder-plugin:1.0.8:make-config (makecoretld) @ myfaces-impl ---
[WARNING] *******************************************************************
[WARNING] RuntimeInstance initializing.
[WARNING] Default ResourceManager initializing. (class org.apache.velocity.runtime.resource.ResourceManagerImpl)
[WARNING] FileResourceLoader : initialization starting.
[WARNING] FileResourceLoader : initialization complete.
[WARNING] RelativeClasspathResourceLoader : initialization complete.
[INFO] RelativeClasspathResourceLoader : adding path 'META-INF'
[WARNING] RelativeClasspathResourceLoader : initialization complete.
[WARNING] Default ResourceManager initialization complete.
[WARNING] Velocimacro : initialization starting.
[WARNING] Velocimacro : VM library registration complete.
[WARNING] Velocimacro : Velocimacro : initialization complete.
[WARNING] RuntimeInstance successfully initialized.
[INFO] using base content file: F:\jenkins\jenkins-slave\workspace\myfaces-current12\current12\core\impl\src\main\conf\META-INF\myfaces_core-base.tld
[INFO]
[INFO] --- myfaces-builder-plugin:1.0.8:make-config (makehtmltld) @ myfaces-impl ---
[WARNING] *******************************************************************
[WARNING] RuntimeInstance initializing.
[WARNING] Default ResourceManager initializing. (class org.apache.velocity.runtime.resource.ResourceManagerImpl)
[WARNING] FileResourceLoader : initialization starting.
[WARNING] FileResourceLoader : initialization complete.
[WARNING] RelativeClasspathResourceLoader : initialization complete.
[INFO] RelativeClasspathResourceLoader : adding path 'META-INF'
[WARNING] RelativeClasspathResourceLoader : initialization complete.
[WARNING] Default ResourceManager initialization complete.
[WARNING] Velocimacro : initialization starting.
[WARNING] Velocimacro : VM library registration complete.
[WARNING] Velocimacro : Velocimacro : initialization complete.
[WARNING] RuntimeInstance successfully initialized.
[INFO] using base content file: F:\jenkins\jenkins-slave\workspace\myfaces-current12\current12\core\impl\src\main\conf\META-INF\myfaces_html-base.tld
[WARNING] Failed to getClass for org.apache.maven.plugin.source.SourceJarMojo
[INFO]
[INFO] <<< maven-source-plugin:2.0.4:jar (attach-source) @ myfaces-impl <<<
[INFO]
[INFO] --- maven-source-plugin:2.0.4:jar (attach-source) @ myfaces-impl ---
[INFO] Building jar: F:\jenkins\jenkins-slave\workspace\myfaces-current12\current12\core\impl\target\myfaces-impl-1.2.13-SNAPSHOT-sources.jar
[INFO]
[INFO] --- maven-checkstyle-plugin:2.6:check (verify-style) @ myfaces-impl ---
[INFO]
[INFO]
[INFO] --- maven-install-plugin:2.3.1:install (default-install) @ myfaces-impl ---
[INFO] Installing F:\jenkins\jenkins-slave\workspace\myfaces-current12\current12\core\impl\target\myfaces-impl-1.2.13-SNAPSHOT.jar to f:\jenkins\jenkins-slave\maven-repositories\1\org\apache\myfaces\core\myfaces-impl\1.2.13-SNAPSHOT\myfaces-impl-1.2.13-SNAPSHOT.jar
[INFO] Installing F:\jenkins\jenkins-slave\workspace\myfaces-current12\current12\core\impl\pom.xml to f:\jenkins\jenkins-slave\maven-repositories\1\org\apache\myfaces\core\myfaces-impl\1.2.13-SNAPSHOT\myfaces-impl-1.2.13-SNAPSHOT.pom
[INFO] Installing F:\jenkins\jenkins-slave\workspace\myfaces-current12\current12\core\impl\target\myfaces-impl-1.2.13-SNAPSHOT-sources.jar to f:\jenkins\jenkins-slave\maven-repositories\1\org\apache\myfaces\core\myfaces-impl\1.2.13-SNAPSHOT\myfaces-impl-1.2.13-SNAPSHOT-sources.jar
[INFO]
[INFO] ------------------------------------------------------------------------
[INFO] Building Build Project 1.2.10-SNAPSHOT
[INFO] ------------------------------------------------------------------------
[INFO]
[INFO] --- maven-remote-resources-plugin:1.1:process (default) @ myfaces-base ---
[INFO] Setting property: classpath.resource.loader.class => 'org.codehaus.plexus.velocity.ContextClassLoaderResourceLoader'.
[INFO] Setting property: velocimacro.messages.on => 'false'.
[INFO] Setting property: resource.loader => 'classpath'.
[INFO] Setting property: resource.manager.logwhenfound => 'false'.
[INFO]
[INFO] --- maven-install-plugin:2.3:install (default-install) @ myfaces-base ---
[INFO] Installing <https://builds.apache.org/job/myfaces-current12/ws/current12\pom.xml> to f:\jenkins\jenkins-slave\maven-repositories\1\org\apache\myfaces\myfaces-base\1.2.10-SNAPSHOT\myfaces-base-1.2.10-SNAPSHOT.pom
[INFO] ------------------------------------------------------------------------
[INFO] Reactor Summary:
[INFO]
[INFO] Apache MyFaces Shared For JSF 1.2 - Project ....... SUCCESS [11.780s]
[INFO] Apache MyFaces Shared For JSF 1.2 - Core .......... SUCCESS [23.914s]
[INFO] MyFaces Shared Impl ............................... SUCCESS [18.339s]
[INFO] MyFaces Shared Tomahawk ........................... SUCCESS [14.727s]
[INFO] Apache MyFaces JSF-1.2 Core Project ............... SUCCESS [4.310s]
[INFO] Apache Myfaces JSF Core-1.2 API ................... SUCCESS [1:01.796s]
[INFO] Apache MyFaces JSF-1.2 Core Impl .................. SUCCESS [48.279s]
[INFO] Build Project ..................................... SUCCESS [5.827s]
[INFO] ------------------------------------------------------------------------
[INFO] BUILD SUCCESS
[INFO] ------------------------------------------------------------------------
[INFO] Total time: 3:15.720s
[INFO] Finished at: Mon Jun 09 17:26:01 PDT 2014
[INFO] Final Memory: 53M/127M
[INFO] ------------------------------------------------------------------------
Waiting for Jenkins to finish collecting data
[JENKINS] Archiving F:\jenkins\jenkins-slave\workspace\myfaces-current12\current12\shared\shared-tomahawk\pom.xml to org.apache.myfaces.shared/myfaces-shared-tomahawk/3.0.13-SNAPSHOT/myfaces-shared-tomahawk-3.0.13-SNAPSHOT.pom
[JENKINS] Archiving F:\jenkins\jenkins-slave\workspace\myfaces-current12\current12\shared\shared-tomahawk\target\myfaces-shared-tomahawk-3.0.13-SNAPSHOT.jar to org.apache.myfaces.shared/myfaces-shared-tomahawk/3.0.13-SNAPSHOT/myfaces-shared-tomahawk-3.0.13-SNAPSHOT.jar
[JENKINS] Archiving F:\jenkins\jenkins-slave\workspace\myfaces-current12\current12\shared\shared-tomahawk\target\myfaces-shared-tomahawk-3.0.13-SNAPSHOT-sources.jar to org.apache.myfaces.shared/myfaces-shared-tomahawk/3.0.13-SNAPSHOT/myfaces-shared-tomahawk-3.0.13-SNAPSHOT-sources.jar
Sending artifact delta relative to myfaces-current12 » MyFaces Shared Tomahawk #1178
Archived 3 artifacts
Archive block size is 32768
Received 0 blocks and 564372 bytes
Compression is 0.0%
Took 2.4 sec
[JENKINS] Archiving F:\jenkins\jenkins-slave\workspace\myfaces-current12\current12\core\impl\pom.xml to org.apache.myfaces.core/myfaces-impl/1.2.13-SNAPSHOT/myfaces-impl-1.2.13-SNAPSHOT.pom
[JENKINS] Archiving F:\jenkins\jenkins-slave\workspace\myfaces-current12\current12\core\impl\target\myfaces-impl-1.2.13-SNAPSHOT.jar to org.apache.myfaces.core/myfaces-impl/1.2.13-SNAPSHOT/myfaces-impl-1.2.13-SNAPSHOT.jar
[JENKINS] Archiving F:\jenkins\jenkins-slave\workspace\myfaces-current12\current12\core\impl\target\myfaces-impl-1.2.13-SNAPSHOT-sources.jar to org.apache.myfaces.core/myfaces-impl/1.2.13-SNAPSHOT/myfaces-impl-1.2.13-SNAPSHOT-sources.jar
Sending artifact delta relative to myfaces-current12 » Apache MyFaces JSF-1.2 Core Impl #1178
Archived 3 artifacts
Archive block size is 32768
Received 33 blocks and 530468 bytes
Compression is 67.1%
Took 0.35 sec
[JENKINS] Archiving F:\jenkins\jenkins-slave\workspace\myfaces-current12\current12\shared\shared-impl\pom.xml to org.apache.myfaces.shared/myfaces-shared-impl/3.0.13-SNAPSHOT/myfaces-shared-impl-3.0.13-SNAPSHOT.pom
[JENKINS] Archiving F:\jenkins\jenkins-slave\workspace\myfaces-current12\current12\shared\shared-impl\target\myfaces-shared-impl-3.0.13-SNAPSHOT.jar to org.apache.myfaces.shared/myfaces-shared-impl/3.0.13-SNAPSHOT/myfaces-shared-impl-3.0.13-SNAPSHOT.jar
[JENKINS] Archiving F:\jenkins\jenkins-slave\workspace\myfaces-current12\current12\shared\shared-impl\target\myfaces-shared-impl-3.0.13-SNAPSHOT-sources.jar to org.apache.myfaces.shared/myfaces-shared-impl/3.0.13-SNAPSHOT/myfaces-shared-impl-3.0.13-SNAPSHOT-sources.jar
Sending artifact delta relative to myfaces-current12 » MyFaces Shared Impl #1178
Archived 3 artifacts
Archive block size is 32768
Received 0 blocks and 560561 bytes
Compression is 0.0%
Took 1.8 sec
[JENKINS] Archiving F:\jenkins\jenkins-slave\workspace\myfaces-current12\current12\shared\core\pom.xml to org.apache.myfaces.shared/myfaces-shared-core/3.0.13-SNAPSHOT/myfaces-shared-core-3.0.13-SNAPSHOT.pom
[JENKINS] Archiving F:\jenkins\jenkins-slave\workspace\myfaces-current12\current12\shared\core\target\myfaces-shared-core-3.0.13-SNAPSHOT.jar to org.apache.myfaces.shared/myfaces-shared-core/3.0.13-SNAPSHOT/myfaces-shared-core-3.0.13-SNAPSHOT.jar
[JENKINS] Archiving F:\jenkins\jenkins-slave\workspace\myfaces-current12\current12\shared\core\target\myfaces-shared-core-3.0.13-SNAPSHOT-sources.jar to org.apache.myfaces.shared/myfaces-shared-core/3.0.13-SNAPSHOT/myfaces-shared-core-3.0.13-SNAPSHOT-sources.jar
Sending artifact delta relative to myfaces-current12 » Apache MyFaces Shared For JSF 1.2 - Core #1178
Archived 3 artifacts
Archive block size is 32768
Received 14 blocks and 104977 bytes
Compression is 81.4%
Took 0.32 sec
[JENKINS] Archiving F:\jenkins\jenkins-slave\workspace\myfaces-current12\current12\core\api\pom.xml to org.apache.myfaces.core/myfaces-api/1.2.13-SNAPSHOT/myfaces-api-1.2.13-SNAPSHOT.pom
[JENKINS] Archiving F:\jenkins\jenkins-slave\workspace\myfaces-current12\current12\core\api\target\myfaces-api-1.2.13-SNAPSHOT.jar to org.apache.myfaces.core/myfaces-api/1.2.13-SNAPSHOT/myfaces-api-1.2.13-SNAPSHOT.jar
[JENKINS] Archiving F:\jenkins\jenkins-slave\workspace\myfaces-current12\current12\core\api\target\myfaces-api-1.2.13-SNAPSHOT-sources.jar to org.apache.myfaces.core/myfaces-api/1.2.13-SNAPSHOT/myfaces-api-1.2.13-SNAPSHOT-sources.jar
[JENKINS] Archiving F:\jenkins\jenkins-slave\workspace\myfaces-current12\current12\core\api\target\myfaces-api-1.2.13-SNAPSHOT-tests.jar to org.apache.myfaces.core/myfaces-api/1.2.13-SNAPSHOT/myfaces-api-1.2.13-SNAPSHOT-tests.jar
Sending artifact delta relative to myfaces-current12 » Apache Myfaces JSF Core-1.2 API #1178
Archived 4 artifacts
Archive block size is 32768
Received 15 blocks and 525399 bytes
Compression is 48.3%
Took 0.33 sec
[JENKINS] Archiving F:\jenkins\jenkins-slave\workspace\myfaces-current12\current12\shared\pom.xml to org.apache.myfaces.shared/myfaces-shared-project/3.0.13-SNAPSHOT/myfaces-shared-project-3.0.13-SNAPSHOT.pom
[JENKINS] Archiving F:\jenkins\jenkins-slave\workspace\myfaces-current12\current12\shared\target\myfaces-shared-project-3.0.13-SNAPSHOT-site.xml to org.apache.myfaces.shared/myfaces-shared-project/3.0.13-SNAPSHOT/myfaces-shared-project-3.0.13-SNAPSHOT-site.xml
Sending artifact delta relative to myfaces-current12 » Apache MyFaces Shared For JSF 1.2 - Project #1178
Archived 2 artifacts
Archive block size is 32768
Received 0 blocks and 10524 bytes
Compression is 0.0%
Took 1.6 sec
[JENKINS] Archiving F:\jenkins\jenkins-slave\workspace\myfaces-current12\current12\core\pom.xml to org.apache.myfaces.core/myfaces-core-project/1.2.13-SNAPSHOT/myfaces-core-project-1.2.13-SNAPSHOT.pom
[JENKINS] Archiving F:\jenkins\jenkins-slave\workspace\myfaces-current12\current12\core\target\myfaces-core-project-1.2.13-SNAPSHOT-site.xml to org.apache.myfaces.core/myfaces-core-project/1.2.13-SNAPSHOT/myfaces-core-project-1.2.13-SNAPSHOT-site.xml
Sending artifact delta relative to myfaces-current12 » Apache MyFaces JSF-1.2 Core Project #1178
Archived 2 artifacts
Archive block size is 32768
Received 0 blocks and 24305 bytes
Compression is 0.0%
Took 0.16 sec
[JENKINS] Archiving <https://builds.apache.org/job/myfaces-current12/ws/current12\pom.xml> to org.apache.myfaces/myfaces-base/1.2.10-SNAPSHOT/myfaces-base-1.2.10-SNAPSHOT.pom
Sending artifact delta relative to myfaces-current12 » Build Project #1178
Archived 1 artifacts
Archive block size is 32768
Received 0 blocks and 1228 bytes
Compression is 0.0%
Took 0.12 sec
channel stopped
Maven RedeployPublisher use remote windows2 maven settings from : f:\jenkins\tools\maven\latest/conf/settings.xml
[ERROR] uniqueVersion == false is not anymore supported in maven 3
[INFO] Deployment in https://repository.apache.org/content/repositories/snapshots (id=apache.snapshots.https,uniqueVersion=false)
Deploying the main artifact myfaces-base-1.2.10-SNAPSHOT.pom
Downloading: https://repository.apache.org/content/repositories/snapshots/org/apache/myfaces/myfaces-base/1.2.10-SNAPSHOT/maven-metadata.xml
Downloaded: https://repository.apache.org/content/repositories/snapshots/org/apache/myfaces/myfaces-base/1.2.10-SNAPSHOT/maven-metadata.xml (613 B at 1.7 KB/sec)
Uploading: https://repository.apache.org/content/repositories/snapshots/org/apache/myfaces/myfaces-base/1.2.10-SNAPSHOT/myfaces-base-1.2.10-20140610.002616-556.pom
ERROR: Failed to deploy artifacts: Could not transfer artifact org.apache.myfaces:myfaces-base:pom:1.2.10-20140610.002616-556 from/to apache.snapshots.https (https://repository.apache.org/content/repositories/snapshots): Failed to transfer file: https://repository.apache.org/content/repositories/snapshots/org/apache/myfaces/myfaces-base/1.2.10-SNAPSHOT/myfaces-base-1.2.10-20140610.002616-556.pom. Return code is: 401, ReasonPhrase: Unauthorized.
org.apache.maven.artifact.deployer.ArtifactDeploymentException: Failed to deploy artifacts: Could not transfer artifact org.apache.myfaces:myfaces-base:pom:1.2.10-20140610.002616-556 from/to apache.snapshots.https (https://repository.apache.org/content/repositories/snapshots): Failed to transfer file: https://repository.apache.org/content/repositories/snapshots/org/apache/myfaces/myfaces-base/1.2.10-SNAPSHOT/myfaces-base-1.2.10-20140610.002616-556.pom. Return code is: 401, ReasonPhrase: Unauthorized.
at org.apache.maven.artifact.deployer.DefaultArtifactDeployer.deploy(DefaultArtifactDeployer.java:143)
at hudson.maven.reporters.MavenArtifactRecord.deploy(MavenArtifactRecord.java:193)
at hudson.maven.RedeployPublisher.perform(RedeployPublisher.java:176)
at hudson.tasks.BuildStepMonitor$1.perform(BuildStepMonitor.java:20)
at hudson.model.AbstractBuild$AbstractBuildExecution.perform(AbstractBuild.java:804)
at hudson.model.AbstractBuild$AbstractBuildExecution.performAllBuildSteps(AbstractBuild.java:776)
at hudson.maven.MavenModuleSetBuild$MavenModuleSetBuildExecution.post2(MavenModuleSetBuild.java:1040)
at hudson.model.AbstractBuild$AbstractBuildExecution.post(AbstractBuild.java:725)
at hudson.model.Run.execute(Run.java:1701)
at hudson.maven.MavenModuleSetBuild.run(MavenModuleSetBuild.java:529)
at hudson.model.ResourceController.execute(ResourceController.java:88)
at hudson.model.Executor.run(Executor.java:231)
Caused by: org.eclipse.aether.deployment.DeploymentException: Failed to deploy artifacts: Could not transfer artifact org.apache.myfaces:myfaces-base:pom:1.2.10-20140610.002616-556 from/to apache.snapshots.https (https://repository.apache.org/content/repositories/snapshots): Failed to transfer file: https://repository.apache.org/content/repositories/snapshots/org/apache/myfaces/myfaces-base/1.2.10-SNAPSHOT/myfaces-base-1.2.10-20140610.002616-556.pom. Return code is: 401, ReasonPhrase: Unauthorized.
at org.eclipse.aether.internal.impl.DefaultDeployer.deploy(DefaultDeployer.java:341)
at org.eclipse.aether.internal.impl.DefaultDeployer.deploy(DefaultDeployer.java:269)
at org.eclipse.aether.internal.impl.DefaultRepositorySystem.deploy(DefaultRepositorySystem.java:413)
at org.apache.maven.artifact.deployer.DefaultArtifactDeployer.deploy(DefaultArtifactDeployer.java:139)
... 11 more
Caused by: org.eclipse.aether.transfer.ArtifactTransferException: Could not transfer artifact org.apache.myfaces:myfaces-base:pom:1.2.10-20140610.002616-556 from/to apache.snapshots.https (https://repository.apache.org/content/repositories/snapshots): Failed to transfer file: https://repository.apache.org/content/repositories/snapshots/org/apache/myfaces/myfaces-base/1.2.10-SNAPSHOT/myfaces-base-1.2.10-20140610.002616-556.pom. Return code is: 401, ReasonPhrase: Unauthorized.
at org.eclipse.aether.connector.wagon.WagonRepositoryConnector$6.wrap(WagonRepositoryConnector.java:1016)
at org.eclipse.aether.connector.wagon.WagonRepositoryConnector$6.wrap(WagonRepositoryConnector.java:1004)
at org.eclipse.aether.connector.wagon.WagonRepositoryConnector$PutTask.run(WagonRepositoryConnector.java:895)
at org.eclipse.aether.connector.wagon.WagonRepositoryConnector.put(WagonRepositoryConnector.java:522)
at org.eclipse.aether.internal.impl.DefaultDeployer.deploy(DefaultDeployer.java:335)
... 14 more
Caused by: org.apache.maven.wagon.TransferFailedException: Failed to transfer file: https://repository.apache.org/content/repositories/snapshots/org/apache/myfaces/myfaces-base/1.2.10-SNAPSHOT/myfaces-base-1.2.10-20140610.002616-556.pom. Return code is: 401, ReasonPhrase: Unauthorized.
at org.apache.maven.wagon.shared.http4.AbstractHttpClientWagon.put(AbstractHttpClientWagon.java:626)
at org.apache.maven.wagon.shared.http4.AbstractHttpClientWagon.put(AbstractHttpClientWagon.java:524)
at org.apache.maven.wagon.shared.http4.AbstractHttpClientWagon.put(AbstractHttpClientWagon.java:505)
at org.apache.maven.wagon.shared.http4.AbstractHttpClientWagon.put(AbstractHttpClientWagon.java:485)
at org.eclipse.aether.connector.wagon.WagonRepositoryConnector$PutTask.run(WagonRepositoryConnector.java:871)
... 16 more
[INFO] Deployment failed after 2.8 sec
Build step 'Deploy artifacts to Maven repository' changed build result to FAILURE
Build failed in Jenkins: myfaces-current12 #1178
Posted by Apache Jenkins Server <je...@builds.apache.org>.
See <https://builds.apache.org/job/myfaces-current12/1178/>
------------------------------------------
[...truncated 1566 lines...]
Artifact: myfaces-api-1.2.13-SNAPSHOT.jar have META-INF/myfaces-metadata.xml
[INFO]
[INFO] --- myfaces-builder-plugin:1.0.8:make-config (makefacesconfig) @ myfaces-impl ---
[WARNING] *******************************************************************
[WARNING] RuntimeInstance initializing.
[WARNING] Default ResourceManager initializing. (class org.apache.velocity.runtime.resource.ResourceManagerImpl)
[WARNING] FileResourceLoader : initialization starting.
[WARNING] FileResourceLoader : initialization complete.
[WARNING] RelativeClasspathResourceLoader : initialization complete.
[INFO] RelativeClasspathResourceLoader : adding path 'META-INF'
[WARNING] RelativeClasspathResourceLoader : initialization complete.
[WARNING] Default ResourceManager initialization complete.
[WARNING] Velocimacro : initialization starting.
[WARNING] Velocimacro : VM library registration complete.
[WARNING] Velocimacro : Velocimacro : initialization complete.
[WARNING] RuntimeInstance successfully initialized.
[INFO] using base content file: F:\jenkins\jenkins-slave\workspace\myfaces-current12\current12\core\impl\src\main\conf\META-INF\standard-faces-config-base.xml
[INFO]
[INFO] --- myfaces-builder-plugin:1.0.8:make-tags (make_tags) @ myfaces-impl ---
[INFO] Using template from file loader: F:\jenkins\jenkins-slave\workspace\myfaces-current12\current12\core\impl\src\main\resources\META-INF\tagClass12.vm
[WARNING] *******************************************************************
[WARNING] RuntimeInstance initializing.
[WARNING] Default ResourceManager initializing. (class org.apache.velocity.runtime.resource.ResourceManagerImpl)
[WARNING] FileResourceLoader : initialization starting.
[WARNING] FileResourceLoader : initialization complete.
[WARNING] RelativeClasspathResourceLoader : initialization complete.
[INFO] RelativeClasspathResourceLoader : adding path 'META-INF'
[WARNING] RelativeClasspathResourceLoader : initialization complete.
[WARNING] Default ResourceManager initialization complete.
[WARNING] Velocimacro : initialization starting.
[WARNING] Velocimacro : VM library registration complete.
[WARNING] Velocimacro : Velocimacro : initialization complete.
[WARNING] RuntimeInstance successfully initialized.
[INFO] Generating tag class:org.apache.myfaces.taglib.html.HtmlInputHiddenTag
[INFO] Generating tag class:org.apache.myfaces.taglib.html.HtmlColumnTag
[INFO] Generating tag class:org.apache.myfaces.taglib.html.HtmlCommandButtonTag
[INFO] Generating tag class:org.apache.myfaces.taglib.html.HtmlCommandLinkTag
[INFO] Generating tag class:org.apache.myfaces.taglib.html.HtmlDataTableTag
[INFO] Generating tag class:org.apache.myfaces.taglib.html.HtmlFormTag
[INFO] Generating tag class:org.apache.myfaces.taglib.html.HtmlGraphicImageTag
[INFO] Generating tag class:org.apache.myfaces.taglib.html.HtmlInputSecretTag
[INFO] Generating tag class:org.apache.myfaces.taglib.html.HtmlInputTextTag
[INFO] Generating tag class:org.apache.myfaces.taglib.html.HtmlInputTextareaTag
[INFO] Generating tag class:org.apache.myfaces.taglib.html.HtmlMessageTag
[INFO] Generating tag class:org.apache.myfaces.taglib.html.HtmlMessagesTag
[INFO] Generating tag class:org.apache.myfaces.taglib.html.HtmlOutputFormatTag
[INFO] Generating tag class:org.apache.myfaces.taglib.html.HtmlOutputLabelTag
[INFO] Generating tag class:org.apache.myfaces.taglib.html.HtmlOutputLinkTag
[INFO] Generating tag class:org.apache.myfaces.taglib.html.HtmlOutputTextTag
[INFO] Generating tag class:org.apache.myfaces.taglib.html.HtmlPanelGridTag
[INFO] Generating tag class:org.apache.myfaces.taglib.html.HtmlPanelGroupTag
[INFO] Generating tag class:org.apache.myfaces.taglib.html.HtmlSelectBooleanCheckboxTag
[INFO] Generating tag class:org.apache.myfaces.taglib.html.HtmlSelectManyCheckboxTag
[INFO] Generating tag class:org.apache.myfaces.taglib.html.HtmlSelectManyListboxTag
[INFO] Generating tag class:org.apache.myfaces.taglib.html.HtmlSelectManyMenuTag
[INFO] Generating tag class:org.apache.myfaces.taglib.html.HtmlSelectOneListboxTag
[INFO] Generating tag class:org.apache.myfaces.taglib.html.HtmlSelectOneMenuTag
[INFO] Generating tag class:org.apache.myfaces.taglib.html.HtmlSelectOneRadioTag
[INFO]
[INFO] --- myfaces-builder-plugin:1.0.8:make-config (makecoretld) @ myfaces-impl ---
[WARNING] *******************************************************************
[WARNING] RuntimeInstance initializing.
[WARNING] Default ResourceManager initializing. (class org.apache.velocity.runtime.resource.ResourceManagerImpl)
[WARNING] FileResourceLoader : initialization starting.
[WARNING] FileResourceLoader : initialization complete.
[WARNING] RelativeClasspathResourceLoader : initialization complete.
[INFO] RelativeClasspathResourceLoader : adding path 'META-INF'
[WARNING] RelativeClasspathResourceLoader : initialization complete.
[WARNING] Default ResourceManager initialization complete.
[WARNING] Velocimacro : initialization starting.
[WARNING] Velocimacro : VM library registration complete.
[WARNING] Velocimacro : Velocimacro : initialization complete.
[WARNING] RuntimeInstance successfully initialized.
[INFO] using base content file: F:\jenkins\jenkins-slave\workspace\myfaces-current12\current12\core\impl\src\main\conf\META-INF\myfaces_core-base.tld
[INFO]
[INFO] --- myfaces-builder-plugin:1.0.8:make-config (makehtmltld) @ myfaces-impl ---
[WARNING] *******************************************************************
[WARNING] RuntimeInstance initializing.
[WARNING] Default ResourceManager initializing. (class org.apache.velocity.runtime.resource.ResourceManagerImpl)
[WARNING] FileResourceLoader : initialization starting.
[WARNING] FileResourceLoader : initialization complete.
[WARNING] RelativeClasspathResourceLoader : initialization complete.
[INFO] RelativeClasspathResourceLoader : adding path 'META-INF'
[WARNING] RelativeClasspathResourceLoader : initialization complete.
[WARNING] Default ResourceManager initialization complete.
[WARNING] Velocimacro : initialization starting.
[WARNING] Velocimacro : VM library registration complete.
[WARNING] Velocimacro : Velocimacro : initialization complete.
[WARNING] RuntimeInstance successfully initialized.
[INFO] using base content file: F:\jenkins\jenkins-slave\workspace\myfaces-current12\current12\core\impl\src\main\conf\META-INF\myfaces_html-base.tld
[WARNING] Failed to getClass for org.apache.maven.plugin.source.SourceJarMojo
[INFO]
[INFO] <<< maven-source-plugin:2.0.4:jar (attach-source) @ myfaces-impl <<<
[INFO]
[INFO] --- maven-source-plugin:2.0.4:jar (attach-source) @ myfaces-impl ---
[INFO] Building jar: F:\jenkins\jenkins-slave\workspace\myfaces-current12\current12\core\impl\target\myfaces-impl-1.2.13-SNAPSHOT-sources.jar
[INFO]
[INFO] --- maven-checkstyle-plugin:2.6:check (verify-style) @ myfaces-impl ---
[INFO]
[INFO]
[INFO] --- maven-install-plugin:2.3.1:install (default-install) @ myfaces-impl ---
[INFO] Installing F:\jenkins\jenkins-slave\workspace\myfaces-current12\current12\core\impl\target\myfaces-impl-1.2.13-SNAPSHOT.jar to f:\jenkins\jenkins-slave\maven-repositories\1\org\apache\myfaces\core\myfaces-impl\1.2.13-SNAPSHOT\myfaces-impl-1.2.13-SNAPSHOT.jar
[INFO] Installing F:\jenkins\jenkins-slave\workspace\myfaces-current12\current12\core\impl\pom.xml to f:\jenkins\jenkins-slave\maven-repositories\1\org\apache\myfaces\core\myfaces-impl\1.2.13-SNAPSHOT\myfaces-impl-1.2.13-SNAPSHOT.pom
[INFO] Installing F:\jenkins\jenkins-slave\workspace\myfaces-current12\current12\core\impl\target\myfaces-impl-1.2.13-SNAPSHOT-sources.jar to f:\jenkins\jenkins-slave\maven-repositories\1\org\apache\myfaces\core\myfaces-impl\1.2.13-SNAPSHOT\myfaces-impl-1.2.13-SNAPSHOT-sources.jar
[INFO]
[INFO] ------------------------------------------------------------------------
[INFO] Building Build Project 1.2.10-SNAPSHOT
[INFO] ------------------------------------------------------------------------
[INFO]
[INFO] --- maven-remote-resources-plugin:1.1:process (default) @ myfaces-base ---
[INFO] Setting property: classpath.resource.loader.class => 'org.codehaus.plexus.velocity.ContextClassLoaderResourceLoader'.
[INFO] Setting property: velocimacro.messages.on => 'false'.
[INFO] Setting property: resource.loader => 'classpath'.
[INFO] Setting property: resource.manager.logwhenfound => 'false'.
[INFO]
[INFO] --- maven-install-plugin:2.3:install (default-install) @ myfaces-base ---
[INFO] Installing <https://builds.apache.org/job/myfaces-current12/ws/current12\pom.xml> to f:\jenkins\jenkins-slave\maven-repositories\1\org\apache\myfaces\myfaces-base\1.2.10-SNAPSHOT\myfaces-base-1.2.10-SNAPSHOT.pom
[INFO] ------------------------------------------------------------------------
[INFO] Reactor Summary:
[INFO]
[INFO] Apache MyFaces Shared For JSF 1.2 - Project ....... SUCCESS [15.231s]
[INFO] Apache MyFaces Shared For JSF 1.2 - Core .......... SUCCESS [26.872s]
[INFO] MyFaces Shared Impl ............................... SUCCESS [14.340s]
[INFO] MyFaces Shared Tomahawk ........................... SUCCESS [11.991s]
[INFO] Apache MyFaces JSF-1.2 Core Project ............... SUCCESS [5.239s]
[INFO] Apache Myfaces JSF Core-1.2 API ................... SUCCESS [45.386s]
[INFO] Apache MyFaces JSF-1.2 Core Impl .................. SUCCESS [54.391s]
[INFO] Build Project ..................................... SUCCESS [2.589s]
[INFO] ------------------------------------------------------------------------
[INFO] BUILD SUCCESS
[INFO] ------------------------------------------------------------------------
[INFO] Total time: 3:01.976s
[INFO] Finished at: Mon Jun 09 15:38:44 PDT 2014
[INFO] Final Memory: 53M/127M
[INFO] ------------------------------------------------------------------------
Waiting for Jenkins to finish collecting data
[JENKINS] Archiving F:\jenkins\jenkins-slave\workspace\myfaces-current12\current12\shared\shared-tomahawk\pom.xml to org.apache.myfaces.shared/myfaces-shared-tomahawk/3.0.13-SNAPSHOT/myfaces-shared-tomahawk-3.0.13-SNAPSHOT.pom
[JENKINS] Archiving F:\jenkins\jenkins-slave\workspace\myfaces-current12\current12\shared\shared-tomahawk\target\myfaces-shared-tomahawk-3.0.13-SNAPSHOT.jar to org.apache.myfaces.shared/myfaces-shared-tomahawk/3.0.13-SNAPSHOT/myfaces-shared-tomahawk-3.0.13-SNAPSHOT.jar
[JENKINS] Archiving F:\jenkins\jenkins-slave\workspace\myfaces-current12\current12\shared\shared-tomahawk\target\myfaces-shared-tomahawk-3.0.13-SNAPSHOT-sources.jar to org.apache.myfaces.shared/myfaces-shared-tomahawk/3.0.13-SNAPSHOT/myfaces-shared-tomahawk-3.0.13-SNAPSHOT-sources.jar
Sending artifact delta relative to myfaces-current12 » MyFaces Shared Tomahawk #1177
Archived 3 artifacts
Archive block size is 32768
Received 0 blocks and 564372 bytes
Compression is 0.0%
Took 2.7 sec
[JENKINS] Archiving F:\jenkins\jenkins-slave\workspace\myfaces-current12\current12\core\impl\pom.xml to org.apache.myfaces.core/myfaces-impl/1.2.13-SNAPSHOT/myfaces-impl-1.2.13-SNAPSHOT.pom
[JENKINS] Archiving F:\jenkins\jenkins-slave\workspace\myfaces-current12\current12\core\impl\target\myfaces-impl-1.2.13-SNAPSHOT.jar to org.apache.myfaces.core/myfaces-impl/1.2.13-SNAPSHOT/myfaces-impl-1.2.13-SNAPSHOT.jar
[JENKINS] Archiving F:\jenkins\jenkins-slave\workspace\myfaces-current12\current12\core\impl\target\myfaces-impl-1.2.13-SNAPSHOT-sources.jar to org.apache.myfaces.core/myfaces-impl/1.2.13-SNAPSHOT/myfaces-impl-1.2.13-SNAPSHOT-sources.jar
Sending artifact delta relative to myfaces-current12 » Apache MyFaces JSF-1.2 Core Impl #1177
Archived 3 artifacts
Archive block size is 32768
Received 33 blocks and 530468 bytes
Compression is 67.1%
Took 0.4 sec
[JENKINS] Archiving F:\jenkins\jenkins-slave\workspace\myfaces-current12\current12\shared\shared-impl\pom.xml to org.apache.myfaces.shared/myfaces-shared-impl/3.0.13-SNAPSHOT/myfaces-shared-impl-3.0.13-SNAPSHOT.pom
[JENKINS] Archiving F:\jenkins\jenkins-slave\workspace\myfaces-current12\current12\shared\shared-impl\target\myfaces-shared-impl-3.0.13-SNAPSHOT.jar to org.apache.myfaces.shared/myfaces-shared-impl/3.0.13-SNAPSHOT/myfaces-shared-impl-3.0.13-SNAPSHOT.jar
[JENKINS] Archiving F:\jenkins\jenkins-slave\workspace\myfaces-current12\current12\shared\shared-impl\target\myfaces-shared-impl-3.0.13-SNAPSHOT-sources.jar to org.apache.myfaces.shared/myfaces-shared-impl/3.0.13-SNAPSHOT/myfaces-shared-impl-3.0.13-SNAPSHOT-sources.jar
Sending artifact delta relative to myfaces-current12 » MyFaces Shared Impl #1177
Archived 3 artifacts
Archive block size is 32768
Received 0 blocks and 560561 bytes
Compression is 0.0%
Took 0.72 sec
[JENKINS] Archiving F:\jenkins\jenkins-slave\workspace\myfaces-current12\current12\shared\core\pom.xml to org.apache.myfaces.shared/myfaces-shared-core/3.0.13-SNAPSHOT/myfaces-shared-core-3.0.13-SNAPSHOT.pom
[JENKINS] Archiving F:\jenkins\jenkins-slave\workspace\myfaces-current12\current12\shared\core\target\myfaces-shared-core-3.0.13-SNAPSHOT.jar to org.apache.myfaces.shared/myfaces-shared-core/3.0.13-SNAPSHOT/myfaces-shared-core-3.0.13-SNAPSHOT.jar
[JENKINS] Archiving F:\jenkins\jenkins-slave\workspace\myfaces-current12\current12\shared\core\target\myfaces-shared-core-3.0.13-SNAPSHOT-sources.jar to org.apache.myfaces.shared/myfaces-shared-core/3.0.13-SNAPSHOT/myfaces-shared-core-3.0.13-SNAPSHOT-sources.jar
Sending artifact delta relative to myfaces-current12 » Apache MyFaces Shared For JSF 1.2 - Core #1177
Archived 3 artifacts
Archive block size is 32768
Received 14 blocks and 104977 bytes
Compression is 81.4%
Took 1.5 sec
[JENKINS] Archiving F:\jenkins\jenkins-slave\workspace\myfaces-current12\current12\core\api\pom.xml to org.apache.myfaces.core/myfaces-api/1.2.13-SNAPSHOT/myfaces-api-1.2.13-SNAPSHOT.pom
[JENKINS] Archiving F:\jenkins\jenkins-slave\workspace\myfaces-current12\current12\core\api\target\myfaces-api-1.2.13-SNAPSHOT.jar to org.apache.myfaces.core/myfaces-api/1.2.13-SNAPSHOT/myfaces-api-1.2.13-SNAPSHOT.jar
[JENKINS] Archiving F:\jenkins\jenkins-slave\workspace\myfaces-current12\current12\core\api\target\myfaces-api-1.2.13-SNAPSHOT-sources.jar to org.apache.myfaces.core/myfaces-api/1.2.13-SNAPSHOT/myfaces-api-1.2.13-SNAPSHOT-sources.jar
[JENKINS] Archiving F:\jenkins\jenkins-slave\workspace\myfaces-current12\current12\core\api\target\myfaces-api-1.2.13-SNAPSHOT-tests.jar to org.apache.myfaces.core/myfaces-api/1.2.13-SNAPSHOT/myfaces-api-1.2.13-SNAPSHOT-tests.jar
Sending artifact delta relative to myfaces-current12 » Apache Myfaces JSF Core-1.2 API #1177
Archived 4 artifacts
Archive block size is 32768
Received 15 blocks and 525403 bytes
Compression is 48.3%
Took 0.47 sec
[JENKINS] Archiving F:\jenkins\jenkins-slave\workspace\myfaces-current12\current12\shared\pom.xml to org.apache.myfaces.shared/myfaces-shared-project/3.0.13-SNAPSHOT/myfaces-shared-project-3.0.13-SNAPSHOT.pom
[JENKINS] Archiving F:\jenkins\jenkins-slave\workspace\myfaces-current12\current12\shared\target\myfaces-shared-project-3.0.13-SNAPSHOT-site.xml to org.apache.myfaces.shared/myfaces-shared-project/3.0.13-SNAPSHOT/myfaces-shared-project-3.0.13-SNAPSHOT-site.xml
Sending artifact delta relative to myfaces-current12 » Apache MyFaces Shared For JSF 1.2 - Project #1177
Archived 2 artifacts
Archive block size is 32768
Received 0 blocks and 10524 bytes
Compression is 0.0%
Took 93 ms
[JENKINS] Archiving F:\jenkins\jenkins-slave\workspace\myfaces-current12\current12\core\pom.xml to org.apache.myfaces.core/myfaces-core-project/1.2.13-SNAPSHOT/myfaces-core-project-1.2.13-SNAPSHOT.pom
[JENKINS] Archiving F:\jenkins\jenkins-slave\workspace\myfaces-current12\current12\core\target\myfaces-core-project-1.2.13-SNAPSHOT-site.xml to org.apache.myfaces.core/myfaces-core-project/1.2.13-SNAPSHOT/myfaces-core-project-1.2.13-SNAPSHOT-site.xml
Sending artifact delta relative to myfaces-current12 » Apache MyFaces JSF-1.2 Core Project #1177
Archived 2 artifacts
Archive block size is 32768
Received 0 blocks and 24305 bytes
Compression is 0.0%
Took 35 ms
[JENKINS] Archiving <https://builds.apache.org/job/myfaces-current12/ws/current12\pom.xml> to org.apache.myfaces/myfaces-base/1.2.10-SNAPSHOT/myfaces-base-1.2.10-SNAPSHOT.pom
Sending artifact delta relative to myfaces-current12 » Build Project #1177
Archived 1 artifacts
Archive block size is 32768
Received 0 blocks and 1228 bytes
Compression is 0.0%
Took 41 ms
channel stopped
Maven RedeployPublisher use remote windows2 maven settings from : f:\jenkins\tools\maven\latest/conf/settings.xml
[ERROR] uniqueVersion == false is not anymore supported in maven 3
[INFO] Deployment in https://repository.apache.org/content/repositories/snapshots (id=apache.snapshots.https,uniqueVersion=false)
Deploying the main artifact myfaces-base-1.2.10-SNAPSHOT.pom
Downloading: https://repository.apache.org/content/repositories/snapshots/org/apache/myfaces/myfaces-base/1.2.10-SNAPSHOT/maven-metadata.xml
Downloaded: https://repository.apache.org/content/repositories/snapshots/org/apache/myfaces/myfaces-base/1.2.10-SNAPSHOT/maven-metadata.xml (613 B at 0.8 KB/sec)
Uploading: https://repository.apache.org/content/repositories/snapshots/org/apache/myfaces/myfaces-base/1.2.10-SNAPSHOT/myfaces-base-1.2.10-20140609.223858-556.pom
ERROR: Failed to deploy artifacts: Could not transfer artifact org.apache.myfaces:myfaces-base:pom:1.2.10-20140609.223858-556 from/to apache.snapshots.https (https://repository.apache.org/content/repositories/snapshots): Failed to transfer file: https://repository.apache.org/content/repositories/snapshots/org/apache/myfaces/myfaces-base/1.2.10-SNAPSHOT/myfaces-base-1.2.10-20140609.223858-556.pom. Return code is: 401, ReasonPhrase: Unauthorized.
org.apache.maven.artifact.deployer.ArtifactDeploymentException: Failed to deploy artifacts: Could not transfer artifact org.apache.myfaces:myfaces-base:pom:1.2.10-20140609.223858-556 from/to apache.snapshots.https (https://repository.apache.org/content/repositories/snapshots): Failed to transfer file: https://repository.apache.org/content/repositories/snapshots/org/apache/myfaces/myfaces-base/1.2.10-SNAPSHOT/myfaces-base-1.2.10-20140609.223858-556.pom. Return code is: 401, ReasonPhrase: Unauthorized.
at org.apache.maven.artifact.deployer.DefaultArtifactDeployer.deploy(DefaultArtifactDeployer.java:143)
at hudson.maven.reporters.MavenArtifactRecord.deploy(MavenArtifactRecord.java:193)
at hudson.maven.RedeployPublisher.perform(RedeployPublisher.java:176)
at hudson.tasks.BuildStepMonitor$1.perform(BuildStepMonitor.java:20)
at hudson.model.AbstractBuild$AbstractBuildExecution.perform(AbstractBuild.java:804)
at hudson.model.AbstractBuild$AbstractBuildExecution.performAllBuildSteps(AbstractBuild.java:776)
at hudson.maven.MavenModuleSetBuild$MavenModuleSetBuildExecution.post2(MavenModuleSetBuild.java:1040)
at hudson.model.AbstractBuild$AbstractBuildExecution.post(AbstractBuild.java:725)
at hudson.model.Run.execute(Run.java:1701)
at hudson.maven.MavenModuleSetBuild.run(MavenModuleSetBuild.java:529)
at hudson.model.ResourceController.execute(ResourceController.java:88)
at hudson.model.Executor.run(Executor.java:231)
Caused by: org.eclipse.aether.deployment.DeploymentException: Failed to deploy artifacts: Could not transfer artifact org.apache.myfaces:myfaces-base:pom:1.2.10-20140609.223858-556 from/to apache.snapshots.https (https://repository.apache.org/content/repositories/snapshots): Failed to transfer file: https://repository.apache.org/content/repositories/snapshots/org/apache/myfaces/myfaces-base/1.2.10-SNAPSHOT/myfaces-base-1.2.10-20140609.223858-556.pom. Return code is: 401, ReasonPhrase: Unauthorized.
at org.eclipse.aether.internal.impl.DefaultDeployer.deploy(DefaultDeployer.java:341)
at org.eclipse.aether.internal.impl.DefaultDeployer.deploy(DefaultDeployer.java:269)
at org.eclipse.aether.internal.impl.DefaultRepositorySystem.deploy(DefaultRepositorySystem.java:413)
at org.apache.maven.artifact.deployer.DefaultArtifactDeployer.deploy(DefaultArtifactDeployer.java:139)
... 11 more
Caused by: org.eclipse.aether.transfer.ArtifactTransferException: Could not transfer artifact org.apache.myfaces:myfaces-base:pom:1.2.10-20140609.223858-556 from/to apache.snapshots.https (https://repository.apache.org/content/repositories/snapshots): Failed to transfer file: https://repository.apache.org/content/repositories/snapshots/org/apache/myfaces/myfaces-base/1.2.10-SNAPSHOT/myfaces-base-1.2.10-20140609.223858-556.pom. Return code is: 401, ReasonPhrase: Unauthorized.
at org.eclipse.aether.connector.wagon.WagonRepositoryConnector$6.wrap(WagonRepositoryConnector.java:1016)
at org.eclipse.aether.connector.wagon.WagonRepositoryConnector$6.wrap(WagonRepositoryConnector.java:1004)
at org.eclipse.aether.connector.wagon.WagonRepositoryConnector$PutTask.run(WagonRepositoryConnector.java:895)
at org.eclipse.aether.connector.wagon.WagonRepositoryConnector.put(WagonRepositoryConnector.java:522)
at org.eclipse.aether.internal.impl.DefaultDeployer.deploy(DefaultDeployer.java:335)
... 14 more
Caused by: org.apache.maven.wagon.TransferFailedException: Failed to transfer file: https://repository.apache.org/content/repositories/snapshots/org/apache/myfaces/myfaces-base/1.2.10-SNAPSHOT/myfaces-base-1.2.10-20140609.223858-556.pom. Return code is: 401, ReasonPhrase: Unauthorized.
at org.apache.maven.wagon.shared.http4.AbstractHttpClientWagon.put(AbstractHttpClientWagon.java:626)
at org.apache.maven.wagon.shared.http4.AbstractHttpClientWagon.put(AbstractHttpClientWagon.java:524)
at org.apache.maven.wagon.shared.http4.AbstractHttpClientWagon.put(AbstractHttpClientWagon.java:505)
at org.apache.maven.wagon.shared.http4.AbstractHttpClientWagon.put(AbstractHttpClientWagon.java:485)
at org.eclipse.aether.connector.wagon.WagonRepositoryConnector$PutTask.run(WagonRepositoryConnector.java:871)
... 16 more
[INFO] Deployment failed after 1 sec
Build step 'Deploy artifacts to Maven repository' changed build result to FAILURE
Build failed in Jenkins: myfaces-current12 #1177
Posted by Apache Jenkins Server <je...@builds.apache.org>.
See <https://builds.apache.org/job/myfaces-current12/1177/>
------------------------------------------
[...truncated 1568 lines...]
[INFO] --- myfaces-builder-plugin:1.0.8:build-metadata (makemyfacesmetadata) @ myfaces-impl ---
Artifact: myfaces-api-1.2.13-SNAPSHOT.jar have META-INF/myfaces-metadata.xml
[INFO]
[INFO] --- myfaces-builder-plugin:1.0.8:make-config (makefacesconfig) @ myfaces-impl ---
[WARNING] *******************************************************************
[WARNING] RuntimeInstance initializing.
[WARNING] Default ResourceManager initializing. (class org.apache.velocity.runtime.resource.ResourceManagerImpl)
[WARNING] FileResourceLoader : initialization starting.
[WARNING] FileResourceLoader : initialization complete.
[WARNING] RelativeClasspathResourceLoader : initialization complete.
[INFO] RelativeClasspathResourceLoader : adding path 'META-INF'
[WARNING] RelativeClasspathResourceLoader : initialization complete.
[WARNING] Default ResourceManager initialization complete.
[WARNING] Velocimacro : initialization starting.
[WARNING] Velocimacro : VM library registration complete.
[WARNING] Velocimacro : Velocimacro : initialization complete.
[WARNING] RuntimeInstance successfully initialized.
[INFO] using base content file: F:\jenkins\jenkins-slave\workspace\myfaces-current12\current12\core\impl\src\main\conf\META-INF\standard-faces-config-base.xml
[INFO]
[INFO] --- myfaces-builder-plugin:1.0.8:make-tags (make_tags) @ myfaces-impl ---
[INFO] Using template from file loader: F:\jenkins\jenkins-slave\workspace\myfaces-current12\current12\core\impl\src\main\resources\META-INF\tagClass12.vm
[WARNING] *******************************************************************
[WARNING] RuntimeInstance initializing.
[WARNING] Default ResourceManager initializing. (class org.apache.velocity.runtime.resource.ResourceManagerImpl)
[WARNING] FileResourceLoader : initialization starting.
[WARNING] FileResourceLoader : initialization complete.
[WARNING] RelativeClasspathResourceLoader : initialization complete.
[INFO] RelativeClasspathResourceLoader : adding path 'META-INF'
[WARNING] RelativeClasspathResourceLoader : initialization complete.
[WARNING] Default ResourceManager initialization complete.
[WARNING] Velocimacro : initialization starting.
[WARNING] Velocimacro : VM library registration complete.
[WARNING] Velocimacro : Velocimacro : initialization complete.
[WARNING] RuntimeInstance successfully initialized.
[INFO] Generating tag class:org.apache.myfaces.taglib.html.HtmlInputHiddenTag
[INFO] Generating tag class:org.apache.myfaces.taglib.html.HtmlColumnTag
[INFO] Generating tag class:org.apache.myfaces.taglib.html.HtmlCommandButtonTag
[INFO] Generating tag class:org.apache.myfaces.taglib.html.HtmlCommandLinkTag
[INFO] Generating tag class:org.apache.myfaces.taglib.html.HtmlDataTableTag
[INFO] Generating tag class:org.apache.myfaces.taglib.html.HtmlFormTag
[INFO] Generating tag class:org.apache.myfaces.taglib.html.HtmlGraphicImageTag
[INFO] Generating tag class:org.apache.myfaces.taglib.html.HtmlInputSecretTag
[INFO] Generating tag class:org.apache.myfaces.taglib.html.HtmlInputTextTag
[INFO] Generating tag class:org.apache.myfaces.taglib.html.HtmlInputTextareaTag
[INFO] Generating tag class:org.apache.myfaces.taglib.html.HtmlMessageTag
[INFO] Generating tag class:org.apache.myfaces.taglib.html.HtmlMessagesTag
[INFO] Generating tag class:org.apache.myfaces.taglib.html.HtmlOutputFormatTag
[INFO] Generating tag class:org.apache.myfaces.taglib.html.HtmlOutputLabelTag
[INFO] Generating tag class:org.apache.myfaces.taglib.html.HtmlOutputLinkTag
[INFO] Generating tag class:org.apache.myfaces.taglib.html.HtmlOutputTextTag
[INFO] Generating tag class:org.apache.myfaces.taglib.html.HtmlPanelGridTag
[INFO] Generating tag class:org.apache.myfaces.taglib.html.HtmlPanelGroupTag
[INFO] Generating tag class:org.apache.myfaces.taglib.html.HtmlSelectBooleanCheckboxTag
[INFO] Generating tag class:org.apache.myfaces.taglib.html.HtmlSelectManyCheckboxTag
[INFO] Generating tag class:org.apache.myfaces.taglib.html.HtmlSelectManyListboxTag
[INFO] Generating tag class:org.apache.myfaces.taglib.html.HtmlSelectManyMenuTag
[INFO] Generating tag class:org.apache.myfaces.taglib.html.HtmlSelectOneListboxTag
[INFO] Generating tag class:org.apache.myfaces.taglib.html.HtmlSelectOneMenuTag
[INFO] Generating tag class:org.apache.myfaces.taglib.html.HtmlSelectOneRadioTag
[INFO]
[INFO] --- myfaces-builder-plugin:1.0.8:make-config (makecoretld) @ myfaces-impl ---
[WARNING] *******************************************************************
[WARNING] RuntimeInstance initializing.
[WARNING] Default ResourceManager initializing. (class org.apache.velocity.runtime.resource.ResourceManagerImpl)
[WARNING] FileResourceLoader : initialization starting.
[WARNING] FileResourceLoader : initialization complete.
[WARNING] RelativeClasspathResourceLoader : initialization complete.
[INFO] RelativeClasspathResourceLoader : adding path 'META-INF'
[WARNING] RelativeClasspathResourceLoader : initialization complete.
[WARNING] Default ResourceManager initialization complete.
[WARNING] Velocimacro : initialization starting.
[WARNING] Velocimacro : VM library registration complete.
[WARNING] Velocimacro : Velocimacro : initialization complete.
[WARNING] RuntimeInstance successfully initialized.
[INFO] using base content file: F:\jenkins\jenkins-slave\workspace\myfaces-current12\current12\core\impl\src\main\conf\META-INF\myfaces_core-base.tld
[INFO]
[INFO] --- myfaces-builder-plugin:1.0.8:make-config (makehtmltld) @ myfaces-impl ---
[WARNING] *******************************************************************
[WARNING] RuntimeInstance initializing.
[WARNING] Default ResourceManager initializing. (class org.apache.velocity.runtime.resource.ResourceManagerImpl)
[WARNING] FileResourceLoader : initialization starting.
[WARNING] FileResourceLoader : initialization complete.
[WARNING] RelativeClasspathResourceLoader : initialization complete.
[INFO] RelativeClasspathResourceLoader : adding path 'META-INF'
[WARNING] RelativeClasspathResourceLoader : initialization complete.
[WARNING] Default ResourceManager initialization complete.
[WARNING] Velocimacro : initialization starting.
[WARNING] Velocimacro : VM library registration complete.
[WARNING] Velocimacro : Velocimacro : initialization complete.
[WARNING] RuntimeInstance successfully initialized.
[INFO] using base content file: F:\jenkins\jenkins-slave\workspace\myfaces-current12\current12\core\impl\src\main\conf\META-INF\myfaces_html-base.tld
[WARNING] Failed to getClass for org.apache.maven.plugin.source.SourceJarMojo
[INFO]
[INFO] <<< maven-source-plugin:2.0.4:jar (attach-source) @ myfaces-impl <<<
[INFO]
[INFO] --- maven-source-plugin:2.0.4:jar (attach-source) @ myfaces-impl ---
[INFO] Building jar: F:\jenkins\jenkins-slave\workspace\myfaces-current12\current12\core\impl\target\myfaces-impl-1.2.13-SNAPSHOT-sources.jar
[INFO]
[INFO] --- maven-checkstyle-plugin:2.6:check (verify-style) @ myfaces-impl ---
[INFO]
[INFO]
[INFO] --- maven-install-plugin:2.3.1:install (default-install) @ myfaces-impl ---
[INFO] Installing F:\jenkins\jenkins-slave\workspace\myfaces-current12\current12\core\impl\target\myfaces-impl-1.2.13-SNAPSHOT.jar to f:\jenkins\jenkins-slave\maven-repositories\1\org\apache\myfaces\core\myfaces-impl\1.2.13-SNAPSHOT\myfaces-impl-1.2.13-SNAPSHOT.jar
[INFO] Installing F:\jenkins\jenkins-slave\workspace\myfaces-current12\current12\core\impl\pom.xml to f:\jenkins\jenkins-slave\maven-repositories\1\org\apache\myfaces\core\myfaces-impl\1.2.13-SNAPSHOT\myfaces-impl-1.2.13-SNAPSHOT.pom
[INFO] Installing F:\jenkins\jenkins-slave\workspace\myfaces-current12\current12\core\impl\target\myfaces-impl-1.2.13-SNAPSHOT-sources.jar to f:\jenkins\jenkins-slave\maven-repositories\1\org\apache\myfaces\core\myfaces-impl\1.2.13-SNAPSHOT\myfaces-impl-1.2.13-SNAPSHOT-sources.jar
[INFO]
[INFO] ------------------------------------------------------------------------
[INFO] Building Build Project 1.2.10-SNAPSHOT
[INFO] ------------------------------------------------------------------------
[INFO]
[INFO] --- maven-remote-resources-plugin:1.1:process (default) @ myfaces-base ---
[INFO] Setting property: classpath.resource.loader.class => 'org.codehaus.plexus.velocity.ContextClassLoaderResourceLoader'.
[INFO] Setting property: velocimacro.messages.on => 'false'.
[INFO] Setting property: resource.loader => 'classpath'.
[INFO] Setting property: resource.manager.logwhenfound => 'false'.
[INFO]
[INFO] --- maven-install-plugin:2.3:install (default-install) @ myfaces-base ---
[INFO] Installing <https://builds.apache.org/job/myfaces-current12/ws/current12\pom.xml> to f:\jenkins\jenkins-slave\maven-repositories\1\org\apache\myfaces\myfaces-base\1.2.10-SNAPSHOT\myfaces-base-1.2.10-SNAPSHOT.pom
[INFO] ------------------------------------------------------------------------
[INFO] Reactor Summary:
[INFO]
[INFO] Apache MyFaces Shared For JSF 1.2 - Project ....... SUCCESS [13.861s]
[INFO] Apache MyFaces Shared For JSF 1.2 - Core .......... SUCCESS [30.049s]
[INFO] MyFaces Shared Impl ............................... SUCCESS [29.946s]
[INFO] MyFaces Shared Tomahawk ........................... SUCCESS [18.025s]
[INFO] Apache MyFaces JSF-1.2 Core Project ............... SUCCESS [5.282s]
[INFO] Apache Myfaces JSF Core-1.2 API ................... SUCCESS [56.744s]
[INFO] Apache MyFaces JSF-1.2 Core Impl .................. SUCCESS [59.493s]
[INFO] Build Project ..................................... SUCCESS [2.687s]
[INFO] ------------------------------------------------------------------------
[INFO] BUILD SUCCESS
[INFO] ------------------------------------------------------------------------
[INFO] Total time: 3:40.882s
[INFO] Finished at: Mon Jun 09 13:54:20 PDT 2014
[INFO] Final Memory: 54M/130M
[INFO] ------------------------------------------------------------------------
[JENKINS] Archiving F:\jenkins\jenkins-slave\workspace\myfaces-current12\current12\shared\shared-tomahawk\pom.xml to org.apache.myfaces.shared/myfaces-shared-tomahawk/3.0.13-SNAPSHOT/myfaces-shared-tomahawk-3.0.13-SNAPSHOT.pom
[JENKINS] Archiving F:\jenkins\jenkins-slave\workspace\myfaces-current12\current12\shared\shared-tomahawk\target\myfaces-shared-tomahawk-3.0.13-SNAPSHOT.jar to org.apache.myfaces.shared/myfaces-shared-tomahawk/3.0.13-SNAPSHOT/myfaces-shared-tomahawk-3.0.13-SNAPSHOT.jar
[JENKINS] Archiving F:\jenkins\jenkins-slave\workspace\myfaces-current12\current12\shared\shared-tomahawk\target\myfaces-shared-tomahawk-3.0.13-SNAPSHOT-sources.jar to org.apache.myfaces.shared/myfaces-shared-tomahawk/3.0.13-SNAPSHOT/myfaces-shared-tomahawk-3.0.13-SNAPSHOT-sources.jar
Sending artifact delta relative to myfaces-current12 » MyFaces Shared Tomahawk #1176
Archived 3 artifacts
Archive block size is 32768
Received 0 blocks and 564372 bytes
Compression is 0.0%
Took 2.3 sec
[JENKINS] Archiving F:\jenkins\jenkins-slave\workspace\myfaces-current12\current12\core\impl\pom.xml to org.apache.myfaces.core/myfaces-impl/1.2.13-SNAPSHOT/myfaces-impl-1.2.13-SNAPSHOT.pom
[JENKINS] Archiving F:\jenkins\jenkins-slave\workspace\myfaces-current12\current12\core\impl\target\myfaces-impl-1.2.13-SNAPSHOT.jar to org.apache.myfaces.core/myfaces-impl/1.2.13-SNAPSHOT/myfaces-impl-1.2.13-SNAPSHOT.jar
[JENKINS] Archiving F:\jenkins\jenkins-slave\workspace\myfaces-current12\current12\core\impl\target\myfaces-impl-1.2.13-SNAPSHOT-sources.jar to org.apache.myfaces.core/myfaces-impl/1.2.13-SNAPSHOT/myfaces-impl-1.2.13-SNAPSHOT-sources.jar
Sending artifact delta relative to myfaces-current12 » Apache MyFaces JSF-1.2 Core Impl #1176
Archived 3 artifacts
Archive block size is 32768
Received 33 blocks and 530469 bytes
Compression is 67.1%
Took 0.32 sec
[JENKINS] Archiving F:\jenkins\jenkins-slave\workspace\myfaces-current12\current12\shared\shared-impl\pom.xml to org.apache.myfaces.shared/myfaces-shared-impl/3.0.13-SNAPSHOT/myfaces-shared-impl-3.0.13-SNAPSHOT.pom
[JENKINS] Archiving F:\jenkins\jenkins-slave\workspace\myfaces-current12\current12\shared\shared-impl\target\myfaces-shared-impl-3.0.13-SNAPSHOT.jar to org.apache.myfaces.shared/myfaces-shared-impl/3.0.13-SNAPSHOT/myfaces-shared-impl-3.0.13-SNAPSHOT.jar
[JENKINS] Archiving F:\jenkins\jenkins-slave\workspace\myfaces-current12\current12\shared\shared-impl\target\myfaces-shared-impl-3.0.13-SNAPSHOT-sources.jar to org.apache.myfaces.shared/myfaces-shared-impl/3.0.13-SNAPSHOT/myfaces-shared-impl-3.0.13-SNAPSHOT-sources.jar
Sending artifact delta relative to myfaces-current12 » MyFaces Shared Impl #1176
Archived 3 artifacts
Archive block size is 32768
Received 0 blocks and 560561 bytes
Compression is 0.0%
Took 0.45 sec
[JENKINS] Archiving F:\jenkins\jenkins-slave\workspace\myfaces-current12\current12\shared\core\pom.xml to org.apache.myfaces.shared/myfaces-shared-core/3.0.13-SNAPSHOT/myfaces-shared-core-3.0.13-SNAPSHOT.pom
[JENKINS] Archiving F:\jenkins\jenkins-slave\workspace\myfaces-current12\current12\shared\core\target\myfaces-shared-core-3.0.13-SNAPSHOT.jar to org.apache.myfaces.shared/myfaces-shared-core/3.0.13-SNAPSHOT/myfaces-shared-core-3.0.13-SNAPSHOT.jar
[JENKINS] Archiving F:\jenkins\jenkins-slave\workspace\myfaces-current12\current12\shared\core\target\myfaces-shared-core-3.0.13-SNAPSHOT-sources.jar to org.apache.myfaces.shared/myfaces-shared-core/3.0.13-SNAPSHOT/myfaces-shared-core-3.0.13-SNAPSHOT-sources.jar
Sending artifact delta relative to myfaces-current12 » Apache MyFaces Shared For JSF 1.2 - Core #1176
Archived 3 artifacts
Archive block size is 32768
Received 14 blocks and 104977 bytes
Compression is 81.4%
Took 2.6 sec
[JENKINS] Archiving F:\jenkins\jenkins-slave\workspace\myfaces-current12\current12\core\api\pom.xml to org.apache.myfaces.core/myfaces-api/1.2.13-SNAPSHOT/myfaces-api-1.2.13-SNAPSHOT.pom
[JENKINS] Archiving F:\jenkins\jenkins-slave\workspace\myfaces-current12\current12\core\api\target\myfaces-api-1.2.13-SNAPSHOT.jar to org.apache.myfaces.core/myfaces-api/1.2.13-SNAPSHOT/myfaces-api-1.2.13-SNAPSHOT.jar
[JENKINS] Archiving F:\jenkins\jenkins-slave\workspace\myfaces-current12\current12\core\api\target\myfaces-api-1.2.13-SNAPSHOT-sources.jar to org.apache.myfaces.core/myfaces-api/1.2.13-SNAPSHOT/myfaces-api-1.2.13-SNAPSHOT-sources.jar
[JENKINS] Archiving F:\jenkins\jenkins-slave\workspace\myfaces-current12\current12\core\api\target\myfaces-api-1.2.13-SNAPSHOT-tests.jar to org.apache.myfaces.core/myfaces-api/1.2.13-SNAPSHOT/myfaces-api-1.2.13-SNAPSHOT-tests.jar
Sending artifact delta relative to myfaces-current12 » Apache Myfaces JSF Core-1.2 API #1176
Archived 4 artifacts
Archive block size is 32768
Received 15 blocks and 525399 bytes
Compression is 48.3%
Took 2.3 sec
[JENKINS] Archiving F:\jenkins\jenkins-slave\workspace\myfaces-current12\current12\shared\pom.xml to org.apache.myfaces.shared/myfaces-shared-project/3.0.13-SNAPSHOT/myfaces-shared-project-3.0.13-SNAPSHOT.pom
[JENKINS] Archiving F:\jenkins\jenkins-slave\workspace\myfaces-current12\current12\shared\target\myfaces-shared-project-3.0.13-SNAPSHOT-site.xml to org.apache.myfaces.shared/myfaces-shared-project/3.0.13-SNAPSHOT/myfaces-shared-project-3.0.13-SNAPSHOT-site.xml
Sending artifact delta relative to myfaces-current12 » Apache MyFaces Shared For JSF 1.2 - Project #1176
Archived 2 artifacts
Archive block size is 32768
Received 0 blocks and 10524 bytes
Compression is 0.0%
Took 0.19 sec
[JENKINS] Archiving F:\jenkins\jenkins-slave\workspace\myfaces-current12\current12\core\pom.xml to org.apache.myfaces.core/myfaces-core-project/1.2.13-SNAPSHOT/myfaces-core-project-1.2.13-SNAPSHOT.pom
[JENKINS] Archiving F:\jenkins\jenkins-slave\workspace\myfaces-current12\current12\core\target\myfaces-core-project-1.2.13-SNAPSHOT-site.xml to org.apache.myfaces.core/myfaces-core-project/1.2.13-SNAPSHOT/myfaces-core-project-1.2.13-SNAPSHOT-site.xml
Sending artifact delta relative to myfaces-current12 » Apache MyFaces JSF-1.2 Core Project #1176
Archived 2 artifacts
Archive block size is 32768
Received 0 blocks and 24305 bytes
Compression is 0.0%
Took 47 ms
[JENKINS] Archiving <https://builds.apache.org/job/myfaces-current12/ws/current12\pom.xml> to org.apache.myfaces/myfaces-base/1.2.10-SNAPSHOT/myfaces-base-1.2.10-SNAPSHOT.pom
Sending artifact delta relative to myfaces-current12 » Build Project #1176
Archived 1 artifacts
Archive block size is 32768
Received 0 blocks and 1228 bytes
Compression is 0.0%
Took 35 ms
channel stopped
Maven RedeployPublisher use remote windows2 maven settings from : f:\jenkins\tools\maven\latest/conf/settings.xml
[ERROR] uniqueVersion == false is not anymore supported in maven 3
[INFO] Deployment in https://repository.apache.org/content/repositories/snapshots (id=apache.snapshots.https,uniqueVersion=false)
Deploying the main artifact myfaces-base-1.2.10-SNAPSHOT.pom
Downloading: https://repository.apache.org/content/repositories/snapshots/org/apache/myfaces/myfaces-base/1.2.10-SNAPSHOT/maven-metadata.xml
Downloaded: https://repository.apache.org/content/repositories/snapshots/org/apache/myfaces/myfaces-base/1.2.10-SNAPSHOT/maven-metadata.xml (613 B at 0.6 KB/sec)
Uploading: https://repository.apache.org/content/repositories/snapshots/org/apache/myfaces/myfaces-base/1.2.10-SNAPSHOT/myfaces-base-1.2.10-20140609.205437-556.pom
ERROR: Failed to deploy artifacts: Could not transfer artifact org.apache.myfaces:myfaces-base:pom:1.2.10-20140609.205437-556 from/to apache.snapshots.https (https://repository.apache.org/content/repositories/snapshots): Failed to transfer file: https://repository.apache.org/content/repositories/snapshots/org/apache/myfaces/myfaces-base/1.2.10-SNAPSHOT/myfaces-base-1.2.10-20140609.205437-556.pom. Return code is: 401, ReasonPhrase: Unauthorized.
org.apache.maven.artifact.deployer.ArtifactDeploymentException: Failed to deploy artifacts: Could not transfer artifact org.apache.myfaces:myfaces-base:pom:1.2.10-20140609.205437-556 from/to apache.snapshots.https (https://repository.apache.org/content/repositories/snapshots): Failed to transfer file: https://repository.apache.org/content/repositories/snapshots/org/apache/myfaces/myfaces-base/1.2.10-SNAPSHOT/myfaces-base-1.2.10-20140609.205437-556.pom. Return code is: 401, ReasonPhrase: Unauthorized.
at org.apache.maven.artifact.deployer.DefaultArtifactDeployer.deploy(DefaultArtifactDeployer.java:143)
at hudson.maven.reporters.MavenArtifactRecord.deploy(MavenArtifactRecord.java:193)
at hudson.maven.RedeployPublisher.perform(RedeployPublisher.java:176)
at hudson.tasks.BuildStepMonitor$1.perform(BuildStepMonitor.java:20)
at hudson.model.AbstractBuild$AbstractBuildExecution.perform(AbstractBuild.java:804)
at hudson.model.AbstractBuild$AbstractBuildExecution.performAllBuildSteps(AbstractBuild.java:776)
at hudson.maven.MavenModuleSetBuild$MavenModuleSetBuildExecution.post2(MavenModuleSetBuild.java:1040)
at hudson.model.AbstractBuild$AbstractBuildExecution.post(AbstractBuild.java:725)
at hudson.model.Run.execute(Run.java:1701)
at hudson.maven.MavenModuleSetBuild.run(MavenModuleSetBuild.java:529)
at hudson.model.ResourceController.execute(ResourceController.java:88)
at hudson.model.Executor.run(Executor.java:231)
Caused by: org.eclipse.aether.deployment.DeploymentException: Failed to deploy artifacts: Could not transfer artifact org.apache.myfaces:myfaces-base:pom:1.2.10-20140609.205437-556 from/to apache.snapshots.https (https://repository.apache.org/content/repositories/snapshots): Failed to transfer file: https://repository.apache.org/content/repositories/snapshots/org/apache/myfaces/myfaces-base/1.2.10-SNAPSHOT/myfaces-base-1.2.10-20140609.205437-556.pom. Return code is: 401, ReasonPhrase: Unauthorized.
at org.eclipse.aether.internal.impl.DefaultDeployer.deploy(DefaultDeployer.java:341)
at org.eclipse.aether.internal.impl.DefaultDeployer.deploy(DefaultDeployer.java:269)
at org.eclipse.aether.internal.impl.DefaultRepositorySystem.deploy(DefaultRepositorySystem.java:413)
at org.apache.maven.artifact.deployer.DefaultArtifactDeployer.deploy(DefaultArtifactDeployer.java:139)
... 11 more
Caused by: org.eclipse.aether.transfer.ArtifactTransferException: Could not transfer artifact org.apache.myfaces:myfaces-base:pom:1.2.10-20140609.205437-556 from/to apache.snapshots.https (https://repository.apache.org/content/repositories/snapshots): Failed to transfer file: https://repository.apache.org/content/repositories/snapshots/org/apache/myfaces/myfaces-base/1.2.10-SNAPSHOT/myfaces-base-1.2.10-20140609.205437-556.pom. Return code is: 401, ReasonPhrase: Unauthorized.
at org.eclipse.aether.connector.wagon.WagonRepositoryConnector$6.wrap(WagonRepositoryConnector.java:1016)
at org.eclipse.aether.connector.wagon.WagonRepositoryConnector$6.wrap(WagonRepositoryConnector.java:1004)
at org.eclipse.aether.connector.wagon.WagonRepositoryConnector$PutTask.run(WagonRepositoryConnector.java:895)
at org.eclipse.aether.connector.wagon.WagonRepositoryConnector.put(WagonRepositoryConnector.java:522)
at org.eclipse.aether.internal.impl.DefaultDeployer.deploy(DefaultDeployer.java:335)
... 14 more
Caused by: org.apache.maven.wagon.TransferFailedException: Failed to transfer file: https://repository.apache.org/content/repositories/snapshots/org/apache/myfaces/myfaces-base/1.2.10-SNAPSHOT/myfaces-base-1.2.10-20140609.205437-556.pom. Return code is: 401, ReasonPhrase: Unauthorized.
at org.apache.maven.wagon.shared.http4.AbstractHttpClientWagon.put(AbstractHttpClientWagon.java:626)
at org.apache.maven.wagon.shared.http4.AbstractHttpClientWagon.put(AbstractHttpClientWagon.java:524)
at org.apache.maven.wagon.shared.http4.AbstractHttpClientWagon.put(AbstractHttpClientWagon.java:505)
at org.apache.maven.wagon.shared.http4.AbstractHttpClientWagon.put(AbstractHttpClientWagon.java:485)
at org.eclipse.aether.connector.wagon.WagonRepositoryConnector$PutTask.run(WagonRepositoryConnector.java:871)
... 16 more
[INFO] Deployment failed after 2.9 sec
Build step 'Deploy artifacts to Maven repository' changed build result to FAILURE