You are viewing a plain text version of this content. The canonical link for it is here.
Posted to builds@lucene.apache.org by Apache Jenkins Server <je...@builds.apache.org> on 2024/06/14 05:19:29 UTC
[JENKINS] Lucene » Lucene-NightlyTests-main - Build # 1370 - Unstable!
Build: https://ci-builds.apache.org/job/Lucene/job/Lucene-NightlyTests-main/1370/
42 tests failed.
FAILED: org.apache.lucene.backward_codecs.lucene60.TestLucene60FieldInfosFormat.testRandom
Error Message:
java.lang.AssertionError: expected:<true> but was:<false>
Stack Trace:
java.lang.AssertionError: expected:<true> but was:<false>
at __randomizedtesting.SeedInfo.seed([B2527FDA3A42ECE9:C01E5AD58B225A9A]:0)
at junit@4.13.1/org.junit.Assert.fail(Assert.java:89)
at junit@4.13.1/org.junit.Assert.failNotEquals(Assert.java:835)
at junit@4.13.1/org.junit.Assert.assertEquals(Assert.java:120)
at junit@4.13.1/org.junit.Assert.assertEquals(Assert.java:146)
at org.apache.lucene.test_framework@10.0.0-SNAPSHOT/org.apache.lucene.tests.index.BaseFieldInfoFormatTestCase.assertEquals(BaseFieldInfoFormatTestCase.java:410)
at org.apache.lucene.test_framework@10.0.0-SNAPSHOT/org.apache.lucene.tests.index.BaseFieldInfoFormatTestCase.assertEquals(BaseFieldInfoFormatTestCase.java:401)
at org.apache.lucene.test_framework@10.0.0-SNAPSHOT/org.apache.lucene.tests.index.BaseFieldInfoFormatTestCase.testRandom(BaseFieldInfoFormatTestCase.java:334)
at java.base/jdk.internal.reflect.DirectMethodHandleAccessor.invoke(DirectMethodHandleAccessor.java:103)
at java.base/java.lang.reflect.Method.invoke(Method.java:580)
at randomizedtesting.runner@2.8.1/com.carrotsearch.randomizedtesting.RandomizedRunner.invoke(RandomizedRunner.java:1758)
at randomizedtesting.runner@2.8.1/com.carrotsearch.randomizedtesting.RandomizedRunner$8.evaluate(RandomizedRunner.java:946)
at randomizedtesting.runner@2.8.1/com.carrotsearch.randomizedtesting.RandomizedRunner$9.evaluate(RandomizedRunner.java:982)
at randomizedtesting.runner@2.8.1/com.carrotsearch.randomizedtesting.RandomizedRunner$10.evaluate(RandomizedRunner.java:996)
at org.apache.lucene.test_framework@10.0.0-SNAPSHOT/org.apache.lucene.tests.util.TestRuleSetupTeardownChained$1.evaluate(TestRuleSetupTeardownChained.java:48)
at org.apache.lucene.test_framework@10.0.0-SNAPSHOT/org.apache.lucene.tests.util.AbstractBeforeAfterRule$1.evaluate(AbstractBeforeAfterRule.java:43)
at org.apache.lucene.test_framework@10.0.0-SNAPSHOT/org.apache.lucene.tests.util.TestRuleThreadAndTestName$1.evaluate(TestRuleThreadAndTestName.java:45)
at org.apache.lucene.test_framework@10.0.0-SNAPSHOT/org.apache.lucene.tests.util.TestRuleIgnoreAfterMaxFailures$1.evaluate(TestRuleIgnoreAfterMaxFailures.java:60)
at org.apache.lucene.test_framework@10.0.0-SNAPSHOT/org.apache.lucene.tests.util.TestRuleMarkFailure$1.evaluate(TestRuleMarkFailure.java:44)
at junit@4.13.1/org.junit.rules.RunRules.evaluate(RunRules.java:20)
at randomizedtesting.runner@2.8.1/com.carrotsearch.randomizedtesting.rules.StatementAdapter.evaluate(StatementAdapter.java:36)
at randomizedtesting.runner@2.8.1/com.carrotsearch.randomizedtesting.ThreadLeakControl$StatementRunner.run(ThreadLeakControl.java:390)
at randomizedtesting.runner@2.8.1/com.carrotsearch.randomizedtesting.ThreadLeakControl.forkTimeoutingTask(ThreadLeakControl.java:843)
at randomizedtesting.runner@2.8.1/com.carrotsearch.randomizedtesting.ThreadLeakControl$3.evaluate(ThreadLeakControl.java:490)
at randomizedtesting.runner@2.8.1/com.carrotsearch.randomizedtesting.RandomizedRunner.runSingleTest(RandomizedRunner.java:955)
at randomizedtesting.runner@2.8.1/com.carrotsearch.randomizedtesting.RandomizedRunner$5.evaluate(RandomizedRunner.java:840)
at randomizedtesting.runner@2.8.1/com.carrotsearch.randomizedtesting.RandomizedRunner$6.evaluate(RandomizedRunner.java:891)
at randomizedtesting.runner@2.8.1/com.carrotsearch.randomizedtesting.RandomizedRunner$7.evaluate(RandomizedRunner.java:902)
at org.apache.lucene.test_framework@10.0.0-SNAPSHOT/org.apache.lucene.tests.util.AbstractBeforeAfterRule$1.evaluate(AbstractBeforeAfterRule.java:43)
at randomizedtesting.runner@2.8.1/com.carrotsearch.randomizedtesting.rules.StatementAdapter.evaluate(StatementAdapter.java:36)
at org.apache.lucene.test_framework@10.0.0-SNAPSHOT/org.apache.lucene.tests.util.TestRuleStoreClassName$1.evaluate(TestRuleStoreClassName.java:38)
at randomizedtesting.runner@2.8.1/com.carrotsearch.randomizedtesting.rules.NoShadowingOrOverridesOnMethodsRule$1.evaluate(NoShadowingOrOverridesOnMethodsRule.java:40)
at randomizedtesting.runner@2.8.1/com.carrotsearch.randomizedtesting.rules.NoShadowingOrOverridesOnMethodsRule$1.evaluate(NoShadowingOrOverridesOnMethodsRule.java:40)
at randomizedtesting.runner@2.8.1/com.carrotsearch.randomizedtesting.rules.StatementAdapter.evaluate(StatementAdapter.java:36)
at randomizedtesting.runner@2.8.1/com.carrotsearch.randomizedtesting.rules.StatementAdapter.evaluate(StatementAdapter.java:36)
at org.apache.lucene.test_framework@10.0.0-SNAPSHOT/org.apache.lucene.tests.util.TestRuleAssertionsRequired$1.evaluate(TestRuleAssertionsRequired.java:53)
at org.apache.lucene.test_framework@10.0.0-SNAPSHOT/org.apache.lucene.tests.util.AbstractBeforeAfterRule$1.evaluate(AbstractBeforeAfterRule.java:43)
at org.apache.lucene.test_framework@10.0.0-SNAPSHOT/org.apache.lucene.tests.util.TestRuleMarkFailure$1.evaluate(TestRuleMarkFailure.java:44)
at org.apache.lucene.test_framework@10.0.0-SNAPSHOT/org.apache.lucene.tests.util.TestRuleIgnoreAfterMaxFailures$1.evaluate(TestRuleIgnoreAfterMaxFailures.java:60)
at org.apache.lucene.test_framework@10.0.0-SNAPSHOT/org.apache.lucene.tests.util.TestRuleIgnoreTestSuites$1.evaluate(TestRuleIgnoreTestSuites.java:47)
at junit@4.13.1/org.junit.rules.RunRules.evaluate(RunRules.java:20)
at randomizedtesting.runner@2.8.1/com.carrotsearch.randomizedtesting.rules.StatementAdapter.evaluate(StatementAdapter.java:36)
at randomizedtesting.runner@2.8.1/com.carrotsearch.randomizedtesting.ThreadLeakControl$StatementRunner.run(ThreadLeakControl.java:390)
at randomizedtesting.runner@2.8.1/com.carrotsearch.randomizedtesting.ThreadLeakControl.lambda$forkTimeoutingTask$0(ThreadLeakControl.java:850)
at java.base/java.lang.Thread.run(Thread.java:1583)
FAILED: org.apache.lucene.backward_codecs.lucene80.TestBestCompressionLucene80DocValuesFormat.testSortedNumericMergeAwayAllValuesLargeSegment
Error Message:
java.lang.NullPointerException: Cannot invoke "org.apache.lucene.index.DocValuesSkipper.docCount()" because "skipper" is null
Stack Trace:
java.lang.NullPointerException: Cannot invoke "org.apache.lucene.index.DocValuesSkipper.docCount()" because "skipper" is null
at __randomizedtesting.SeedInfo.seed([B2527FDA3A42ECE9:4B7B00BE5CBC5FFA]:0)
at org.apache.lucene.test_framework@10.0.0-SNAPSHOT/org.apache.lucene.tests.index.BaseDocValuesFormatTestCase.testSortedNumericMergeAwayAllValuesLargeSegment(BaseDocValuesFormatTestCase.java:3674)
at java.base/jdk.internal.reflect.DirectMethodHandleAccessor.invoke(DirectMethodHandleAccessor.java:103)
at java.base/java.lang.reflect.Method.invoke(Method.java:580)
at randomizedtesting.runner@2.8.1/com.carrotsearch.randomizedtesting.RandomizedRunner.invoke(RandomizedRunner.java:1758)
at randomizedtesting.runner@2.8.1/com.carrotsearch.randomizedtesting.RandomizedRunner$8.evaluate(RandomizedRunner.java:946)
at randomizedtesting.runner@2.8.1/com.carrotsearch.randomizedtesting.RandomizedRunner$9.evaluate(RandomizedRunner.java:982)
at randomizedtesting.runner@2.8.1/com.carrotsearch.randomizedtesting.RandomizedRunner$10.evaluate(RandomizedRunner.java:996)
at org.apache.lucene.test_framework@10.0.0-SNAPSHOT/org.apache.lucene.tests.util.TestRuleSetupTeardownChained$1.evaluate(TestRuleSetupTeardownChained.java:48)
at org.apache.lucene.test_framework@10.0.0-SNAPSHOT/org.apache.lucene.tests.util.AbstractBeforeAfterRule$1.evaluate(AbstractBeforeAfterRule.java:43)
at org.apache.lucene.test_framework@10.0.0-SNAPSHOT/org.apache.lucene.tests.util.TestRuleThreadAndTestName$1.evaluate(TestRuleThreadAndTestName.java:45)
at org.apache.lucene.test_framework@10.0.0-SNAPSHOT/org.apache.lucene.tests.util.TestRuleIgnoreAfterMaxFailures$1.evaluate(TestRuleIgnoreAfterMaxFailures.java:60)
at org.apache.lucene.test_framework@10.0.0-SNAPSHOT/org.apache.lucene.tests.util.TestRuleMarkFailure$1.evaluate(TestRuleMarkFailure.java:44)
at junit@4.13.1/org.junit.rules.RunRules.evaluate(RunRules.java:20)
at randomizedtesting.runner@2.8.1/com.carrotsearch.randomizedtesting.rules.StatementAdapter.evaluate(StatementAdapter.java:36)
at randomizedtesting.runner@2.8.1/com.carrotsearch.randomizedtesting.ThreadLeakControl$StatementRunner.run(ThreadLeakControl.java:390)
at randomizedtesting.runner@2.8.1/com.carrotsearch.randomizedtesting.ThreadLeakControl.forkTimeoutingTask(ThreadLeakControl.java:843)
at randomizedtesting.runner@2.8.1/com.carrotsearch.randomizedtesting.ThreadLeakControl$3.evaluate(ThreadLeakControl.java:490)
at randomizedtesting.runner@2.8.1/com.carrotsearch.randomizedtesting.RandomizedRunner.runSingleTest(RandomizedRunner.java:955)
at randomizedtesting.runner@2.8.1/com.carrotsearch.randomizedtesting.RandomizedRunner$5.evaluate(RandomizedRunner.java:840)
at randomizedtesting.runner@2.8.1/com.carrotsearch.randomizedtesting.RandomizedRunner$6.evaluate(RandomizedRunner.java:891)
at randomizedtesting.runner@2.8.1/com.carrotsearch.randomizedtesting.RandomizedRunner$7.evaluate(RandomizedRunner.java:902)
at org.apache.lucene.test_framework@10.0.0-SNAPSHOT/org.apache.lucene.tests.util.AbstractBeforeAfterRule$1.evaluate(AbstractBeforeAfterRule.java:43)
at randomizedtesting.runner@2.8.1/com.carrotsearch.randomizedtesting.rules.StatementAdapter.evaluate(StatementAdapter.java:36)
at org.apache.lucene.test_framework@10.0.0-SNAPSHOT/org.apache.lucene.tests.util.TestRuleStoreClassName$1.evaluate(TestRuleStoreClassName.java:38)
at randomizedtesting.runner@2.8.1/com.carrotsearch.randomizedtesting.rules.NoShadowingOrOverridesOnMethodsRule$1.evaluate(NoShadowingOrOverridesOnMethodsRule.java:40)
at randomizedtesting.runner@2.8.1/com.carrotsearch.randomizedtesting.rules.NoShadowingOrOverridesOnMethodsRule$1.evaluate(NoShadowingOrOverridesOnMethodsRule.java:40)
at randomizedtesting.runner@2.8.1/com.carrotsearch.randomizedtesting.rules.StatementAdapter.evaluate(StatementAdapter.java:36)
at randomizedtesting.runner@2.8.1/com.carrotsearch.randomizedtesting.rules.StatementAdapter.evaluate(StatementAdapter.java:36)
at org.apache.lucene.test_framework@10.0.0-SNAPSHOT/org.apache.lucene.tests.util.TestRuleAssertionsRequired$1.evaluate(TestRuleAssertionsRequired.java:53)
at org.apache.lucene.test_framework@10.0.0-SNAPSHOT/org.apache.lucene.tests.util.AbstractBeforeAfterRule$1.evaluate(AbstractBeforeAfterRule.java:43)
at org.apache.lucene.test_framework@10.0.0-SNAPSHOT/org.apache.lucene.tests.util.TestRuleMarkFailure$1.evaluate(TestRuleMarkFailure.java:44)
at org.apache.lucene.test_framework@10.0.0-SNAPSHOT/org.apache.lucene.tests.util.TestRuleIgnoreAfterMaxFailures$1.evaluate(TestRuleIgnoreAfterMaxFailures.java:60)
at org.apache.lucene.test_framework@10.0.0-SNAPSHOT/org.apache.lucene.tests.util.TestRuleIgnoreTestSuites$1.evaluate(TestRuleIgnoreTestSuites.java:47)
at junit@4.13.1/org.junit.rules.RunRules.evaluate(RunRules.java:20)
at randomizedtesting.runner@2.8.1/com.carrotsearch.randomizedtesting.rules.StatementAdapter.evaluate(StatementAdapter.java:36)
at randomizedtesting.runner@2.8.1/com.carrotsearch.randomizedtesting.ThreadLeakControl$StatementRunner.run(ThreadLeakControl.java:390)
at randomizedtesting.runner@2.8.1/com.carrotsearch.randomizedtesting.ThreadLeakControl.lambda$forkTimeoutingTask$0(ThreadLeakControl.java:850)
at java.base/java.lang.Thread.run(Thread.java:1583)
FAILED: org.apache.lucene.backward_codecs.lucene80.TestBestCompressionLucene80DocValuesFormat.testNumericDocValuesWithSkipperBig
Error Message:
java.lang.NullPointerException: Cannot invoke "org.apache.lucene.index.DocValuesSkipper.maxDocID(int)" because "skipper" is null
Stack Trace:
java.lang.NullPointerException: Cannot invoke "org.apache.lucene.index.DocValuesSkipper.maxDocID(int)" because "skipper" is null
at __randomizedtesting.SeedInfo.seed([B2527FDA3A42ECE9:3B771A417842C896]:0)
at org.apache.lucene.core@10.0.0-SNAPSHOT/org.apache.lucene.index.CheckIndex.checkDocValueSkipper(CheckIndex.java:3280)
at org.apache.lucene.core@10.0.0-SNAPSHOT/org.apache.lucene.index.CheckIndex.checkDocValues(CheckIndex.java:3740)
at org.apache.lucene.core@10.0.0-SNAPSHOT/org.apache.lucene.index.CheckIndex.testDocValues(CheckIndex.java:3242)
at org.apache.lucene.test_framework@10.0.0-SNAPSHOT/org.apache.lucene.tests.index.BaseDocValuesFormatTestCase.assertDocValuesWithSkipper(BaseDocValuesFormatTestCase.java:4196)
at org.apache.lucene.test_framework@10.0.0-SNAPSHOT/org.apache.lucene.tests.index.BaseDocValuesFormatTestCase.doTestNumericDocValuesWithSkipper(BaseDocValuesFormatTestCase.java:3884)
at org.apache.lucene.test_framework@10.0.0-SNAPSHOT/org.apache.lucene.tests.index.BaseDocValuesFormatTestCase.testNumericDocValuesWithSkipperBig(BaseDocValuesFormatTestCase.java:3880)
at java.base/jdk.internal.reflect.DirectMethodHandleAccessor.invoke(DirectMethodHandleAccessor.java:103)
at java.base/java.lang.reflect.Method.invoke(Method.java:580)
at randomizedtesting.runner@2.8.1/com.carrotsearch.randomizedtesting.RandomizedRunner.invoke(RandomizedRunner.java:1758)
at randomizedtesting.runner@2.8.1/com.carrotsearch.randomizedtesting.RandomizedRunner$8.evaluate(RandomizedRunner.java:946)
at randomizedtesting.runner@2.8.1/com.carrotsearch.randomizedtesting.RandomizedRunner$9.evaluate(RandomizedRunner.java:982)
at randomizedtesting.runner@2.8.1/com.carrotsearch.randomizedtesting.RandomizedRunner$10.evaluate(RandomizedRunner.java:996)
at org.apache.lucene.test_framework@10.0.0-SNAPSHOT/org.apache.lucene.tests.util.TestRuleSetupTeardownChained$1.evaluate(TestRuleSetupTeardownChained.java:48)
at org.apache.lucene.test_framework@10.0.0-SNAPSHOT/org.apache.lucene.tests.util.AbstractBeforeAfterRule$1.evaluate(AbstractBeforeAfterRule.java:43)
at org.apache.lucene.test_framework@10.0.0-SNAPSHOT/org.apache.lucene.tests.util.TestRuleThreadAndTestName$1.evaluate(TestRuleThreadAndTestName.java:45)
at org.apache.lucene.test_framework@10.0.0-SNAPSHOT/org.apache.lucene.tests.util.TestRuleIgnoreAfterMaxFailures$1.evaluate(TestRuleIgnoreAfterMaxFailures.java:60)
at org.apache.lucene.test_framework@10.0.0-SNAPSHOT/org.apache.lucene.tests.util.TestRuleMarkFailure$1.evaluate(TestRuleMarkFailure.java:44)
at junit@4.13.1/org.junit.rules.RunRules.evaluate(RunRules.java:20)
at randomizedtesting.runner@2.8.1/com.carrotsearch.randomizedtesting.rules.StatementAdapter.evaluate(StatementAdapter.java:36)
at randomizedtesting.runner@2.8.1/com.carrotsearch.randomizedtesting.ThreadLeakControl$StatementRunner.run(ThreadLeakControl.java:390)
at randomizedtesting.runner@2.8.1/com.carrotsearch.randomizedtesting.ThreadLeakControl.forkTimeoutingTask(ThreadLeakControl.java:843)
at randomizedtesting.runner@2.8.1/com.carrotsearch.randomizedtesting.ThreadLeakControl$3.evaluate(ThreadLeakControl.java:490)
at randomizedtesting.runner@2.8.1/com.carrotsearch.randomizedtesting.RandomizedRunner.runSingleTest(RandomizedRunner.java:955)
at randomizedtesting.runner@2.8.1/com.carrotsearch.randomizedtesting.RandomizedRunner$5.evaluate(RandomizedRunner.java:840)
at randomizedtesting.runner@2.8.1/com.carrotsearch.randomizedtesting.RandomizedRunner$6.evaluate(RandomizedRunner.java:891)
at randomizedtesting.runner@2.8.1/com.carrotsearch.randomizedtesting.RandomizedRunner$7.evaluate(RandomizedRunner.java:902)
at org.apache.lucene.test_framework@10.0.0-SNAPSHOT/org.apache.lucene.tests.util.AbstractBeforeAfterRule$1.evaluate(AbstractBeforeAfterRule.java:43)
at randomizedtesting.runner@2.8.1/com.carrotsearch.randomizedtesting.rules.StatementAdapter.evaluate(StatementAdapter.java:36)
at org.apache.lucene.test_framework@10.0.0-SNAPSHOT/org.apache.lucene.tests.util.TestRuleStoreClassName$1.evaluate(TestRuleStoreClassName.java:38)
at randomizedtesting.runner@2.8.1/com.carrotsearch.randomizedtesting.rules.NoShadowingOrOverridesOnMethodsRule$1.evaluate(NoShadowingOrOverridesOnMethodsRule.java:40)
at randomizedtesting.runner@2.8.1/com.carrotsearch.randomizedtesting.rules.NoShadowingOrOverridesOnMethodsRule$1.evaluate(NoShadowingOrOverridesOnMethodsRule.java:40)
at randomizedtesting.runner@2.8.1/com.carrotsearch.randomizedtesting.rules.StatementAdapter.evaluate(StatementAdapter.java:36)
at randomizedtesting.runner@2.8.1/com.carrotsearch.randomizedtesting.rules.StatementAdapter.evaluate(StatementAdapter.java:36)
at org.apache.lucene.test_framework@10.0.0-SNAPSHOT/org.apache.lucene.tests.util.TestRuleAssertionsRequired$1.evaluate(TestRuleAssertionsRequired.java:53)
at org.apache.lucene.test_framework@10.0.0-SNAPSHOT/org.apache.lucene.tests.util.AbstractBeforeAfterRule$1.evaluate(AbstractBeforeAfterRule.java:43)
at org.apache.lucene.test_framework@10.0.0-SNAPSHOT/org.apache.lucene.tests.util.TestRuleMarkFailure$1.evaluate(TestRuleMarkFailure.java:44)
at org.apache.lucene.test_framework@10.0.0-SNAPSHOT/org.apache.lucene.tests.util.TestRuleIgnoreAfterMaxFailures$1.evaluate(TestRuleIgnoreAfterMaxFailures.java:60)
at org.apache.lucene.test_framework@10.0.0-SNAPSHOT/org.apache.lucene.tests.util.TestRuleIgnoreTestSuites$1.evaluate(TestRuleIgnoreTestSuites.java:47)
at junit@4.13.1/org.junit.rules.RunRules.evaluate(RunRules.java:20)
at randomizedtesting.runner@2.8.1/com.carrotsearch.randomizedtesting.rules.StatementAdapter.evaluate(StatementAdapter.java:36)
at randomizedtesting.runner@2.8.1/com.carrotsearch.randomizedtesting.ThreadLeakControl$StatementRunner.run(ThreadLeakControl.java:390)
at randomizedtesting.runner@2.8.1/com.carrotsearch.randomizedtesting.ThreadLeakControl.lambda$forkTimeoutingTask$0(ThreadLeakControl.java:850)
at java.base/java.lang.Thread.run(Thread.java:1583)
FAILED: org.apache.lucene.backward_codecs.lucene80.TestBestCompressionLucene80DocValuesFormat.testSortedSetDocValuesWithSkipperSmall
Error Message:
java.lang.NullPointerException: Cannot invoke "org.apache.lucene.index.DocValuesSkipper.maxDocID(int)" because "skipper" is null
Stack Trace:
java.lang.NullPointerException: Cannot invoke "org.apache.lucene.index.DocValuesSkipper.maxDocID(int)" because "skipper" is null
at __randomizedtesting.SeedInfo.seed([B2527FDA3A42ECE9:1FFC4D084BBC7A7F]:0)
at org.apache.lucene.core@10.0.0-SNAPSHOT/org.apache.lucene.index.CheckIndex.checkDocValueSkipper(CheckIndex.java:3280)
at org.apache.lucene.core@10.0.0-SNAPSHOT/org.apache.lucene.index.CheckIndex.checkDocValues(CheckIndex.java:3740)
at org.apache.lucene.core@10.0.0-SNAPSHOT/org.apache.lucene.index.CheckIndex.testDocValues(CheckIndex.java:3242)
at org.apache.lucene.test_framework@10.0.0-SNAPSHOT/org.apache.lucene.tests.index.BaseDocValuesFormatTestCase.assertDocValuesWithSkipper(BaseDocValuesFormatTestCase.java:4196)
at org.apache.lucene.test_framework@10.0.0-SNAPSHOT/org.apache.lucene.tests.index.BaseDocValuesFormatTestCase.doTestSortedSetDocValuesWithSkipper(BaseDocValuesFormatTestCase.java:4090)
at org.apache.lucene.test_framework@10.0.0-SNAPSHOT/org.apache.lucene.tests.index.BaseDocValuesFormatTestCase.testSortedSetDocValuesWithSkipperSmall(BaseDocValuesFormatTestCase.java:4077)
at java.base/jdk.internal.reflect.DirectMethodHandleAccessor.invoke(DirectMethodHandleAccessor.java:103)
at java.base/java.lang.reflect.Method.invoke(Method.java:580)
at randomizedtesting.runner@2.8.1/com.carrotsearch.randomizedtesting.RandomizedRunner.invoke(RandomizedRunner.java:1758)
at randomizedtesting.runner@2.8.1/com.carrotsearch.randomizedtesting.RandomizedRunner$8.evaluate(RandomizedRunner.java:946)
at randomizedtesting.runner@2.8.1/com.carrotsearch.randomizedtesting.RandomizedRunner$9.evaluate(RandomizedRunner.java:982)
at randomizedtesting.runner@2.8.1/com.carrotsearch.randomizedtesting.RandomizedRunner$10.evaluate(RandomizedRunner.java:996)
at org.apache.lucene.test_framework@10.0.0-SNAPSHOT/org.apache.lucene.tests.util.TestRuleSetupTeardownChained$1.evaluate(TestRuleSetupTeardownChained.java:48)
at org.apache.lucene.test_framework@10.0.0-SNAPSHOT/org.apache.lucene.tests.util.AbstractBeforeAfterRule$1.evaluate(AbstractBeforeAfterRule.java:43)
at org.apache.lucene.test_framework@10.0.0-SNAPSHOT/org.apache.lucene.tests.util.TestRuleThreadAndTestName$1.evaluate(TestRuleThreadAndTestName.java:45)
at org.apache.lucene.test_framework@10.0.0-SNAPSHOT/org.apache.lucene.tests.util.TestRuleIgnoreAfterMaxFailures$1.evaluate(TestRuleIgnoreAfterMaxFailures.java:60)
at org.apache.lucene.test_framework@10.0.0-SNAPSHOT/org.apache.lucene.tests.util.TestRuleMarkFailure$1.evaluate(TestRuleMarkFailure.java:44)
at junit@4.13.1/org.junit.rules.RunRules.evaluate(RunRules.java:20)
at randomizedtesting.runner@2.8.1/com.carrotsearch.randomizedtesting.rules.StatementAdapter.evaluate(StatementAdapter.java:36)
at randomizedtesting.runner@2.8.1/com.carrotsearch.randomizedtesting.ThreadLeakControl$StatementRunner.run(ThreadLeakControl.java:390)
at randomizedtesting.runner@2.8.1/com.carrotsearch.randomizedtesting.ThreadLeakControl.forkTimeoutingTask(ThreadLeakControl.java:843)
at randomizedtesting.runner@2.8.1/com.carrotsearch.randomizedtesting.ThreadLeakControl$3.evaluate(ThreadLeakControl.java:490)
at randomizedtesting.runner@2.8.1/com.carrotsearch.randomizedtesting.RandomizedRunner.runSingleTest(RandomizedRunner.java:955)
at randomizedtesting.runner@2.8.1/com.carrotsearch.randomizedtesting.RandomizedRunner$5.evaluate(RandomizedRunner.java:840)
at randomizedtesting.runner@2.8.1/com.carrotsearch.randomizedtesting.RandomizedRunner$6.evaluate(RandomizedRunner.java:891)
at randomizedtesting.runner@2.8.1/com.carrotsearch.randomizedtesting.RandomizedRunner$7.evaluate(RandomizedRunner.java:902)
at org.apache.lucene.test_framework@10.0.0-SNAPSHOT/org.apache.lucene.tests.util.AbstractBeforeAfterRule$1.evaluate(AbstractBeforeAfterRule.java:43)
at randomizedtesting.runner@2.8.1/com.carrotsearch.randomizedtesting.rules.StatementAdapter.evaluate(StatementAdapter.java:36)
at org.apache.lucene.test_framework@10.0.0-SNAPSHOT/org.apache.lucene.tests.util.TestRuleStoreClassName$1.evaluate(TestRuleStoreClassName.java:38)
at randomizedtesting.runner@2.8.1/com.carrotsearch.randomizedtesting.rules.NoShadowingOrOverridesOnMethodsRule$1.evaluate(NoShadowingOrOverridesOnMethodsRule.java:40)
at randomizedtesting.runner@2.8.1/com.carrotsearch.randomizedtesting.rules.NoShadowingOrOverridesOnMethodsRule$1.evaluate(NoShadowingOrOverridesOnMethodsRule.java:40)
at randomizedtesting.runner@2.8.1/com.carrotsearch.randomizedtesting.rules.StatementAdapter.evaluate(StatementAdapter.java:36)
at randomizedtesting.runner@2.8.1/com.carrotsearch.randomizedtesting.rules.StatementAdapter.evaluate(StatementAdapter.java:36)
at org.apache.lucene.test_framework@10.0.0-SNAPSHOT/org.apache.lucene.tests.util.TestRuleAssertionsRequired$1.evaluate(TestRuleAssertionsRequired.java:53)
at org.apache.lucene.test_framework@10.0.0-SNAPSHOT/org.apache.lucene.tests.util.AbstractBeforeAfterRule$1.evaluate(AbstractBeforeAfterRule.java:43)
at org.apache.lucene.test_framework@10.0.0-SNAPSHOT/org.apache.lucene.tests.util.TestRuleMarkFailure$1.evaluate(TestRuleMarkFailure.java:44)
at org.apache.lucene.test_framework@10.0.0-SNAPSHOT/org.apache.lucene.tests.util.TestRuleIgnoreAfterMaxFailures$1.evaluate(TestRuleIgnoreAfterMaxFailures.java:60)
at org.apache.lucene.test_framework@10.0.0-SNAPSHOT/org.apache.lucene.tests.util.TestRuleIgnoreTestSuites$1.evaluate(TestRuleIgnoreTestSuites.java:47)
at junit@4.13.1/org.junit.rules.RunRules.evaluate(RunRules.java:20)
at randomizedtesting.runner@2.8.1/com.carrotsearch.randomizedtesting.rules.StatementAdapter.evaluate(StatementAdapter.java:36)
at randomizedtesting.runner@2.8.1/com.carrotsearch.randomizedtesting.ThreadLeakControl$StatementRunner.run(ThreadLeakControl.java:390)
at randomizedtesting.runner@2.8.1/com.carrotsearch.randomizedtesting.ThreadLeakControl.lambda$forkTimeoutingTask$0(ThreadLeakControl.java:850)
at java.base/java.lang.Thread.run(Thread.java:1583)
FAILED: org.apache.lucene.backward_codecs.lucene80.TestBestCompressionLucene80DocValuesFormat.testNumericDocValuesWithSkipperMedium
Error Message:
java.lang.NullPointerException: Cannot invoke "org.apache.lucene.index.DocValuesSkipper.maxDocID(int)" because "skipper" is null
Stack Trace:
java.lang.NullPointerException: Cannot invoke "org.apache.lucene.index.DocValuesSkipper.maxDocID(int)" because "skipper" is null
at __randomizedtesting.SeedInfo.seed([B2527FDA3A42ECE9:D3E447070B40D010]:0)
at org.apache.lucene.core@10.0.0-SNAPSHOT/org.apache.lucene.index.CheckIndex.checkDocValueSkipper(CheckIndex.java:3280)
at org.apache.lucene.core@10.0.0-SNAPSHOT/org.apache.lucene.index.CheckIndex.checkDocValues(CheckIndex.java:3740)
at org.apache.lucene.core@10.0.0-SNAPSHOT/org.apache.lucene.index.CheckIndex.testDocValues(CheckIndex.java:3242)
at org.apache.lucene.test_framework@10.0.0-SNAPSHOT/org.apache.lucene.tests.index.BaseDocValuesFormatTestCase.assertDocValuesWithSkipper(BaseDocValuesFormatTestCase.java:4196)
at org.apache.lucene.test_framework@10.0.0-SNAPSHOT/org.apache.lucene.tests.index.BaseDocValuesFormatTestCase.doTestNumericDocValuesWithSkipper(BaseDocValuesFormatTestCase.java:3884)
at org.apache.lucene.test_framework@10.0.0-SNAPSHOT/org.apache.lucene.tests.index.BaseDocValuesFormatTestCase.testNumericDocValuesWithSkipperMedium(BaseDocValuesFormatTestCase.java:3875)
at java.base/jdk.internal.reflect.DirectMethodHandleAccessor.invoke(DirectMethodHandleAccessor.java:103)
at java.base/java.lang.reflect.Method.invoke(Method.java:580)
at randomizedtesting.runner@2.8.1/com.carrotsearch.randomizedtesting.RandomizedRunner.invoke(RandomizedRunner.java:1758)
at randomizedtesting.runner@2.8.1/com.carrotsearch.randomizedtesting.RandomizedRunner$8.evaluate(RandomizedRunner.java:946)
at randomizedtesting.runner@2.8.1/com.carrotsearch.randomizedtesting.RandomizedRunner$9.evaluate(RandomizedRunner.java:982)
at randomizedtesting.runner@2.8.1/com.carrotsearch.randomizedtesting.RandomizedRunner$10.evaluate(RandomizedRunner.java:996)
at org.apache.lucene.test_framework@10.0.0-SNAPSHOT/org.apache.lucene.tests.util.TestRuleSetupTeardownChained$1.evaluate(TestRuleSetupTeardownChained.java:48)
at org.apache.lucene.test_framework@10.0.0-SNAPSHOT/org.apache.lucene.tests.util.AbstractBeforeAfterRule$1.evaluate(AbstractBeforeAfterRule.java:43)
at org.apache.lucene.test_framework@10.0.0-SNAPSHOT/org.apache.lucene.tests.util.TestRuleThreadAndTestName$1.evaluate(TestRuleThreadAndTestName.java:45)
at org.apache.lucene.test_framework@10.0.0-SNAPSHOT/org.apache.lucene.tests.util.TestRuleIgnoreAfterMaxFailures$1.evaluate(TestRuleIgnoreAfterMaxFailures.java:60)
at org.apache.lucene.test_framework@10.0.0-SNAPSHOT/org.apache.lucene.tests.util.TestRuleMarkFailure$1.evaluate(TestRuleMarkFailure.java:44)
at junit@4.13.1/org.junit.rules.RunRules.evaluate(RunRules.java:20)
at randomizedtesting.runner@2.8.1/com.carrotsearch.randomizedtesting.rules.StatementAdapter.evaluate(StatementAdapter.java:36)
at randomizedtesting.runner@2.8.1/com.carrotsearch.randomizedtesting.ThreadLeakControl$StatementRunner.run(ThreadLeakControl.java:390)
at randomizedtesting.runner@2.8.1/com.carrotsearch.randomizedtesting.ThreadLeakControl.forkTimeoutingTask(ThreadLeakControl.java:843)
at randomizedtesting.runner@2.8.1/com.carrotsearch.randomizedtesting.ThreadLeakControl$3.evaluate(ThreadLeakControl.java:490)
at randomizedtesting.runner@2.8.1/com.carrotsearch.randomizedtesting.RandomizedRunner.runSingleTest(RandomizedRunner.java:955)
at randomizedtesting.runner@2.8.1/com.carrotsearch.randomizedtesting.RandomizedRunner$5.evaluate(RandomizedRunner.java:840)
at randomizedtesting.runner@2.8.1/com.carrotsearch.randomizedtesting.RandomizedRunner$6.evaluate(RandomizedRunner.java:891)
at randomizedtesting.runner@2.8.1/com.carrotsearch.randomizedtesting.RandomizedRunner$7.evaluate(RandomizedRunner.java:902)
at org.apache.lucene.test_framework@10.0.0-SNAPSHOT/org.apache.lucene.tests.util.AbstractBeforeAfterRule$1.evaluate(AbstractBeforeAfterRule.java:43)
at randomizedtesting.runner@2.8.1/com.carrotsearch.randomizedtesting.rules.StatementAdapter.evaluate(StatementAdapter.java:36)
at org.apache.lucene.test_framework@10.0.0-SNAPSHOT/org.apache.lucene.tests.util.TestRuleStoreClassName$1.evaluate(TestRuleStoreClassName.java:38)
at randomizedtesting.runner@2.8.1/com.carrotsearch.randomizedtesting.rules.NoShadowingOrOverridesOnMethodsRule$1.evaluate(NoShadowingOrOverridesOnMethodsRule.java:40)
at randomizedtesting.runner@2.8.1/com.carrotsearch.randomizedtesting.rules.NoShadowingOrOverridesOnMethodsRule$1.evaluate(NoShadowingOrOverridesOnMethodsRule.java:40)
at randomizedtesting.runner@2.8.1/com.carrotsearch.randomizedtesting.rules.StatementAdapter.evaluate(StatementAdapter.java:36)
at randomizedtesting.runner@2.8.1/com.carrotsearch.randomizedtesting.rules.StatementAdapter.evaluate(StatementAdapter.java:36)
at org.apache.lucene.test_framework@10.0.0-SNAPSHOT/org.apache.lucene.tests.util.TestRuleAssertionsRequired$1.evaluate(TestRuleAssertionsRequired.java:53)
at org.apache.lucene.test_framework@10.0.0-SNAPSHOT/org.apache.lucene.tests.util.AbstractBeforeAfterRule$1.evaluate(AbstractBeforeAfterRule.java:43)
at org.apache.lucene.test_framework@10.0.0-SNAPSHOT/org.apache.lucene.tests.util.TestRuleMarkFailure$1.evaluate(TestRuleMarkFailure.java:44)
at org.apache.lucene.test_framework@10.0.0-SNAPSHOT/org.apache.lucene.tests.util.TestRuleIgnoreAfterMaxFailures$1.evaluate(TestRuleIgnoreAfterMaxFailures.java:60)
at org.apache.lucene.test_framework@10.0.0-SNAPSHOT/org.apache.lucene.tests.util.TestRuleIgnoreTestSuites$1.evaluate(TestRuleIgnoreTestSuites.java:47)
at junit@4.13.1/org.junit.rules.RunRules.evaluate(RunRules.java:20)
at randomizedtesting.runner@2.8.1/com.carrotsearch.randomizedtesting.rules.StatementAdapter.evaluate(StatementAdapter.java:36)
at randomizedtesting.runner@2.8.1/com.carrotsearch.randomizedtesting.ThreadLeakControl$StatementRunner.run(ThreadLeakControl.java:390)
at randomizedtesting.runner@2.8.1/com.carrotsearch.randomizedtesting.ThreadLeakControl.lambda$forkTimeoutingTask$0(ThreadLeakControl.java:850)
at java.base/java.lang.Thread.run(Thread.java:1583)
FAILED: org.apache.lucene.backward_codecs.lucene80.TestBestCompressionLucene80DocValuesFormat.testSortedMergeAwayAllValues
Error Message:
java.lang.NullPointerException: Cannot invoke "org.apache.lucene.index.DocValuesSkipper.docCount()" because "skipper" is null
Stack Trace:
java.lang.NullPointerException: Cannot invoke "org.apache.lucene.index.DocValuesSkipper.docCount()" because "skipper" is null
at __randomizedtesting.SeedInfo.seed([B2527FDA3A42ECE9:87DBF212EB546109]:0)
at org.apache.lucene.test_framework@10.0.0-SNAPSHOT/org.apache.lucene.tests.index.BaseDocValuesFormatTestCase.testSortedMergeAwayAllValues(BaseDocValuesFormatTestCase.java:924)
at java.base/jdk.internal.reflect.DirectMethodHandleAccessor.invoke(DirectMethodHandleAccessor.java:103)
at java.base/java.lang.reflect.Method.invoke(Method.java:580)
at randomizedtesting.runner@2.8.1/com.carrotsearch.randomizedtesting.RandomizedRunner.invoke(RandomizedRunner.java:1758)
at randomizedtesting.runner@2.8.1/com.carrotsearch.randomizedtesting.RandomizedRunner$8.evaluate(RandomizedRunner.java:946)
at randomizedtesting.runner@2.8.1/com.carrotsearch.randomizedtesting.RandomizedRunner$9.evaluate(RandomizedRunner.java:982)
at randomizedtesting.runner@2.8.1/com.carrotsearch.randomizedtesting.RandomizedRunner$10.evaluate(RandomizedRunner.java:996)
at org.apache.lucene.test_framework@10.0.0-SNAPSHOT/org.apache.lucene.tests.util.TestRuleSetupTeardownChained$1.evaluate(TestRuleSetupTeardownChained.java:48)
at org.apache.lucene.test_framework@10.0.0-SNAPSHOT/org.apache.lucene.tests.util.AbstractBeforeAfterRule$1.evaluate(AbstractBeforeAfterRule.java:43)
at org.apache.lucene.test_framework@10.0.0-SNAPSHOT/org.apache.lucene.tests.util.TestRuleThreadAndTestName$1.evaluate(TestRuleThreadAndTestName.java:45)
at org.apache.lucene.test_framework@10.0.0-SNAPSHOT/org.apache.lucene.tests.util.TestRuleIgnoreAfterMaxFailures$1.evaluate(TestRuleIgnoreAfterMaxFailures.java:60)
at org.apache.lucene.test_framework@10.0.0-SNAPSHOT/org.apache.lucene.tests.util.TestRuleMarkFailure$1.evaluate(TestRuleMarkFailure.java:44)
at junit@4.13.1/org.junit.rules.RunRules.evaluate(RunRules.java:20)
at randomizedtesting.runner@2.8.1/com.carrotsearch.randomizedtesting.rules.StatementAdapter.evaluate(StatementAdapter.java:36)
at randomizedtesting.runner@2.8.1/com.carrotsearch.randomizedtesting.ThreadLeakControl$StatementRunner.run(ThreadLeakControl.java:390)
at randomizedtesting.runner@2.8.1/com.carrotsearch.randomizedtesting.ThreadLeakControl.forkTimeoutingTask(ThreadLeakControl.java:843)
at randomizedtesting.runner@2.8.1/com.carrotsearch.randomizedtesting.ThreadLeakControl$3.evaluate(ThreadLeakControl.java:490)
at randomizedtesting.runner@2.8.1/com.carrotsearch.randomizedtesting.RandomizedRunner.runSingleTest(RandomizedRunner.java:955)
at randomizedtesting.runner@2.8.1/com.carrotsearch.randomizedtesting.RandomizedRunner$5.evaluate(RandomizedRunner.java:840)
at randomizedtesting.runner@2.8.1/com.carrotsearch.randomizedtesting.RandomizedRunner$6.evaluate(RandomizedRunner.java:891)
at randomizedtesting.runner@2.8.1/com.carrotsearch.randomizedtesting.RandomizedRunner$7.evaluate(RandomizedRunner.java:902)
at org.apache.lucene.test_framework@10.0.0-SNAPSHOT/org.apache.lucene.tests.util.AbstractBeforeAfterRule$1.evaluate(AbstractBeforeAfterRule.java:43)
at randomizedtesting.runner@2.8.1/com.carrotsearch.randomizedtesting.rules.StatementAdapter.evaluate(StatementAdapter.java:36)
at org.apache.lucene.test_framework@10.0.0-SNAPSHOT/org.apache.lucene.tests.util.TestRuleStoreClassName$1.evaluate(TestRuleStoreClassName.java:38)
at randomizedtesting.runner@2.8.1/com.carrotsearch.randomizedtesting.rules.NoShadowingOrOverridesOnMethodsRule$1.evaluate(NoShadowingOrOverridesOnMethodsRule.java:40)
at randomizedtesting.runner@2.8.1/com.carrotsearch.randomizedtesting.rules.NoShadowingOrOverridesOnMethodsRule$1.evaluate(NoShadowingOrOverridesOnMethodsRule.java:40)
at randomizedtesting.runner@2.8.1/com.carrotsearch.randomizedtesting.rules.StatementAdapter.evaluate(StatementAdapter.java:36)
at randomizedtesting.runner@2.8.1/com.carrotsearch.randomizedtesting.rules.StatementAdapter.evaluate(StatementAdapter.java:36)
at org.apache.lucene.test_framework@10.0.0-SNAPSHOT/org.apache.lucene.tests.util.TestRuleAssertionsRequired$1.evaluate(TestRuleAssertionsRequired.java:53)
at org.apache.lucene.test_framework@10.0.0-SNAPSHOT/org.apache.lucene.tests.util.AbstractBeforeAfterRule$1.evaluate(AbstractBeforeAfterRule.java:43)
at org.apache.lucene.test_framework@10.0.0-SNAPSHOT/org.apache.lucene.tests.util.TestRuleMarkFailure$1.evaluate(TestRuleMarkFailure.java:44)
at org.apache.lucene.test_framework@10.0.0-SNAPSHOT/org.apache.lucene.tests.util.TestRuleIgnoreAfterMaxFailures$1.evaluate(TestRuleIgnoreAfterMaxFailures.java:60)
at org.apache.lucene.test_framework@10.0.0-SNAPSHOT/org.apache.lucene.tests.util.TestRuleIgnoreTestSuites$1.evaluate(TestRuleIgnoreTestSuites.java:47)
at junit@4.13.1/org.junit.rules.RunRules.evaluate(RunRules.java:20)
at randomizedtesting.runner@2.8.1/com.carrotsearch.randomizedtesting.rules.StatementAdapter.evaluate(StatementAdapter.java:36)
at randomizedtesting.runner@2.8.1/com.carrotsearch.randomizedtesting.ThreadLeakControl$StatementRunner.run(ThreadLeakControl.java:390)
at randomizedtesting.runner@2.8.1/com.carrotsearch.randomizedtesting.ThreadLeakControl.lambda$forkTimeoutingTask$0(ThreadLeakControl.java:850)
at java.base/java.lang.Thread.run(Thread.java:1583)
FAILED: org.apache.lucene.backward_codecs.lucene80.TestBestCompressionLucene80DocValuesFormat.testSortedDocValuesWithSkipperSmall
Error Message:
java.lang.NullPointerException: Cannot invoke "org.apache.lucene.index.DocValuesSkipper.maxDocID(int)" because "skipper" is null
Stack Trace:
java.lang.NullPointerException: Cannot invoke "org.apache.lucene.index.DocValuesSkipper.maxDocID(int)" because "skipper" is null
at __randomizedtesting.SeedInfo.seed([B2527FDA3A42ECE9:9CCEA16ECDDEFC91]:0)
at org.apache.lucene.core@10.0.0-SNAPSHOT/org.apache.lucene.index.CheckIndex.checkDocValueSkipper(CheckIndex.java:3280)
at org.apache.lucene.core@10.0.0-SNAPSHOT/org.apache.lucene.index.CheckIndex.checkDocValues(CheckIndex.java:3740)
at org.apache.lucene.core@10.0.0-SNAPSHOT/org.apache.lucene.index.CheckIndex.testDocValues(CheckIndex.java:3242)
at org.apache.lucene.test_framework@10.0.0-SNAPSHOT/org.apache.lucene.tests.index.BaseDocValuesFormatTestCase.assertDocValuesWithSkipper(BaseDocValuesFormatTestCase.java:4196)
at org.apache.lucene.test_framework@10.0.0-SNAPSHOT/org.apache.lucene.tests.index.BaseDocValuesFormatTestCase.doTestSortedDocValuesWithSkipper(BaseDocValuesFormatTestCase.java:4029)
at org.apache.lucene.test_framework@10.0.0-SNAPSHOT/org.apache.lucene.tests.index.BaseDocValuesFormatTestCase.testSortedDocValuesWithSkipperSmall(BaseDocValuesFormatTestCase.java:4016)
at java.base/jdk.internal.reflect.DirectMethodHandleAccessor.invoke(DirectMethodHandleAccessor.java:103)
at java.base/java.lang.reflect.Method.invoke(Method.java:580)
at randomizedtesting.runner@2.8.1/com.carrotsearch.randomizedtesting.RandomizedRunner.invoke(RandomizedRunner.java:1758)
at randomizedtesting.runner@2.8.1/com.carrotsearch.randomizedtesting.RandomizedRunner$8.evaluate(RandomizedRunner.java:946)
at randomizedtesting.runner@2.8.1/com.carrotsearch.randomizedtesting.RandomizedRunner$9.evaluate(RandomizedRunner.java:982)
at randomizedtesting.runner@2.8.1/com.carrotsearch.randomizedtesting.RandomizedRunner$10.evaluate(RandomizedRunner.java:996)
at org.apache.lucene.test_framework@10.0.0-SNAPSHOT/org.apache.lucene.tests.util.TestRuleSetupTeardownChained$1.evaluate(TestRuleSetupTeardownChained.java:48)
at org.apache.lucene.test_framework@10.0.0-SNAPSHOT/org.apache.lucene.tests.util.AbstractBeforeAfterRule$1.evaluate(AbstractBeforeAfterRule.java:43)
at org.apache.lucene.test_framework@10.0.0-SNAPSHOT/org.apache.lucene.tests.util.TestRuleThreadAndTestName$1.evaluate(TestRuleThreadAndTestName.java:45)
at org.apache.lucene.test_framework@10.0.0-SNAPSHOT/org.apache.lucene.tests.util.TestRuleIgnoreAfterMaxFailures$1.evaluate(TestRuleIgnoreAfterMaxFailures.java:60)
at org.apache.lucene.test_framework@10.0.0-SNAPSHOT/org.apache.lucene.tests.util.TestRuleMarkFailure$1.evaluate(TestRuleMarkFailure.java:44)
at junit@4.13.1/org.junit.rules.RunRules.evaluate(RunRules.java:20)
at randomizedtesting.runner@2.8.1/com.carrotsearch.randomizedtesting.rules.StatementAdapter.evaluate(StatementAdapter.java:36)
at randomizedtesting.runner@2.8.1/com.carrotsearch.randomizedtesting.ThreadLeakControl$StatementRunner.run(ThreadLeakControl.java:390)
at randomizedtesting.runner@2.8.1/com.carrotsearch.randomizedtesting.ThreadLeakControl.forkTimeoutingTask(ThreadLeakControl.java:843)
at randomizedtesting.runner@2.8.1/com.carrotsearch.randomizedtesting.ThreadLeakControl$3.evaluate(ThreadLeakControl.java:490)
at randomizedtesting.runner@2.8.1/com.carrotsearch.randomizedtesting.RandomizedRunner.runSingleTest(RandomizedRunner.java:955)
at randomizedtesting.runner@2.8.1/com.carrotsearch.randomizedtesting.RandomizedRunner$5.evaluate(RandomizedRunner.java:840)
at randomizedtesting.runner@2.8.1/com.carrotsearch.randomizedtesting.RandomizedRunner$6.evaluate(RandomizedRunner.java:891)
at randomizedtesting.runner@2.8.1/com.carrotsearch.randomizedtesting.RandomizedRunner$7.evaluate(RandomizedRunner.java:902)
at org.apache.lucene.test_framework@10.0.0-SNAPSHOT/org.apache.lucene.tests.util.AbstractBeforeAfterRule$1.evaluate(AbstractBeforeAfterRule.java:43)
at randomizedtesting.runner@2.8.1/com.carrotsearch.randomizedtesting.rules.StatementAdapter.evaluate(StatementAdapter.java:36)
at org.apache.lucene.test_framework@10.0.0-SNAPSHOT/org.apache.lucene.tests.util.TestRuleStoreClassName$1.evaluate(TestRuleStoreClassName.java:38)
at randomizedtesting.runner@2.8.1/com.carrotsearch.randomizedtesting.rules.NoShadowingOrOverridesOnMethodsRule$1.evaluate(NoShadowingOrOverridesOnMethodsRule.java:40)
at randomizedtesting.runner@2.8.1/com.carrotsearch.randomizedtesting.rules.NoShadowingOrOverridesOnMethodsRule$1.evaluate(NoShadowingOrOverridesOnMethodsRule.java:40)
at randomizedtesting.runner@2.8.1/com.carrotsearch.randomizedtesting.rules.StatementAdapter.evaluate(StatementAdapter.java:36)
at randomizedtesting.runner@2.8.1/com.carrotsearch.randomizedtesting.rules.StatementAdapter.evaluate(StatementAdapter.java:36)
at org.apache.lucene.test_framework@10.0.0-SNAPSHOT/org.apache.lucene.tests.util.TestRuleAssertionsRequired$1.evaluate(TestRuleAssertionsRequired.java:53)
at org.apache.lucene.test_framework@10.0.0-SNAPSHOT/org.apache.lucene.tests.util.AbstractBeforeAfterRule$1.evaluate(AbstractBeforeAfterRule.java:43)
at org.apache.lucene.test_framework@10.0.0-SNAPSHOT/org.apache.lucene.tests.util.TestRuleMarkFailure$1.evaluate(TestRuleMarkFailure.java:44)
at org.apache.lucene.test_framework@10.0.0-SNAPSHOT/org.apache.lucene.tests.util.TestRuleIgnoreAfterMaxFailures$1.evaluate(TestRuleIgnoreAfterMaxFailures.java:60)
at org.apache.lucene.test_framework@10.0.0-SNAPSHOT/org.apache.lucene.tests.util.TestRuleIgnoreTestSuites$1.evaluate(TestRuleIgnoreTestSuites.java:47)
at junit@4.13.1/org.junit.rules.RunRules.evaluate(RunRules.java:20)
at randomizedtesting.runner@2.8.1/com.carrotsearch.randomizedtesting.rules.StatementAdapter.evaluate(StatementAdapter.java:36)
at randomizedtesting.runner@2.8.1/com.carrotsearch.randomizedtesting.ThreadLeakControl$StatementRunner.run(ThreadLeakControl.java:390)
at randomizedtesting.runner@2.8.1/com.carrotsearch.randomizedtesting.ThreadLeakControl.lambda$forkTimeoutingTask$0(ThreadLeakControl.java:850)
at java.base/java.lang.Thread.run(Thread.java:1583)
FAILED: org.apache.lucene.backward_codecs.lucene80.TestBestCompressionLucene80DocValuesFormat.testNumericMergeAwayAllValuesLargeSegment
Error Message:
java.lang.NullPointerException: Cannot invoke "org.apache.lucene.index.DocValuesSkipper.docCount()" because "skipper" is null
Stack Trace:
java.lang.NullPointerException: Cannot invoke "org.apache.lucene.index.DocValuesSkipper.docCount()" because "skipper" is null
at __randomizedtesting.SeedInfo.seed([B2527FDA3A42ECE9:D5DA25396E6A9760]:0)
at org.apache.lucene.test_framework@10.0.0-SNAPSHOT/org.apache.lucene.tests.index.BaseDocValuesFormatTestCase.testNumericMergeAwayAllValuesLargeSegment(BaseDocValuesFormatTestCase.java:3638)
at java.base/jdk.internal.reflect.DirectMethodHandleAccessor.invoke(DirectMethodHandleAccessor.java:103)
at java.base/java.lang.reflect.Method.invoke(Method.java:580)
at randomizedtesting.runner@2.8.1/com.carrotsearch.randomizedtesting.RandomizedRunner.invoke(RandomizedRunner.java:1758)
at randomizedtesting.runner@2.8.1/com.carrotsearch.randomizedtesting.RandomizedRunner$8.evaluate(RandomizedRunner.java:946)
at randomizedtesting.runner@2.8.1/com.carrotsearch.randomizedtesting.RandomizedRunner$9.evaluate(RandomizedRunner.java:982)
at randomizedtesting.runner@2.8.1/com.carrotsearch.randomizedtesting.RandomizedRunner$10.evaluate(RandomizedRunner.java:996)
at org.apache.lucene.test_framework@10.0.0-SNAPSHOT/org.apache.lucene.tests.util.TestRuleSetupTeardownChained$1.evaluate(TestRuleSetupTeardownChained.java:48)
at org.apache.lucene.test_framework@10.0.0-SNAPSHOT/org.apache.lucene.tests.util.AbstractBeforeAfterRule$1.evaluate(AbstractBeforeAfterRule.java:43)
at org.apache.lucene.test_framework@10.0.0-SNAPSHOT/org.apache.lucene.tests.util.TestRuleThreadAndTestName$1.evaluate(TestRuleThreadAndTestName.java:45)
at org.apache.lucene.test_framework@10.0.0-SNAPSHOT/org.apache.lucene.tests.util.TestRuleIgnoreAfterMaxFailures$1.evaluate(TestRuleIgnoreAfterMaxFailures.java:60)
at org.apache.lucene.test_framework@10.0.0-SNAPSHOT/org.apache.lucene.tests.util.TestRuleMarkFailure$1.evaluate(TestRuleMarkFailure.java:44)
at junit@4.13.1/org.junit.rules.RunRules.evaluate(RunRules.java:20)
at randomizedtesting.runner@2.8.1/com.carrotsearch.randomizedtesting.rules.StatementAdapter.evaluate(StatementAdapter.java:36)
at randomizedtesting.runner@2.8.1/com.carrotsearch.randomizedtesting.ThreadLeakControl$StatementRunner.run(ThreadLeakControl.java:390)
at randomizedtesting.runner@2.8.1/com.carrotsearch.randomizedtesting.ThreadLeakControl.forkTimeoutingTask(ThreadLeakControl.java:843)
at randomizedtesting.runner@2.8.1/com.carrotsearch.randomizedtesting.ThreadLeakControl$3.evaluate(ThreadLeakControl.java:490)
at randomizedtesting.runner@2.8.1/com.carrotsearch.randomizedtesting.RandomizedRunner.runSingleTest(RandomizedRunner.java:955)
at randomizedtesting.runner@2.8.1/com.carrotsearch.randomizedtesting.RandomizedRunner$5.evaluate(RandomizedRunner.java:840)
at randomizedtesting.runner@2.8.1/com.carrotsearch.randomizedtesting.RandomizedRunner$6.evaluate(RandomizedRunner.java:891)
at randomizedtesting.runner@2.8.1/com.carrotsearch.randomizedtesting.RandomizedRunner$7.evaluate(RandomizedRunner.java:902)
at org.apache.lucene.test_framework@10.0.0-SNAPSHOT/org.apache.lucene.tests.util.AbstractBeforeAfterRule$1.evaluate(AbstractBeforeAfterRule.java:43)
at randomizedtesting.runner@2.8.1/com.carrotsearch.randomizedtesting.rules.StatementAdapter.evaluate(StatementAdapter.java:36)
at org.apache.lucene.test_framework@10.0.0-SNAPSHOT/org.apache.lucene.tests.util.TestRuleStoreClassName$1.evaluate(TestRuleStoreClassName.java:38)
at randomizedtesting.runner@2.8.1/com.carrotsearch.randomizedtesting.rules.NoShadowingOrOverridesOnMethodsRule$1.evaluate(NoShadowingOrOverridesOnMethodsRule.java:40)
at randomizedtesting.runner@2.8.1/com.carrotsearch.randomizedtesting.rules.NoShadowingOrOverridesOnMethodsRule$1.evaluate(NoShadowingOrOverridesOnMethodsRule.java:40)
at randomizedtesting.runner@2.8.1/com.carrotsearch.randomizedtesting.rules.StatementAdapter.evaluate(StatementAdapter.java:36)
at randomizedtesting.runner@2.8.1/com.carrotsearch.randomizedtesting.rules.StatementAdapter.evaluate(StatementAdapter.java:36)
at org.apache.lucene.test_framework@10.0.0-SNAPSHOT/org.apache.lucene.tests.util.TestRuleAssertionsRequired$1.evaluate(TestRuleAssertionsRequired.java:53)
at org.apache.lucene.test_framework@10.0.0-SNAPSHOT/org.apache.lucene.tests.util.AbstractBeforeAfterRule$1.evaluate(AbstractBeforeAfterRule.java:43)
at org.apache.lucene.test_framework@10.0.0-SNAPSHOT/org.apache.lucene.tests.util.TestRuleMarkFailure$1.evaluate(TestRuleMarkFailure.java:44)
at org.apache.lucene.test_framework@10.0.0-SNAPSHOT/org.apache.lucene.tests.util.TestRuleIgnoreAfterMaxFailures$1.evaluate(TestRuleIgnoreAfterMaxFailures.java:60)
at org.apache.lucene.test_framework@10.0.0-SNAPSHOT/org.apache.lucene.tests.util.TestRuleIgnoreTestSuites$1.evaluate(TestRuleIgnoreTestSuites.java:47)
at junit@4.13.1/org.junit.rules.RunRules.evaluate(RunRules.java:20)
at randomizedtesting.runner@2.8.1/com.carrotsearch.randomizedtesting.rules.StatementAdapter.evaluate(StatementAdapter.java:36)
at randomizedtesting.runner@2.8.1/com.carrotsearch.randomizedtesting.ThreadLeakControl$StatementRunner.run(ThreadLeakControl.java:390)
at randomizedtesting.runner@2.8.1/com.carrotsearch.randomizedtesting.ThreadLeakControl.lambda$forkTimeoutingTask$0(ThreadLeakControl.java:850)
at java.base/java.lang.Thread.run(Thread.java:1583)
FAILED: org.apache.lucene.backward_codecs.lucene80.TestBestCompressionLucene80DocValuesFormat.testSortedNumberMergeAwayAllValues
Error Message:
java.lang.NullPointerException: Cannot invoke "org.apache.lucene.index.DocValuesSkipper.docCount()" because "skipper" is null
Stack Trace:
java.lang.NullPointerException: Cannot invoke "org.apache.lucene.index.DocValuesSkipper.docCount()" because "skipper" is null
at __randomizedtesting.SeedInfo.seed([B2527FDA3A42ECE9:7A02D59255EE8137]:0)
at org.apache.lucene.test_framework@10.0.0-SNAPSHOT/org.apache.lucene.tests.index.BaseDocValuesFormatTestCase.testSortedNumberMergeAwayAllValues(BaseDocValuesFormatTestCase.java:3387)
at java.base/jdk.internal.reflect.DirectMethodHandleAccessor.invoke(DirectMethodHandleAccessor.java:103)
at java.base/java.lang.reflect.Method.invoke(Method.java:580)
at randomizedtesting.runner@2.8.1/com.carrotsearch.randomizedtesting.RandomizedRunner.invoke(RandomizedRunner.java:1758)
at randomizedtesting.runner@2.8.1/com.carrotsearch.randomizedtesting.RandomizedRunner$8.evaluate(RandomizedRunner.java:946)
at randomizedtesting.runner@2.8.1/com.carrotsearch.randomizedtesting.RandomizedRunner$9.evaluate(RandomizedRunner.java:982)
at randomizedtesting.runner@2.8.1/com.carrotsearch.randomizedtesting.RandomizedRunner$10.evaluate(RandomizedRunner.java:996)
at org.apache.lucene.test_framework@10.0.0-SNAPSHOT/org.apache.lucene.tests.util.TestRuleSetupTeardownChained$1.evaluate(TestRuleSetupTeardownChained.java:48)
at org.apache.lucene.test_framework@10.0.0-SNAPSHOT/org.apache.lucene.tests.util.AbstractBeforeAfterRule$1.evaluate(AbstractBeforeAfterRule.java:43)
at org.apache.lucene.test_framework@10.0.0-SNAPSHOT/org.apache.lucene.tests.util.TestRuleThreadAndTestName$1.evaluate(TestRuleThreadAndTestName.java:45)
at org.apache.lucene.test_framework@10.0.0-SNAPSHOT/org.apache.lucene.tests.util.TestRuleIgnoreAfterMaxFailures$1.evaluate(TestRuleIgnoreAfterMaxFailures.java:60)
at org.apache.lucene.test_framework@10.0.0-SNAPSHOT/org.apache.lucene.tests.util.TestRuleMarkFailure$1.evaluate(TestRuleMarkFailure.java:44)
at junit@4.13.1/org.junit.rules.RunRules.evaluate(RunRules.java:20)
at randomizedtesting.runner@2.8.1/com.carrotsearch.randomizedtesting.rules.StatementAdapter.evaluate(StatementAdapter.java:36)
at randomizedtesting.runner@2.8.1/com.carrotsearch.randomizedtesting.ThreadLeakControl$StatementRunner.run(ThreadLeakControl.java:390)
at randomizedtesting.runner@2.8.1/com.carrotsearch.randomizedtesting.ThreadLeakControl.forkTimeoutingTask(ThreadLeakControl.java:843)
at randomizedtesting.runner@2.8.1/com.carrotsearch.randomizedtesting.ThreadLeakControl$3.evaluate(ThreadLeakControl.java:490)
at randomizedtesting.runner@2.8.1/com.carrotsearch.randomizedtesting.RandomizedRunner.runSingleTest(RandomizedRunner.java:955)
at randomizedtesting.runner@2.8.1/com.carrotsearch.randomizedtesting.RandomizedRunner$5.evaluate(RandomizedRunner.java:840)
at randomizedtesting.runner@2.8.1/com.carrotsearch.randomizedtesting.RandomizedRunner$6.evaluate(RandomizedRunner.java:891)
at randomizedtesting.runner@2.8.1/com.carrotsearch.randomizedtesting.RandomizedRunner$7.evaluate(RandomizedRunner.java:902)
at org.apache.lucene.test_framework@10.0.0-SNAPSHOT/org.apache.lucene.tests.util.AbstractBeforeAfterRule$1.evaluate(AbstractBeforeAfterRule.java:43)
at randomizedtesting.runner@2.8.1/com.carrotsearch.randomizedtesting.rules.StatementAdapter.evaluate(StatementAdapter.java:36)
at org.apache.lucene.test_framework@10.0.0-SNAPSHOT/org.apache.lucene.tests.util.TestRuleStoreClassName$1.evaluate(TestRuleStoreClassName.java:38)
at randomizedtesting.runner@2.8.1/com.carrotsearch.randomizedtesting.rules.NoShadowingOrOverridesOnMethodsRule$1.evaluate(NoShadowingOrOverridesOnMethodsRule.java:40)
at randomizedtesting.runner@2.8.1/com.carrotsearch.randomizedtesting.rules.NoShadowingOrOverridesOnMethodsRule$1.evaluate(NoShadowingOrOverridesOnMethodsRule.java:40)
at randomizedtesting.runner@2.8.1/com.carrotsearch.randomizedtesting.rules.StatementAdapter.evaluate(StatementAdapter.java:36)
at randomizedtesting.runner@2.8.1/com.carrotsearch.randomizedtesting.rules.StatementAdapter.evaluate(StatementAdapter.java:36)
at org.apache.lucene.test_framework@10.0.0-SNAPSHOT/org.apache.lucene.tests.util.TestRuleAssertionsRequired$1.evaluate(TestRuleAssertionsRequired.java:53)
at org.apache.lucene.test_framework@10.0.0-SNAPSHOT/org.apache.lucene.tests.util.AbstractBeforeAfterRule$1.evaluate(AbstractBeforeAfterRule.java:43)
at org.apache.lucene.test_framework@10.0.0-SNAPSHOT/org.apache.lucene.tests.util.TestRuleMarkFailure$1.evaluate(TestRuleMarkFailure.java:44)
at org.apache.lucene.test_framework@10.0.0-SNAPSHOT/org.apache.lucene.tests.util.TestRuleIgnoreAfterMaxFailures$1.evaluate(TestRuleIgnoreAfterMaxFailures.java:60)
at org.apache.lucene.test_framework@10.0.0-SNAPSHOT/org.apache.lucene.tests.util.TestRuleIgnoreTestSuites$1.evaluate(TestRuleIgnoreTestSuites.java:47)
at junit@4.13.1/org.junit.rules.RunRules.evaluate(RunRules.java:20)
at randomizedtesting.runner@2.8.1/com.carrotsearch.randomizedtesting.rules.StatementAdapter.evaluate(StatementAdapter.java:36)
at randomizedtesting.runner@2.8.1/com.carrotsearch.randomizedtesting.ThreadLeakControl$StatementRunner.run(ThreadLeakControl.java:390)
at randomizedtesting.runner@2.8.1/com.carrotsearch.randomizedtesting.ThreadLeakControl.lambda$forkTimeoutingTask$0(ThreadLeakControl.java:850)
at java.base/java.lang.Thread.run(Thread.java:1583)
FAILED: org.apache.lucene.backward_codecs.lucene80.TestBestCompressionLucene80DocValuesFormat.testSortedDocValuesWithSkipperBig
Error Message:
java.lang.NullPointerException: Cannot invoke "org.apache.lucene.index.DocValuesSkipper.maxDocID(int)" because "skipper" is null
Stack Trace:
java.lang.NullPointerException: Cannot invoke "org.apache.lucene.index.DocValuesSkipper.maxDocID(int)" because "skipper" is null
at __randomizedtesting.SeedInfo.seed([B2527FDA3A42ECE9:58AFB9BBB73740E7]:0)
at org.apache.lucene.core@10.0.0-SNAPSHOT/org.apache.lucene.index.CheckIndex.checkDocValueSkipper(CheckIndex.java:3280)
at org.apache.lucene.core@10.0.0-SNAPSHOT/org.apache.lucene.index.CheckIndex.checkDocValues(CheckIndex.java:3740)
at org.apache.lucene.core@10.0.0-SNAPSHOT/org.apache.lucene.index.CheckIndex.testDocValues(CheckIndex.java:3242)
at org.apache.lucene.test_framework@10.0.0-SNAPSHOT/org.apache.lucene.tests.index.BaseDocValuesFormatTestCase.assertDocValuesWithSkipper(BaseDocValuesFormatTestCase.java:4196)
at org.apache.lucene.test_framework@10.0.0-SNAPSHOT/org.apache.lucene.tests.index.BaseDocValuesFormatTestCase.doTestSortedDocValuesWithSkipper(BaseDocValuesFormatTestCase.java:4029)
at org.apache.lucene.test_framework@10.0.0-SNAPSHOT/org.apache.lucene.tests.index.BaseDocValuesFormatTestCase.testSortedDocValuesWithSkipperBig(BaseDocValuesFormatTestCase.java:4025)
at java.base/jdk.internal.reflect.DirectMethodHandleAccessor.invoke(DirectMethodHandleAccessor.java:103)
at java.base/java.lang.reflect.Method.invoke(Method.java:580)
at randomizedtesting.runner@2.8.1/com.carrotsearch.randomizedtesting.RandomizedRunner.invoke(RandomizedRunner.java:1758)
at randomizedtesting.runner@2.8.1/com.carrotsearch.randomizedtesting.RandomizedRunner$8.evaluate(RandomizedRunner.java:946)
at randomizedtesting.runner@2.8.1/com.carrotsearch.randomizedtesting.RandomizedRunner$9.evaluate(RandomizedRunner.java:982)
at randomizedtesting.runner@2.8.1/com.carrotsearch.randomizedtesting.RandomizedRunner$10.evaluate(RandomizedRunner.java:996)
at org.apache.lucene.test_framework@10.0.0-SNAPSHOT/org.apache.lucene.tests.util.TestRuleSetupTeardownChained$1.evaluate(TestRuleSetupTeardownChained.java:48)
at org.apache.lucene.test_framework@10.0.0-SNAPSHOT/org.apache.lucene.tests.util.AbstractBeforeAfterRule$1.evaluate(AbstractBeforeAfterRule.java:43)
at org.apache.lucene.test_framework@10.0.0-SNAPSHOT/org.apache.lucene.tests.util.TestRuleThreadAndTestName$1.evaluate(TestRuleThreadAndTestName.java:45)
at org.apache.lucene.test_framework@10.0.0-SNAPSHOT/org.apache.lucene.tests.util.TestRuleIgnoreAfterMaxFailures$1.evaluate(TestRuleIgnoreAfterMaxFailures.java:60)
at org.apache.lucene.test_framework@10.0.0-SNAPSHOT/org.apache.lucene.tests.util.TestRuleMarkFailure$1.evaluate(TestRuleMarkFailure.java:44)
at junit@4.13.1/org.junit.rules.RunRules.evaluate(RunRules.java:20)
at randomizedtesting.runner@2.8.1/com.carrotsearch.randomizedtesting.rules.StatementAdapter.evaluate(StatementAdapter.java:36)
at randomizedtesting.runner@2.8.1/com.carrotsearch.randomizedtesting.ThreadLeakControl$StatementRunner.run(ThreadLeakControl.java:390)
at randomizedtesting.runner@2.8.1/com.carrotsearch.randomizedtesting.ThreadLeakControl.forkTimeoutingTask(ThreadLeakControl.java:843)
at randomizedtesting.runner@2.8.1/com.carrotsearch.randomizedtesting.ThreadLeakControl$3.evaluate(ThreadLeakControl.java:490)
at randomizedtesting.runner@2.8.1/com.carrotsearch.randomizedtesting.RandomizedRunner.runSingleTest(RandomizedRunner.java:955)
at randomizedtesting.runner@2.8.1/com.carrotsearch.randomizedtesting.RandomizedRunner$5.evaluate(RandomizedRunner.java:840)
at randomizedtesting.runner@2.8.1/com.carrotsearch.randomizedtesting.RandomizedRunner$6.evaluate(RandomizedRunner.java:891)
at randomizedtesting.runner@2.8.1/com.carrotsearch.randomizedtesting.RandomizedRunner$7.evaluate(RandomizedRunner.java:902)
at org.apache.lucene.test_framework@10.0.0-SNAPSHOT/org.apache.lucene.tests.util.AbstractBeforeAfterRule$1.evaluate(AbstractBeforeAfterRule.java:43)
at randomizedtesting.runner@2.8.1/com.carrotsearch.randomizedtesting.rules.StatementAdapter.evaluate(StatementAdapter.java:36)
at org.apache.lucene.test_framework@10.0.0-SNAPSHOT/org.apache.lucene.tests.util.TestRuleStoreClassName$1.evaluate(TestRuleStoreClassName.java:38)
at randomizedtesting.runner@2.8.1/com.carrotsearch.randomizedtesting.rules.NoShadowingOrOverridesOnMethodsRule$1.evaluate(NoShadowingOrOverridesOnMethodsRule.java:40)
at randomizedtesting.runner@2.8.1/com.carrotsearch.randomizedtesting.rules.NoShadowingOrOverridesOnMethodsRule$1.evaluate(NoShadowingOrOverridesOnMethodsRule.java:40)
at randomizedtesting.runner@2.8.1/com.carrotsearch.randomizedtesting.rules.StatementAdapter.evaluate(StatementAdapter.java:36)
at randomizedtesting.runner@2.8.1/com.carrotsearch.randomizedtesting.rules.StatementAdapter.evaluate(StatementAdapter.java:36)
at org.apache.lucene.test_framework@10.0.0-SNAPSHOT/org.apache.lucene.tests.util.TestRuleAssertionsRequired$1.evaluate(TestRuleAssertionsRequired.java:53)
at org.apache.lucene.test_framework@10.0.0-SNAPSHOT/org.apache.lucene.tests.util.AbstractBeforeAfterRule$1.evaluate(AbstractBeforeAfterRule.java:43)
at org.apache.lucene.test_framework@10.0.0-SNAPSHOT/org.apache.lucene.tests.util.TestRuleMarkFailure$1.evaluate(TestRuleMarkFailure.java:44)
at org.apache.lucene.test_framework@10.0.0-SNAPSHOT/org.apache.lucene.tests.util.TestRuleIgnoreAfterMaxFailures$1.evaluate(TestRuleIgnoreAfterMaxFailures.java:60)
at org.apache.lucene.test_framework@10.0.0-SNAPSHOT/org.apache.lucene.tests.util.TestRuleIgnoreTestSuites$1.evaluate(TestRuleIgnoreTestSuites.java:47)
at junit@4.13.1/org.junit.rules.RunRules.evaluate(RunRules.java:20)
at randomizedtesting.runner@2.8.1/com.carrotsearch.randomizedtesting.rules.StatementAdapter.evaluate(StatementAdapter.java:36)
at randomizedtesting.runner@2.8.1/com.carrotsearch.randomizedtesting.ThreadLeakControl$StatementRunner.run(ThreadLeakControl.java:390)
at randomizedtesting.runner@2.8.1/com.carrotsearch.randomizedtesting.ThreadLeakControl.lambda$forkTimeoutingTask$0(ThreadLeakControl.java:850)
at java.base/java.lang.Thread.run(Thread.java:1583)
FAILED: org.apache.lucene.backward_codecs.lucene80.TestBestCompressionLucene80DocValuesFormat.testSortedSetMergeAwayAllValues
Error Message:
java.lang.NullPointerException: Cannot invoke "org.apache.lucene.index.DocValuesSkipper.docCount()" because "skipper" is null
Stack Trace:
java.lang.NullPointerException: Cannot invoke "org.apache.lucene.index.DocValuesSkipper.docCount()" because "skipper" is null
at __randomizedtesting.SeedInfo.seed([B2527FDA3A42ECE9:76524575F02C8D05]:0)
at org.apache.lucene.test_framework@10.0.0-SNAPSHOT/org.apache.lucene.tests.index.BaseDocValuesFormatTestCase.testSortedSetMergeAwayAllValues(BaseDocValuesFormatTestCase.java:2274)
at java.base/jdk.internal.reflect.DirectMethodHandleAccessor.invoke(DirectMethodHandleAccessor.java:103)
at java.base/java.lang.reflect.Method.invoke(Method.java:580)
at randomizedtesting.runner@2.8.1/com.carrotsearch.randomizedtesting.RandomizedRunner.invoke(RandomizedRunner.java:1758)
at randomizedtesting.runner@2.8.1/com.carrotsearch.randomizedtesting.RandomizedRunner$8.evaluate(RandomizedRunner.java:946)
at randomizedtesting.runner@2.8.1/com.carrotsearch.randomizedtesting.RandomizedRunner$9.evaluate(RandomizedRunner.java:982)
at randomizedtesting.runner@2.8.1/com.carrotsearch.randomizedtesting.RandomizedRunner$10.evaluate(RandomizedRunner.java:996)
at org.apache.lucene.test_framework@10.0.0-SNAPSHOT/org.apache.lucene.tests.util.TestRuleSetupTeardownChained$1.evaluate(TestRuleSetupTeardownChained.java:48)
at org.apache.lucene.test_framework@10.0.0-SNAPSHOT/org.apache.lucene.tests.util.AbstractBeforeAfterRule$1.evaluate(AbstractBeforeAfterRule.java:43)
at org.apache.lucene.test_framework@10.0.0-SNAPSHOT/org.apache.lucene.tests.util.TestRuleThreadAndTestName$1.evaluate(TestRuleThreadAndTestName.java:45)
at org.apache.lucene.test_framework@10.0.0-SNAPSHOT/org.apache.lucene.tests.util.TestRuleIgnoreAfterMaxFailures$1.evaluate(TestRuleIgnoreAfterMaxFailures.java:60)
at org.apache.lucene.test_framework@10.0.0-SNAPSHOT/org.apache.lucene.tests.util.TestRuleMarkFailure$1.evaluate(TestRuleMarkFailure.java:44)
at junit@4.13.1/org.junit.rules.RunRules.evaluate(RunRules.java:20)
at randomizedtesting.runner@2.8.1/com.carrotsearch.randomizedtesting.rules.StatementAdapter.evaluate(StatementAdapter.java:36)
at randomizedtesting.runner@2.8.1/com.carrotsearch.randomizedtesting.ThreadLeakControl$StatementRunner.run(ThreadLeakControl.java:390)
at randomizedtesting.runner@2.8.1/com.carrotsearch.randomizedtesting.ThreadLeakControl.forkTimeoutingTask(ThreadLeakControl.java:843)
at randomizedtesting.runner@2.8.1/com.carrotsearch.randomizedtesting.ThreadLeakControl$3.evaluate(ThreadLeakControl.java:490)
at randomizedtesting.runner@2.8.1/com.carrotsearch.randomizedtesting.RandomizedRunner.runSingleTest(RandomizedRunner.java:955)
at randomizedtesting.runner@2.8.1/com.carrotsearch.randomizedtesting.RandomizedRunner$5.evaluate(RandomizedRunner.java:840)
at randomizedtesting.runner@2.8.1/com.carrotsearch.randomizedtesting.RandomizedRunner$6.evaluate(RandomizedRunner.java:891)
at randomizedtesting.runner@2.8.1/com.carrotsearch.randomizedtesting.RandomizedRunner$7.evaluate(RandomizedRunner.java:902)
at org.apache.lucene.test_framework@10.0.0-SNAPSHOT/org.apache.lucene.tests.util.AbstractBeforeAfterRule$1.evaluate(AbstractBeforeAfterRule.java:43)
at randomizedtesting.runner@2.8.1/com.carrotsearch.randomizedtesting.rules.StatementAdapter.evaluate(StatementAdapter.java:36)
at org.apache.lucene.test_framework@10.0.0-SNAPSHOT/org.apache.lucene.tests.util.TestRuleStoreClassName$1.evaluate(TestRuleStoreClassName.java:38)
at randomizedtesting.runner@2.8.1/com.carrotsearch.randomizedtesting.rules.NoShadowingOrOverridesOnMethodsRule$1.evaluate(NoShadowingOrOverridesOnMethodsRule.java:40)
at randomizedtesting.runner@2.8.1/com.carrotsearch.randomizedtesting.rules.NoShadowingOrOverridesOnMethodsRule$1.evaluate(NoShadowingOrOverridesOnMethodsRule.java:40)
at randomizedtesting.runner@2.8.1/com.carrotsearch.randomizedtesting.rules.StatementAdapter.evaluate(StatementAdapter.java:36)
at randomizedtesting.runner@2.8.1/com.carrotsearch.randomizedtesting.rules.StatementAdapter.evaluate(StatementAdapter.java:36)
at org.apache.lucene.test_framework@10.0.0-SNAPSHOT/org.apache.lucene.tests.util.TestRuleAssertionsRequired$1.evaluate(TestRuleAssertionsRequired.java:53)
at org.apache.lucene.test_framework@10.0.0-SNAPSHOT/org.apache.lucene.tests.util.AbstractBeforeAfterRule$1.evaluate(AbstractBeforeAfterRule.java:43)
at org.apache.lucene.test_framework@10.0.0-SNAPSHOT/org.apache.lucene.tests.util.TestRuleMarkFailure$1.evaluate(TestRuleMarkFailure.java:44)
at org.apache.lucene.test_framework@10.0.0-SNAPSHOT/org.apache.lucene.tests.util.TestRuleIgnoreAfterMaxFailures$1.evaluate(TestRuleIgnoreAfterMaxFailures.java:60)
at org.apache.lucene.test_framework@10.0.0-SNAPSHOT/org.apache.lucene.tests.util.TestRuleIgnoreTestSuites$1.evaluate(TestRuleIgnoreTestSuites.java:47)
at junit@4.13.1/org.junit.rules.RunRules.evaluate(RunRules.java:20)
at randomizedtesting.runner@2.8.1/com.carrotsearch.randomizedtesting.rules.StatementAdapter.evaluate(StatementAdapter.java:36)
at randomizedtesting.runner@2.8.1/com.carrotsearch.randomizedtesting.ThreadLeakControl$StatementRunner.run(ThreadLeakControl.java:390)
at randomizedtesting.runner@2.8.1/com.carrotsearch.randomizedtesting.ThreadLeakControl.lambda$forkTimeoutingTask$0(ThreadLeakControl.java:850)
at java.base/java.lang.Thread.run(Thread.java:1583)
FAILED: org.apache.lucene.backward_codecs.lucene80.TestBestCompressionLucene80DocValuesFormat.testNumericDocValuesWithSkipperSmall
Error Message:
java.lang.NullPointerException: Cannot invoke "org.apache.lucene.index.DocValuesSkipper.maxDocID(int)" because "skipper" is null
Stack Trace:
java.lang.NullPointerException: Cannot invoke "org.apache.lucene.index.DocValuesSkipper.maxDocID(int)" because "skipper" is null
at __randomizedtesting.SeedInfo.seed([B2527FDA3A42ECE9:6891B87A121B5E9E]:0)
at org.apache.lucene.core@10.0.0-SNAPSHOT/org.apache.lucene.index.CheckIndex.checkDocValueSkipper(CheckIndex.java:3280)
at org.apache.lucene.core@10.0.0-SNAPSHOT/org.apache.lucene.index.CheckIndex.checkDocValues(CheckIndex.java:3740)
at org.apache.lucene.core@10.0.0-SNAPSHOT/org.apache.lucene.index.CheckIndex.testDocValues(CheckIndex.java:3242)
at org.apache.lucene.test_framework@10.0.0-SNAPSHOT/org.apache.lucene.tests.index.BaseDocValuesFormatTestCase.assertDocValuesWithSkipper(BaseDocValuesFormatTestCase.java:4196)
at org.apache.lucene.test_framework@10.0.0-SNAPSHOT/org.apache.lucene.tests.index.BaseDocValuesFormatTestCase.doTestNumericDocValuesWithSkipper(BaseDocValuesFormatTestCase.java:3884)
at org.apache.lucene.test_framework@10.0.0-SNAPSHOT/org.apache.lucene.tests.index.BaseDocValuesFormatTestCase.testNumericDocValuesWithSkipperSmall(BaseDocValuesFormatTestCase.java:3871)
at java.base/jdk.internal.reflect.DirectMethodHandleAccessor.invoke(DirectMethodHandleAccessor.java:103)
at java.base/java.lang.reflect.Method.invoke(Method.java:580)
at randomizedtesting.runner@2.8.1/com.carrotsearch.randomizedtesting.RandomizedRunner.invoke(RandomizedRunner.java:1758)
at randomizedtesting.runner@2.8.1/com.carrotsearch.randomizedtesting.RandomizedRunner$8.evaluate(RandomizedRunner.java:946)
at randomizedtesting.runner@2.8.1/com.carrotsearch.randomizedtesting.RandomizedRunner$9.evaluate(RandomizedRunner.java:982)
at randomizedtesting.runner@2.8.1/com.carrotsearch.randomizedtesting.RandomizedRunner$10.evaluate(RandomizedRunner.java:996)
at org.apache.lucene.test_framework@10.0.0-SNAPSHOT/org.apache.lucene.tests.util.TestRuleSetupTeardownChained$1.evaluate(TestRuleSetupTeardownChained.java:48)
at org.apache.lucene.test_framework@10.0.0-SNAPSHOT/org.apache.lucene.tests.util.AbstractBeforeAfterRule$1.evaluate(AbstractBeforeAfterRule.java:43)
at org.apache.lucene.test_framework@10.0.0-SNAPSHOT/org.apache.lucene.tests.util.TestRuleThreadAndTestName$1.evaluate(TestRuleThreadAndTestName.java:45)
at org.apache.lucene.test_framework@10.0.0-SNAPSHOT/org.apache.lucene.tests.util.TestRuleIgnoreAfterMaxFailures$1.evaluate(TestRuleIgnoreAfterMaxFailures.java:60)
at org.apache.lucene.test_framework@10.0.0-SNAPSHOT/org.apache.lucene.tests.util.TestRuleMarkFailure$1.evaluate(TestRuleMarkFailure.java:44)
at junit@4.13.1/org.junit.rules.RunRules.evaluate(RunRules.java:20)
at randomizedtesting.runner@2.8.1/com.carrotsearch.randomizedtesting.rules.StatementAdapter.evaluate(StatementAdapter.java:36)
at randomizedtesting.runner@2.8.1/com.carrotsearch.randomizedtesting.ThreadLeakControl$StatementRunner.run(ThreadLeakControl.java:390)
at randomizedtesting.runner@2.8.1/com.carrotsearch.randomizedtesting.ThreadLeakControl.forkTimeoutingTask(ThreadLeakControl.java:843)
at randomizedtesting.runner@2.8.1/com.carrotsearch.randomizedtesting.ThreadLeakControl$3.evaluate(ThreadLeakControl.java:490)
at randomizedtesting.runner@2.8.1/com.carrotsearch.randomizedtesting.RandomizedRunner.runSingleTest(RandomizedRunner.java:955)
at randomizedtesting.runner@2.8.1/com.carrotsearch.randomizedtesting.RandomizedRunner$5.evaluate(RandomizedRunner.java:840)
at randomizedtesting.runner@2.8.1/com.carrotsearch.randomizedtesting.RandomizedRunner$6.evaluate(RandomizedRunner.java:891)
at randomizedtesting.runner@2.8.1/com.carrotsearch.randomizedtesting.RandomizedRunner$7.evaluate(RandomizedRunner.java:902)
at org.apache.lucene.test_framework@10.0.0-SNAPSHOT/org.apache.lucene.tests.util.AbstractBeforeAfterRule$1.evaluate(AbstractBeforeAfterRule.java:43)
at randomizedtesting.runner@2.8.1/com.carrotsearch.randomizedtesting.rules.StatementAdapter.evaluate(StatementAdapter.java:36)
at org.apache.lucene.test_framework@10.0.0-SNAPSHOT/org.apache.lucene.tests.util.TestRuleStoreClassName$1.evaluate(TestRuleStoreClassName.java:38)
at randomizedtesting.runner@2.8.1/com.carrotsearch.randomizedtesting.rules.NoShadowingOrOverridesOnMethodsRule$1.evaluate(NoShadowingOrOverridesOnMethodsRule.java:40)
at randomizedtesting.runner@2.8.1/com.carrotsearch.randomizedtesting.rules.NoShadowingOrOverridesOnMethodsRule$1.evaluate(NoShadowingOrOverridesOnMethodsRule.java:40)
at randomizedtesting.runner@2.8.1/com.carrotsearch.randomizedtesting.rules.StatementAdapter.evaluate(StatementAdapter.java:36)
at randomizedtesting.runner@2.8.1/com.carrotsearch.randomizedtesting.rules.StatementAdapter.evaluate(StatementAdapter.java:36)
at org.apache.lucene.test_framework@10.0.0-SNAPSHOT/org.apache.lucene.tests.util.TestRuleAssertionsRequired$1.evaluate(TestRuleAssertionsRequired.java:53)
at org.apache.lucene.test_framework@10.0.0-SNAPSHOT/org.apache.lucene.tests.util.AbstractBeforeAfterRule$1.evaluate(AbstractBeforeAfterRule.java:43)
at org.apache.lucene.test_framework@10.0.0-SNAPSHOT/org.apache.lucene.tests.util.TestRuleMarkFailure$1.evaluate(TestRuleMarkFailure.java:44)
at org.apache.lucene.test_framework@10.0.0-SNAPSHOT/org.apache.lucene.tests.util.TestRuleIgnoreAfterMaxFailures$1.evaluate(TestRuleIgnoreAfterMaxFailures.java:60)
at org.apache.lucene.test_framework@10.0.0-SNAPSHOT/org.apache.lucene.tests.util.TestRuleIgnoreTestSuites$1.evaluate(TestRuleIgnoreTestSuites.java:47)
at junit@4.13.1/org.junit.rules.RunRules.evaluate(RunRules.java:20)
at randomizedtesting.runner@2.8.1/com.carrotsearch.randomizedtesting.rules.StatementAdapter.evaluate(StatementAdapter.java:36)
at randomizedtesting.runner@2.8.1/com.carrotsearch.randomizedtesting.ThreadLeakControl$StatementRunner.run(ThreadLeakControl.java:390)
at randomizedtesting.runner@2.8.1/com.carrotsearch.randomizedtesting.ThreadLeakControl.lambda$forkTimeoutingTask$0(ThreadLeakControl.java:850)
at java.base/java.lang.Thread.run(Thread.java:1583)
FAILED: org.apache.lucene.backward_codecs.lucene80.TestBestCompressionLucene80DocValuesFormat.testNumberMergeAwayAllValues
Error Message:
java.lang.NullPointerException: Cannot invoke "org.apache.lucene.index.DocValuesSkipper.docCount()" because "skipper" is null
Stack Trace:
java.lang.NullPointerException: Cannot invoke "org.apache.lucene.index.DocValuesSkipper.docCount()" because "skipper" is null
at __randomizedtesting.SeedInfo.seed([B2527FDA3A42ECE9:C16CE3C8AD3830E5]:0)
at org.apache.lucene.test_framework@10.0.0-SNAPSHOT/org.apache.lucene.tests.index.BaseDocValuesFormatTestCase.testNumberMergeAwayAllValues(BaseDocValuesFormatTestCase.java:3256)
at java.base/jdk.internal.reflect.DirectMethodHandleAccessor.invoke(DirectMethodHandleAccessor.java:103)
at java.base/java.lang.reflect.Method.invoke(Method.java:580)
at randomizedtesting.runner@2.8.1/com.carrotsearch.randomizedtesting.RandomizedRunner.invoke(RandomizedRunner.java:1758)
at randomizedtesting.runner@2.8.1/com.carrotsearch.randomizedtesting.RandomizedRunner$8.evaluate(RandomizedRunner.java:946)
at randomizedtesting.runner@2.8.1/com.carrotsearch.randomizedtesting.RandomizedRunner$9.evaluate(RandomizedRunner.java:982)
at randomizedtesting.runner@2.8.1/com.carrotsearch.randomizedtesting.RandomizedRunner$10.evaluate(RandomizedRunner.java:996)
at org.apache.lucene.test_framework@10.0.0-SNAPSHOT/org.apache.lucene.tests.util.TestRuleSetupTeardownChained$1.evaluate(TestRuleSetupTeardownChained.java:48)
at org.apache.lucene.test_framework@10.0.0-SNAPSHOT/org.apache.lucene.tests.util.AbstractBeforeAfterRule$1.evaluate(AbstractBeforeAfterRule.java:43)
at org.apache.lucene.test_framework@10.0.0-SNAPSHOT/org.apache.lucene.tests.util.TestRuleThreadAndTestName$1.evaluate(TestRuleThreadAndTestName.java:45)
at org.apache.lucene.test_framework@10.0.0-SNAPSHOT/org.apache.lucene.tests.util.TestRuleIgnoreAfterMaxFailures$1.evaluate(TestRuleIgnoreAfterMaxFailures.java:60)
at org.apache.lucene.test_framework@10.0.0-SNAPSHOT/org.apache.lucene.tests.util.TestRuleMarkFailure$1.evaluate(TestRuleMarkFailure.java:44)
at junit@4.13.1/org.junit.rules.RunRules.evaluate(RunRules.java:20)
at randomizedtesting.runner@2.8.1/com.carrotsearch.randomizedtesting.rules.StatementAdapter.evaluate(StatementAdapter.java:36)
at randomizedtesting.runner@2.8.1/com.carrotsearch.randomizedtesting.ThreadLeakControl$StatementRunner.run(ThreadLeakControl.java:390)
at randomizedtesting.runner@2.8.1/com.carrotsearch.randomizedtesting.ThreadLeakControl.forkTimeoutingTask(ThreadLeakControl.java:843)
at randomizedtesting.runner@2.8.1/com.carrotsearch.randomizedtesting.ThreadLeakControl$3.evaluate(ThreadLeakControl.java:490)
at randomizedtesting.runner@2.8.1/com.carrotsearch.randomizedtesting.RandomizedRunner.runSingleTest(RandomizedRunner.java:955)
at randomizedtesting.runner@2.8.1/com.carrotsearch.randomizedtesting.RandomizedRunner$5.evaluate(RandomizedRunner.java:840)
at randomizedtesting.runner@2.8.1/com.carrotsearch.randomizedtesting.RandomizedRunner$6.evaluate(RandomizedRunner.java:891)
at randomizedtesting.runner@2.8.1/com.carrotsearch.randomizedtesting.RandomizedRunner$7.evaluate(RandomizedRunner.java:902)
at org.apache.lucene.test_framework@10.0.0-SNAPSHOT/org.apache.lucene.tests.util.AbstractBeforeAfterRule$1.evaluate(AbstractBeforeAfterRule.java:43)
at randomizedtesting.runner@2.8.1/com.carrotsearch.randomizedtesting.rules.StatementAdapter.evaluate(StatementAdapter.java:36)
at org.apache.lucene.test_framework@10.0.0-SNAPSHOT/org.apache.lucene.tests.util.TestRuleStoreClassName$1.evaluate(TestRuleStoreClassName.java:38)
at randomizedtesting.runner@2.8.1/com.carrotsearch.randomizedtesting.rules.NoShadowingOrOverridesOnMethodsRule$1.evaluate(NoShadowingOrOverridesOnMethodsRule.java:40)
at randomizedtesting.runner@2.8.1/com.carrotsearch.randomizedtesting.rules.NoShadowingOrOverridesOnMethodsRule$1.evaluate(NoShadowingOrOverridesOnMethodsRule.java:40)
at randomizedtesting.runner@2.8.1/com.carrotsearch.randomizedtesting.rules.StatementAdapter.evaluate(StatementAdapter.java:36)
at randomizedtesting.runner@2.8.1/com.carrotsearch.randomizedtesting.rules.StatementAdapter.evaluate(StatementAdapter.java:36)
at org.apache.lucene.test_framework@10.0.0-SNAPSHOT/org.apache.lucene.tests.util.TestRuleAssertionsRequired$1.evaluate(TestRuleAssertionsRequired.java:53)
at org.apache.lucene.test_framework@10.0.0-SNAPSHOT/org.apache.lucene.tests.util.AbstractBeforeAfterRule$1.evaluate(AbstractBeforeAfterRule.java:43)
at org.apache.lucene.test_framework@10.0.0-SNAPSHOT/org.apache.lucene.tests.util.TestRuleMarkFailure$1.evaluate(TestRuleMarkFailure.java:44)
at org.apache.lucene.test_framework@10.0.0-SNAPSHOT/org.apache.lucene.tests.util.TestRuleIgnoreAfterMaxFailures$1.evaluate(TestRuleIgnoreAfterMaxFailures.java:60)
at org.apache.lucene.test_framework@10.0.0-SNAPSHOT/org.apache.lucene.tests.util.TestRuleIgnoreTestSuites$1.evaluate(TestRuleIgnoreTestSuites.java:47)
at junit@4.13.1/org.junit.rules.RunRules.evaluate(RunRules.java:20)
at randomizedtesting.runner@2.8.1/com.carrotsearch.randomizedtesting.rules.StatementAdapter.evaluate(StatementAdapter.java:36)
at randomizedtesting.runner@2.8.1/com.carrotsearch.randomizedtesting.ThreadLeakControl$StatementRunner.run(ThreadLeakControl.java:390)
at randomizedtesting.runner@2.8.1/com.carrotsearch.randomizedtesting.ThreadLeakControl.lambda$forkTimeoutingTask$0(ThreadLeakControl.java:850)
at java.base/java.lang.Thread.run(Thread.java:1583)
FAILED: org.apache.lucene.backward_codecs.lucene80.TestBestCompressionLucene80DocValuesFormat.testSortedMergeAwayAllValuesLargeSegment
Error Message:
java.lang.NullPointerException: Cannot invoke "org.apache.lucene.index.DocValuesSkipper.docCount()" because "skipper" is null
Stack Trace:
java.lang.NullPointerException: Cannot invoke "org.apache.lucene.index.DocValuesSkipper.docCount()" because "skipper" is null
at __randomizedtesting.SeedInfo.seed([B2527FDA3A42ECE9:91AC5AB2D100ECB6]:0)
at org.apache.lucene.test_framework@10.0.0-SNAPSHOT/org.apache.lucene.tests.index.BaseDocValuesFormatTestCase.testSortedMergeAwayAllValuesLargeSegment(BaseDocValuesFormatTestCase.java:3558)
at java.base/jdk.internal.reflect.DirectMethodHandleAccessor.invoke(DirectMethodHandleAccessor.java:103)
at java.base/java.lang.reflect.Method.invoke(Method.java:580)
at randomizedtesting.runner@2.8.1/com.carrotsearch.randomizedtesting.RandomizedRunner.invoke(RandomizedRunner.java:1758)
at randomizedtesting.runner@2.8.1/com.carrotsearch.randomizedtesting.RandomizedRunner$8.evaluate(RandomizedRunner.java:946)
at randomizedtesting.runner@2.8.1/com.carrotsearch.randomizedtesting.RandomizedRunner$9.evaluate(RandomizedRunner.java:982)
at randomizedtesting.runner@2.8.1/com.carrotsearch.randomizedtesting.RandomizedRunner$10.evaluate(RandomizedRunner.java:996)
at org.apache.lucene.test_framework@10.0.0-SNAPSHOT/org.apache.lucene.tests.util.TestRuleSetupTeardownChained$1.evaluate(TestRuleSetupTeardownChained.java:48)
at org.apache.lucene.test_framework@10.0.0-SNAPSHOT/org.apache.lucene.tests.util.AbstractBeforeAfterRule$1.evaluate(AbstractBeforeAfterRule.java:43)
at org.apache.lucene.test_framework@10.0.0-SNAPSHOT/org.apache.lucene.tests.util.TestRuleThreadAndTestName$1.evaluate(TestRuleThreadAndTestName.java:45)
at org.apache.lucene.test_framework@10.0.0-SNAPSHOT/org.apache.lucene.tests.util.TestRuleIgnoreAfterMaxFailures$1.evaluate(TestRuleIgnoreAfterMaxFailures.java:60)
at org.apache.lucene.test_framework@10.0.0-SNAPSHOT/org.apache.lucene.tests.util.TestRuleMarkFailure$1.evaluate(TestRuleMarkFailure.java:44)
at junit@4.13.1/org.junit.rules.RunRules.evaluate(RunRules.java:20)
at randomizedtesting.runner@2.8.1/com.carrotsearch.randomizedtesting.rules.StatementAdapter.evaluate(StatementAdapter.java:36)
at randomizedtesting.runner@2.8.1/com.carrotsearch.randomizedtesting.ThreadLeakControl$StatementRunner.run(ThreadLeakControl.java:390)
at randomizedtesting.runner@2.8.1/com.carrotsearch.randomizedtesting.ThreadLeakControl.forkTimeoutingTask(ThreadLeakControl.java:843)
at randomizedtesting.runner@2.8.1/com.carrotsearch.randomizedtesting.ThreadLeakControl$3.evaluate(ThreadLeakControl.java:490)
at randomizedtesting.runner@2.8.1/com.carrotsearch.randomizedtesting.RandomizedRunner.runSingleTest(RandomizedRunner.java:955)
at randomizedtesting.runner@2.8.1/com.carrotsearch.randomizedtesting.RandomizedRunner$5.evaluate(RandomizedRunner.java:840)
at randomizedtesting.runner@2.8.1/com.carrotsearch.randomizedtesting.RandomizedRunner$6.evaluate(RandomizedRunner.java:891)
at randomizedtesting.runner@2.8.1/com.carrotsearch.randomizedtesting.RandomizedRunner$7.evaluate(RandomizedRunner.java:902)
at org.apache.lucene.test_framework@10.0.0-SNAPSHOT/org.apache.lucene.tests.util.AbstractBeforeAfterRule$1.evaluate(AbstractBeforeAfterRule.java:43)
at randomizedtesting.runner@2.8.1/com.carrotsearch.randomizedtesting.rules.StatementAdapter.evaluate(StatementAdapter.java:36)
at org.apache.lucene.test_framework@10.0.0-SNAPSHOT/org.apache.lucene.tests.util.TestRuleStoreClassName$1.evaluate(TestRuleStoreClassName.java:38)
at randomizedtesting.runner@2.8.1/com.carrotsearch.randomizedtesting.rules.NoShadowingOrOverridesOnMethodsRule$1.evaluate(NoShadowingOrOverridesOnMethodsRule.java:40)
at randomizedtesting.runner@2.8.1/com.carrotsearch.randomizedtesting.rules.NoShadowingOrOverridesOnMethodsRule$1.evaluate(NoShadowingOrOverridesOnMethodsRule.java:40)
at randomizedtesting.runner@2.8.1/com.carrotsearch.randomizedtesting.rules.StatementAdapter.evaluate(StatementAdapter.java:36)
at randomizedtesting.runner@2.8.1/com.carrotsearch.randomizedtesting.rules.StatementAdapter.evaluate(StatementAdapter.java:36)
at org.apache.lucene.test_framework@10.0.0-SNAPSHOT/org.apache.lucene.tests.util.TestRuleAssertionsRequired$1.evaluate(TestRuleAssertionsRequired.java:53)
at org.apache.lucene.test_framework@10.0.0-SNAPSHOT/org.apache.lucene.tests.util.AbstractBeforeAfterRule$1.evaluate(AbstractBeforeAfterRule.java:43)
at org.apache.lucene.test_framework@10.0.0-SNAPSHOT/org.apache.lucene.tests.util.TestRuleMarkFailure$1.evaluate(TestRuleMarkFailure.java:44)
at org.apache.lucene.test_framework@10.0.0-SNAPSHOT/org.apache.lucene.tests.util.TestRuleIgnoreAfterMaxFailures$1.evaluate(TestRuleIgnoreAfterMaxFailures.java:60)
at org.apache.lucene.test_framework@10.0.0-SNAPSHOT/org.apache.lucene.tests.util.TestRuleIgnoreTestSuites$1.evaluate(TestRuleIgnoreTestSuites.java:47)
at junit@4.13.1/org.junit.rules.RunRules.evaluate(RunRules.java:20)
at randomizedtesting.runner@2.8.1/com.carrotsearch.randomizedtesting.rules.StatementAdapter.evaluate(StatementAdapter.java:36)
at randomizedtesting.runner@2.8.1/com.carrotsearch.randomizedtesting.ThreadLeakControl$StatementRunner.run(ThreadLeakControl.java:390)
at randomizedtesting.runner@2.8.1/com.carrotsearch.randomizedtesting.ThreadLeakControl.lambda$forkTimeoutingTask$0(ThreadLeakControl.java:850)
at java.base/java.lang.Thread.run(Thread.java:1583)
FAILED: org.apache.lucene.backward_codecs.lucene80.TestBestCompressionLucene80DocValuesFormat.testSortedSetDocValuesWithSkipperBig
Error Message:
java.lang.NullPointerException: Cannot invoke "org.apache.lucene.index.DocValuesSkipper.maxDocID(int)" because "skipper" is null
Stack Trace:
java.lang.NullPointerException: Cannot invoke "org.apache.lucene.index.DocValuesSkipper.maxDocID(int)" because "skipper" is null
at __randomizedtesting.SeedInfo.seed([B2527FDA3A42ECE9:F059C31E4F788CB2]:0)
at org.apache.lucene.core@10.0.0-SNAPSHOT/org.apache.lucene.index.CheckIndex.checkDocValueSkipper(CheckIndex.java:3280)
at org.apache.lucene.core@10.0.0-SNAPSHOT/org.apache.lucene.index.CheckIndex.checkDocValues(CheckIndex.java:3740)
at org.apache.lucene.core@10.0.0-SNAPSHOT/org.apache.lucene.index.CheckIndex.testDocValues(CheckIndex.java:3242)
at org.apache.lucene.test_framework@10.0.0-SNAPSHOT/org.apache.lucene.tests.index.BaseDocValuesFormatTestCase.assertDocValuesWithSkipper(BaseDocValuesFormatTestCase.java:4196)
at org.apache.lucene.test_framework@10.0.0-SNAPSHOT/org.apache.lucene.tests.index.BaseDocValuesFormatTestCase.doTestSortedSetDocValuesWithSkipper(BaseDocValuesFormatTestCase.java:4090)
at org.apache.lucene.test_framework@10.0.0-SNAPSHOT/org.apache.lucene.tests.index.BaseDocValuesFormatTestCase.testSortedSetDocValuesWithSkipperBig(BaseDocValuesFormatTestCase.java:4086)
at java.base/jdk.internal.reflect.DirectMethodHandleAccessor.invoke(DirectMethodHandleAccessor.java:103)
at java.base/java.lang.reflect.Method.invoke(Method.java:580)
at randomizedtesting.runner@2.8.1/com.carrotsearch.randomizedtesting.RandomizedRunner.invoke(RandomizedRunner.java:1758)
at randomizedtesting.runner@2.8.1/com.carrotsearch.randomizedtesting.RandomizedRunner$8.evaluate(RandomizedRunner.java:946)
at randomizedtesting.runner@2.8.1/com.carrotsearch.randomizedtesting.RandomizedRunner$9.evaluate(RandomizedRunner.java:982)
at randomizedtesting.runner@2.8.1/com.carrotsearch.randomizedtesting.RandomizedRunner$10.evaluate(RandomizedRunner.java:996)
at org.apache.lucene.test_framework@10.0.0-SNAPSHOT/org.apache.lucene.tests.util.TestRuleSetupTeardownChained$1.evaluate(TestRuleSetupTeardownChained.java:48)
at org.apache.lucene.test_framework@10.0.0-SNAPSHOT/org.apache.lucene.tests.util.AbstractBeforeAfterRule$1.evaluate(AbstractBeforeAfterRule.java:43)
at org.apache.lucene.test_framework@10.0.0-SNAPSHOT/org.apache.lucene.tests.util.TestRuleThreadAndTestName$1.evaluate(TestRuleThreadAndTestName.java:45)
at org.apache.lucene.test_framework@10.0.0-SNAPSHOT/org.apache.lucene.tests.util.TestRuleIgnoreAfterMaxFailures$1.evaluate(TestRuleIgnoreAfterMaxFailures.java:60)
at org.apache.lucene.test_framework@10.0.0-SNAPSHOT/org.apache.lucene.tests.util.TestRuleMarkFailure$1.evaluate(TestRuleMarkFailure.java:44)
at junit@4.13.1/org.junit.rules.RunRules.evaluate(RunRules.java:20)
at randomizedtesting.runner@2.8.1/com.carrotsearch.randomizedtesting.rules.StatementAdapter.evaluate(StatementAdapter.java:36)
at randomizedtesting.runner@2.8.1/com.carrotsearch.randomizedtesting.ThreadLeakControl$StatementRunner.run(ThreadLeakControl.java:390)
at randomizedtesting.runner@2.8.1/com.carrotsearch.randomizedtesting.ThreadLeakControl.forkTimeoutingTask(ThreadLeakControl.java:843)
at randomizedtesting.runner@2.8.1/com.carrotsearch.randomizedtesting.ThreadLeakControl$3.evaluate(ThreadLeakControl.java:490)
at randomizedtesting.runner@2.8.1/com.carrotsearch.randomizedtesting.RandomizedRunner.runSingleTest(RandomizedRunner.java:955)
at randomizedtesting.runner@2.8.1/com.carrotsearch.randomizedtesting.RandomizedRunner$5.evaluate(RandomizedRunner.java:840)
at randomizedtesting.runner@2.8.1/com.carrotsearch.randomizedtesting.RandomizedRunner$6.evaluate(RandomizedRunner.java:891)
at randomizedtesting.runner@2.8.1/com.carrotsearch.randomizedtesting.RandomizedRunner$7.evaluate(RandomizedRunner.java:902)
at org.apache.lucene.test_framework@10.0.0-SNAPSHOT/org.apache.lucene.tests.util.AbstractBeforeAfterRule$1.evaluate(AbstractBeforeAfterRule.java:43)
at randomizedtesting.runner@2.8.1/com.carrotsearch.randomizedtesting.rules.StatementAdapter.evaluate(StatementAdapter.java:36)
at org.apache.lucene.test_framework@10.0.0-SNAPSHOT/org.apache.lucene.tests.util.TestRuleStoreClassName$1.evaluate(TestRuleStoreClassName.java:38)
at randomizedtesting.runner@2.8.1/com.carrotsearch.randomizedtesting.rules.NoShadowingOrOverridesOnMethodsRule$1.evaluate(NoShadowingOrOverridesOnMethodsRule.java:40)
at randomizedtesting.runner@2.8.1/com.carrotsearch.randomizedtesting.rules.NoShadowingOrOverridesOnMethodsRule$1.evaluate(NoShadowingOrOverridesOnMethodsRule.java:40)
at randomizedtesting.runner@2.8.1/com.carrotsearch.randomizedtesting.rules.StatementAdapter.evaluate(StatementAdapter.java:36)
at randomizedtesting.runner@2.8.1/com.carrotsearch.randomizedtesting.rules.StatementAdapter.evaluate(StatementAdapter.java:36)
at org.apache.lucene.test_framework@10.0.0-SNAPSHOT/org.apache.lucene.tests.util.TestRuleAssertionsRequired$1.evaluate(TestRuleAssertionsRequired.java:53)
at org.apache.lucene.test_framework@10.0.0-SNAPSHOT/org.apache.lucene.tests.util.AbstractBeforeAfterRule$1.evaluate(AbstractBeforeAfterRule.java:43)
at org.apache.lucene.test_framework@10.0.0-SNAPSHOT/org.apache.lucene.tests.util.TestRuleMarkFailure$1.evaluate(TestRuleMarkFailure.java:44)
at org.apache.lucene.test_framework@10.0.0-SNAPSHOT/org.apache.lucene.tests.util.TestRuleIgnoreAfterMaxFailures$1.evaluate(TestRuleIgnoreAfterMaxFailures.java:60)
at org.apache.lucene.test_framework@10.0.0-SNAPSHOT/org.apache.lucene.tests.util.TestRuleIgnoreTestSuites$1.evaluate(TestRuleIgnoreTestSuites.java:47)
at junit@4.13.1/org.junit.rules.RunRules.evaluate(RunRules.java:20)
at randomizedtesting.runner@2.8.1/com.carrotsearch.randomizedtesting.rules.StatementAdapter.evaluate(StatementAdapter.java:36)
at randomizedtesting.runner@2.8.1/com.carrotsearch.randomizedtesting.ThreadLeakControl$StatementRunner.run(ThreadLeakControl.java:390)
at randomizedtesting.runner@2.8.1/com.carrotsearch.randomizedtesting.ThreadLeakControl.lambda$forkTimeoutingTask$0(ThreadLeakControl.java:850)
at java.base/java.lang.Thread.run(Thread.java:1583)
FAILED: org.apache.lucene.backward_codecs.lucene80.TestBestCompressionLucene80DocValuesFormat.testSortedSetDocValuesWithSkipperMedium
Error Message:
java.lang.NullPointerException: Cannot invoke "org.apache.lucene.index.DocValuesSkipper.maxDocID(int)" because "skipper" is null
Stack Trace:
java.lang.NullPointerException: Cannot invoke "org.apache.lucene.index.DocValuesSkipper.maxDocID(int)" because "skipper" is null
at __randomizedtesting.SeedInfo.seed([B2527FDA3A42ECE9:C20BF8BD3BE66498]:0)
at org.apache.lucene.core@10.0.0-SNAPSHOT/org.apache.lucene.index.CheckIndex.checkDocValueSkipper(CheckIndex.java:3280)
at org.apache.lucene.core@10.0.0-SNAPSHOT/org.apache.lucene.index.CheckIndex.checkDocValues(CheckIndex.java:3740)
at org.apache.lucene.core@10.0.0-SNAPSHOT/org.apache.lucene.index.CheckIndex.testDocValues(CheckIndex.java:3242)
at org.apache.lucene.test_framework@10.0.0-SNAPSHOT/org.apache.lucene.tests.index.BaseDocValuesFormatTestCase.assertDocValuesWithSkipper(BaseDocValuesFormatTestCase.java:4196)
at org.apache.lucene.test_framework@10.0.0-SNAPSHOT/org.apache.lucene.tests.index.BaseDocValuesFormatTestCase.doTestSortedSetDocValuesWithSkipper(BaseDocValuesFormatTestCase.java:4090)
at org.apache.lucene.test_framework@10.0.0-SNAPSHOT/org.apache.lucene.tests.index.BaseDocValuesFormatTestCase.testSortedSetDocValuesWithSkipperMedium(BaseDocValuesFormatTestCase.java:4081)
at java.base/jdk.internal.reflect.DirectMethodHandleAccessor.invoke(DirectMethodHandleAccessor.java:103)
at java.base/java.lang.reflect.Method.invoke(Method.java:580)
at randomizedtesting.runner@2.8.1/com.carrots
[...truncated too long message...]
t-results/test/outputs/OUTPUT-org.apache.lucene.backward_codecs.lucene80.TestBestCompressionLucene80DocValuesFormat.txt
Reproduce with: gradlew :lucene:backward-codecs:test --tests "org.apache.lucene.backward_codecs.lucene80.TestBestCompressionLucene80DocValuesFormat.testSortedSetMergeAwayAllValuesLargeSegment" -Ptests.jvms=4 -Ptests.jvmargs= -Ptests.seed=B2527FDA3A42ECE9 -Ptests.multiplier=2 -Ptests.nightly=true -Ptests.gui=true -Ptests.file.encoding=US-ASCII -Ptests.linedocsfile=/home/jenkins/jenkins-slave/workspace/Lucene/Lucene-NightlyTests-main/test-data/enwiki.random.lines.txt -Ptests.vectorsize=256 -Ptests.forceintegervectors=true
- org.apache.lucene.backward_codecs.lucene80.TestBestSpeedLucene80DocValuesFormat.testSortedSetDocValuesWithSkipperMedium (:lucene:backward-codecs)
Test output: /home/jenkins/jenkins-slave/workspace/Lucene/Lucene-NightlyTests-main/checkout/lucene/backward-codecs/build/test-results/test/outputs/OUTPUT-org.apache.lucene.backward_codecs.lucene80.TestBestSpeedLucene80DocValuesFormat.txt
Reproduce with: gradlew :lucene:backward-codecs:test --tests "org.apache.lucene.backward_codecs.lucene80.TestBestSpeedLucene80DocValuesFormat.testSortedSetDocValuesWithSkipperMedium" -Ptests.jvms=4 -Ptests.jvmargs= -Ptests.seed=B2527FDA3A42ECE9 -Ptests.multiplier=2 -Ptests.nightly=true -Ptests.gui=true -Ptests.file.encoding=US-ASCII -Ptests.linedocsfile=/home/jenkins/jenkins-slave/workspace/Lucene/Lucene-NightlyTests-main/test-data/enwiki.random.lines.txt -Ptests.vectorsize=256 -Ptests.forceintegervectors=true
- org.apache.lucene.backward_codecs.lucene80.TestBestSpeedLucene80DocValuesFormat.testSortedNumericDocValuesWithSkipperSmall (:lucene:backward-codecs)
Test output: /home/jenkins/jenkins-slave/workspace/Lucene/Lucene-NightlyTests-main/checkout/lucene/backward-codecs/build/test-results/test/outputs/OUTPUT-org.apache.lucene.backward_codecs.lucene80.TestBestSpeedLucene80DocValuesFormat.txt
Reproduce with: gradlew :lucene:backward-codecs:test --tests "org.apache.lucene.backward_codecs.lucene80.TestBestSpeedLucene80DocValuesFormat.testSortedNumericDocValuesWithSkipperSmall" -Ptests.jvms=4 -Ptests.jvmargs= -Ptests.seed=B2527FDA3A42ECE9 -Ptests.multiplier=2 -Ptests.nightly=true -Ptests.gui=true -Ptests.file.encoding=US-ASCII -Ptests.linedocsfile=/home/jenkins/jenkins-slave/workspace/Lucene/Lucene-NightlyTests-main/test-data/enwiki.random.lines.txt -Ptests.vectorsize=256 -Ptests.forceintegervectors=true
- org.apache.lucene.backward_codecs.lucene80.TestBestSpeedLucene80DocValuesFormat.testSortedSetMergeAwayAllValuesLargeSegment (:lucene:backward-codecs)
Test output: /home/jenkins/jenkins-slave/workspace/Lucene/Lucene-NightlyTests-main/checkout/lucene/backward-codecs/build/test-results/test/outputs/OUTPUT-org.apache.lucene.backward_codecs.lucene80.TestBestSpeedLucene80DocValuesFormat.txt
Reproduce with: gradlew :lucene:backward-codecs:test --tests "org.apache.lucene.backward_codecs.lucene80.TestBestSpeedLucene80DocValuesFormat.testSortedSetMergeAwayAllValuesLargeSegment" -Ptests.jvms=4 -Ptests.jvmargs= -Ptests.seed=B2527FDA3A42ECE9 -Ptests.multiplier=2 -Ptests.nightly=true -Ptests.gui=true -Ptests.file.encoding=US-ASCII -Ptests.linedocsfile=/home/jenkins/jenkins-slave/workspace/Lucene/Lucene-NightlyTests-main/test-data/enwiki.random.lines.txt -Ptests.vectorsize=256 -Ptests.forceintegervectors=true
- org.apache.lucene.backward_codecs.lucene80.TestBestCompressionLucene80DocValuesFormat.testSortedNumericDocValuesWithSkipperBig (:lucene:backward-codecs)
Test output: /home/jenkins/jenkins-slave/workspace/Lucene/Lucene-NightlyTests-main/checkout/lucene/backward-codecs/build/test-results/test/outputs/OUTPUT-org.apache.lucene.backward_codecs.lucene80.TestBestCompressionLucene80DocValuesFormat.txt
Reproduce with: gradlew :lucene:backward-codecs:test --tests "org.apache.lucene.backward_codecs.lucene80.TestBestCompressionLucene80DocValuesFormat.testSortedNumericDocValuesWithSkipperBig" -Ptests.jvms=4 -Ptests.jvmargs= -Ptests.seed=B2527FDA3A42ECE9 -Ptests.multiplier=2 -Ptests.nightly=true -Ptests.gui=true -Ptests.file.encoding=US-ASCII -Ptests.linedocsfile=/home/jenkins/jenkins-slave/workspace/Lucene/Lucene-NightlyTests-main/test-data/enwiki.random.lines.txt -Ptests.vectorsize=256 -Ptests.forceintegervectors=true
- org.apache.lucene.backward_codecs.lucene80.TestBestCompressionLucene80DocValuesFormat.testSortedDocValuesWithSkipperMedium (:lucene:backward-codecs)
Test output: /home/jenkins/jenkins-slave/workspace/Lucene/Lucene-NightlyTests-main/checkout/lucene/backward-codecs/build/test-results/test/outputs/OUTPUT-org.apache.lucene.backward_codecs.lucene80.TestBestCompressionLucene80DocValuesFormat.txt
Reproduce with: gradlew :lucene:backward-codecs:test --tests "org.apache.lucene.backward_codecs.lucene80.TestBestCompressionLucene80DocValuesFormat.testSortedDocValuesWithSkipperMedium" -Ptests.jvms=4 -Ptests.jvmargs= -Ptests.seed=B2527FDA3A42ECE9 -Ptests.multiplier=2 -Ptests.nightly=true -Ptests.gui=true -Ptests.file.encoding=US-ASCII -Ptests.linedocsfile=/home/jenkins/jenkins-slave/workspace/Lucene/Lucene-NightlyTests-main/test-data/enwiki.random.lines.txt -Ptests.vectorsize=256 -Ptests.forceintegervectors=true
- org.apache.lucene.backward_codecs.lucene80.TestBestSpeedLucene80DocValuesFormat.testSortedNumericDocValuesWithSkipperBig (:lucene:backward-codecs)
Test output: /home/jenkins/jenkins-slave/workspace/Lucene/Lucene-NightlyTests-main/checkout/lucene/backward-codecs/build/test-results/test/outputs/OUTPUT-org.apache.lucene.backward_codecs.lucene80.TestBestSpeedLucene80DocValuesFormat.txt
Reproduce with: gradlew :lucene:backward-codecs:test --tests "org.apache.lucene.backward_codecs.lucene80.TestBestSpeedLucene80DocValuesFormat.testSortedNumericDocValuesWithSkipperBig" -Ptests.jvms=4 -Ptests.jvmargs= -Ptests.seed=B2527FDA3A42ECE9 -Ptests.multiplier=2 -Ptests.nightly=true -Ptests.gui=true -Ptests.file.encoding=US-ASCII -Ptests.linedocsfile=/home/jenkins/jenkins-slave/workspace/Lucene/Lucene-NightlyTests-main/test-data/enwiki.random.lines.txt -Ptests.vectorsize=256 -Ptests.forceintegervectors=true
- org.apache.lucene.backward_codecs.lucene80.TestBestSpeedLucene80DocValuesFormat.testSortedDocValuesWithSkipperMedium (:lucene:backward-codecs)
Test output: /home/jenkins/jenkins-slave/workspace/Lucene/Lucene-NightlyTests-main/checkout/lucene/backward-codecs/build/test-results/test/outputs/OUTPUT-org.apache.lucene.backward_codecs.lucene80.TestBestSpeedLucene80DocValuesFormat.txt
Reproduce with: gradlew :lucene:backward-codecs:test --tests "org.apache.lucene.backward_codecs.lucene80.TestBestSpeedLucene80DocValuesFormat.testSortedDocValuesWithSkipperMedium" -Ptests.jvms=4 -Ptests.jvmargs= -Ptests.seed=B2527FDA3A42ECE9 -Ptests.multiplier=2 -Ptests.nightly=true -Ptests.gui=true -Ptests.file.encoding=US-ASCII -Ptests.linedocsfile=/home/jenkins/jenkins-slave/workspace/Lucene/Lucene-NightlyTests-main/test-data/enwiki.random.lines.txt -Ptests.vectorsize=256 -Ptests.forceintegervectors=true
- org.apache.lucene.backward_codecs.lucene80.TestBestCompressionLucene80DocValuesFormat.testSortedNumericDocValuesWithSkipperMedium (:lucene:backward-codecs)
Test output: /home/jenkins/jenkins-slave/workspace/Lucene/Lucene-NightlyTests-main/checkout/lucene/backward-codecs/build/test-results/test/outputs/OUTPUT-org.apache.lucene.backward_codecs.lucene80.TestBestCompressionLucene80DocValuesFormat.txt
Reproduce with: gradlew :lucene:backward-codecs:test --tests "org.apache.lucene.backward_codecs.lucene80.TestBestCompressionLucene80DocValuesFormat.testSortedNumericDocValuesWithSkipperMedium" -Ptests.jvms=4 -Ptests.jvmargs= -Ptests.seed=B2527FDA3A42ECE9 -Ptests.multiplier=2 -Ptests.nightly=true -Ptests.gui=true -Ptests.file.encoding=US-ASCII -Ptests.linedocsfile=/home/jenkins/jenkins-slave/workspace/Lucene/Lucene-NightlyTests-main/test-data/enwiki.random.lines.txt -Ptests.vectorsize=256 -Ptests.forceintegervectors=true
- org.apache.lucene.backward_codecs.lucene80.TestBestSpeedLucene80DocValuesFormat.testSortedNumericDocValuesWithSkipperMedium (:lucene:backward-codecs)
Test output: /home/jenkins/jenkins-slave/workspace/Lucene/Lucene-NightlyTests-main/checkout/lucene/backward-codecs/build/test-results/test/outputs/OUTPUT-org.apache.lucene.backward_codecs.lucene80.TestBestSpeedLucene80DocValuesFormat.txt
Reproduce with: gradlew :lucene:backward-codecs:test --tests "org.apache.lucene.backward_codecs.lucene80.TestBestSpeedLucene80DocValuesFormat.testSortedNumericDocValuesWithSkipperMedium" -Ptests.jvms=4 -Ptests.jvmargs= -Ptests.seed=B2527FDA3A42ECE9 -Ptests.multiplier=2 -Ptests.nightly=true -Ptests.gui=true -Ptests.file.encoding=US-ASCII -Ptests.linedocsfile=/home/jenkins/jenkins-slave/workspace/Lucene/Lucene-NightlyTests-main/test-data/enwiki.random.lines.txt -Ptests.vectorsize=256 -Ptests.forceintegervectors=true
Deprecated Gradle features were used in this build, making it incompatible with Gradle 9.0.
You can use '--warning-mode all' to show the individual deprecation warnings and determine if they come from your own scripts or plugins.
For more on this, please refer to https://docs.gradle.org/8.8/userguide/command_line_interface.html#sec:command_line_warnings in the Gradle documentation.
BUILD SUCCESSFUL in 4h 12m 37s
244 actionable tasks: 184 executed, 60 up-to-date
Publishing build scan...
https://ge.apache.org/s/fna7ir4667ztm
Build step 'Invoke Gradle script' changed build result to SUCCESS
Archiving artifacts
‘**/*.events’ doesn’t match anything: ‘**’ exists but not ‘**/*.events’
No artifacts found that match the file pattern "**/*.events,heapdumps/**,**/hs_err_pid*". Configuration error?
Recording test results
[Checks API] No suitable checks publisher found.
Build step 'Publish JUnit test result report' changed build result to UNSTABLE
Email was triggered for: Unstable (Test Failures)
Sending email for trigger: Unstable (Test Failures)
[JENKINS] Lucene » Lucene-NightlyTests-main - Build # 1371 - Still Unstable!
Posted by Apache Jenkins Server <je...@builds.apache.org>.
Build: https://ci-builds.apache.org/job/Lucene/job/Lucene-NightlyTests-main/1371/
41 tests failed.
FAILED: org.apache.lucene.backward_codecs.lucene60.TestLucene60FieldInfosFormat.testRandom
Error Message:
java.lang.AssertionError: expected:<true> but was:<false>
Stack Trace:
java.lang.AssertionError: expected:<true> but was:<false>
at __randomizedtesting.SeedInfo.seed([713F9A11B6BF65AF:373BF1E07DFD3DC]:0)
at junit@4.13.1/org.junit.Assert.fail(Assert.java:89)
at junit@4.13.1/org.junit.Assert.failNotEquals(Assert.java:835)
at junit@4.13.1/org.junit.Assert.assertEquals(Assert.java:120)
at junit@4.13.1/org.junit.Assert.assertEquals(Assert.java:146)
at org.apache.lucene.test_framework@10.0.0-SNAPSHOT/org.apache.lucene.tests.index.BaseFieldInfoFormatTestCase.assertEquals(BaseFieldInfoFormatTestCase.java:410)
at org.apache.lucene.test_framework@10.0.0-SNAPSHOT/org.apache.lucene.tests.index.BaseFieldInfoFormatTestCase.assertEquals(BaseFieldInfoFormatTestCase.java:401)
at org.apache.lucene.test_framework@10.0.0-SNAPSHOT/org.apache.lucene.tests.index.BaseFieldInfoFormatTestCase.testRandom(BaseFieldInfoFormatTestCase.java:334)
at java.base/jdk.internal.reflect.DirectMethodHandleAccessor.invoke(DirectMethodHandleAccessor.java:103)
at java.base/java.lang.reflect.Method.invoke(Method.java:580)
at randomizedtesting.runner@2.8.1/com.carrotsearch.randomizedtesting.RandomizedRunner.invoke(RandomizedRunner.java:1758)
at randomizedtesting.runner@2.8.1/com.carrotsearch.randomizedtesting.RandomizedRunner$8.evaluate(RandomizedRunner.java:946)
at randomizedtesting.runner@2.8.1/com.carrotsearch.randomizedtesting.RandomizedRunner$9.evaluate(RandomizedRunner.java:982)
at randomizedtesting.runner@2.8.1/com.carrotsearch.randomizedtesting.RandomizedRunner$10.evaluate(RandomizedRunner.java:996)
at org.apache.lucene.test_framework@10.0.0-SNAPSHOT/org.apache.lucene.tests.util.TestRuleSetupTeardownChained$1.evaluate(TestRuleSetupTeardownChained.java:48)
at org.apache.lucene.test_framework@10.0.0-SNAPSHOT/org.apache.lucene.tests.util.AbstractBeforeAfterRule$1.evaluate(AbstractBeforeAfterRule.java:43)
at org.apache.lucene.test_framework@10.0.0-SNAPSHOT/org.apache.lucene.tests.util.TestRuleThreadAndTestName$1.evaluate(TestRuleThreadAndTestName.java:45)
at org.apache.lucene.test_framework@10.0.0-SNAPSHOT/org.apache.lucene.tests.util.TestRuleIgnoreAfterMaxFailures$1.evaluate(TestRuleIgnoreAfterMaxFailures.java:60)
at org.apache.lucene.test_framework@10.0.0-SNAPSHOT/org.apache.lucene.tests.util.TestRuleMarkFailure$1.evaluate(TestRuleMarkFailure.java:44)
at junit@4.13.1/org.junit.rules.RunRules.evaluate(RunRules.java:20)
at randomizedtesting.runner@2.8.1/com.carrotsearch.randomizedtesting.rules.StatementAdapter.evaluate(StatementAdapter.java:36)
at randomizedtesting.runner@2.8.1/com.carrotsearch.randomizedtesting.ThreadLeakControl$StatementRunner.run(ThreadLeakControl.java:390)
at randomizedtesting.runner@2.8.1/com.carrotsearch.randomizedtesting.ThreadLeakControl.forkTimeoutingTask(ThreadLeakControl.java:843)
at randomizedtesting.runner@2.8.1/com.carrotsearch.randomizedtesting.ThreadLeakControl$3.evaluate(ThreadLeakControl.java:490)
at randomizedtesting.runner@2.8.1/com.carrotsearch.randomizedtesting.RandomizedRunner.runSingleTest(RandomizedRunner.java:955)
at randomizedtesting.runner@2.8.1/com.carrotsearch.randomizedtesting.RandomizedRunner$5.evaluate(RandomizedRunner.java:840)
at randomizedtesting.runner@2.8.1/com.carrotsearch.randomizedtesting.RandomizedRunner$6.evaluate(RandomizedRunner.java:891)
at randomizedtesting.runner@2.8.1/com.carrotsearch.randomizedtesting.RandomizedRunner$7.evaluate(RandomizedRunner.java:902)
at org.apache.lucene.test_framework@10.0.0-SNAPSHOT/org.apache.lucene.tests.util.AbstractBeforeAfterRule$1.evaluate(AbstractBeforeAfterRule.java:43)
at randomizedtesting.runner@2.8.1/com.carrotsearch.randomizedtesting.rules.StatementAdapter.evaluate(StatementAdapter.java:36)
at org.apache.lucene.test_framework@10.0.0-SNAPSHOT/org.apache.lucene.tests.util.TestRuleStoreClassName$1.evaluate(TestRuleStoreClassName.java:38)
at randomizedtesting.runner@2.8.1/com.carrotsearch.randomizedtesting.rules.NoShadowingOrOverridesOnMethodsRule$1.evaluate(NoShadowingOrOverridesOnMethodsRule.java:40)
at randomizedtesting.runner@2.8.1/com.carrotsearch.randomizedtesting.rules.NoShadowingOrOverridesOnMethodsRule$1.evaluate(NoShadowingOrOverridesOnMethodsRule.java:40)
at randomizedtesting.runner@2.8.1/com.carrotsearch.randomizedtesting.rules.StatementAdapter.evaluate(StatementAdapter.java:36)
at randomizedtesting.runner@2.8.1/com.carrotsearch.randomizedtesting.rules.StatementAdapter.evaluate(StatementAdapter.java:36)
at org.apache.lucene.test_framework@10.0.0-SNAPSHOT/org.apache.lucene.tests.util.TestRuleAssertionsRequired$1.evaluate(TestRuleAssertionsRequired.java:53)
at org.apache.lucene.test_framework@10.0.0-SNAPSHOT/org.apache.lucene.tests.util.AbstractBeforeAfterRule$1.evaluate(AbstractBeforeAfterRule.java:43)
at org.apache.lucene.test_framework@10.0.0-SNAPSHOT/org.apache.lucene.tests.util.TestRuleMarkFailure$1.evaluate(TestRuleMarkFailure.java:44)
at org.apache.lucene.test_framework@10.0.0-SNAPSHOT/org.apache.lucene.tests.util.TestRuleIgnoreAfterMaxFailures$1.evaluate(TestRuleIgnoreAfterMaxFailures.java:60)
at org.apache.lucene.test_framework@10.0.0-SNAPSHOT/org.apache.lucene.tests.util.TestRuleIgnoreTestSuites$1.evaluate(TestRuleIgnoreTestSuites.java:47)
at junit@4.13.1/org.junit.rules.RunRules.evaluate(RunRules.java:20)
at randomizedtesting.runner@2.8.1/com.carrotsearch.randomizedtesting.rules.StatementAdapter.evaluate(StatementAdapter.java:36)
at randomizedtesting.runner@2.8.1/com.carrotsearch.randomizedtesting.ThreadLeakControl$StatementRunner.run(ThreadLeakControl.java:390)
at randomizedtesting.runner@2.8.1/com.carrotsearch.randomizedtesting.ThreadLeakControl.lambda$forkTimeoutingTask$0(ThreadLeakControl.java:850)
at java.base/java.lang.Thread.run(Thread.java:1583)
FAILED: org.apache.lucene.backward_codecs.lucene80.TestBestCompressionLucene80DocValuesFormat.testNumberMergeAwayAllValues
Error Message:
java.lang.NullPointerException: Cannot invoke "org.apache.lucene.index.DocValuesSkipper.docCount()" because "skipper" is null
Stack Trace:
java.lang.NullPointerException: Cannot invoke "org.apache.lucene.index.DocValuesSkipper.docCount()" because "skipper" is null
at __randomizedtesting.SeedInfo.seed([713F9A11B6BF65AF:201060321C5B9A3]:0)
at org.apache.lucene.test_framework@10.0.0-SNAPSHOT/org.apache.lucene.tests.index.BaseDocValuesFormatTestCase.testNumberMergeAwayAllValues(BaseDocValuesFormatTestCase.java:3256)
at java.base/jdk.internal.reflect.DirectMethodHandleAccessor.invoke(DirectMethodHandleAccessor.java:103)
at java.base/java.lang.reflect.Method.invoke(Method.java:580)
at randomizedtesting.runner@2.8.1/com.carrotsearch.randomizedtesting.RandomizedRunner.invoke(RandomizedRunner.java:1758)
at randomizedtesting.runner@2.8.1/com.carrotsearch.randomizedtesting.RandomizedRunner$8.evaluate(RandomizedRunner.java:946)
at randomizedtesting.runner@2.8.1/com.carrotsearch.randomizedtesting.RandomizedRunner$9.evaluate(RandomizedRunner.java:982)
at randomizedtesting.runner@2.8.1/com.carrotsearch.randomizedtesting.RandomizedRunner$10.evaluate(RandomizedRunner.java:996)
at org.apache.lucene.test_framework@10.0.0-SNAPSHOT/org.apache.lucene.tests.util.TestRuleSetupTeardownChained$1.evaluate(TestRuleSetupTeardownChained.java:48)
at org.apache.lucene.test_framework@10.0.0-SNAPSHOT/org.apache.lucene.tests.util.AbstractBeforeAfterRule$1.evaluate(AbstractBeforeAfterRule.java:43)
at org.apache.lucene.test_framework@10.0.0-SNAPSHOT/org.apache.lucene.tests.util.TestRuleThreadAndTestName$1.evaluate(TestRuleThreadAndTestName.java:45)
at org.apache.lucene.test_framework@10.0.0-SNAPSHOT/org.apache.lucene.tests.util.TestRuleIgnoreAfterMaxFailures$1.evaluate(TestRuleIgnoreAfterMaxFailures.java:60)
at org.apache.lucene.test_framework@10.0.0-SNAPSHOT/org.apache.lucene.tests.util.TestRuleMarkFailure$1.evaluate(TestRuleMarkFailure.java:44)
at junit@4.13.1/org.junit.rules.RunRules.evaluate(RunRules.java:20)
at randomizedtesting.runner@2.8.1/com.carrotsearch.randomizedtesting.rules.StatementAdapter.evaluate(StatementAdapter.java:36)
at randomizedtesting.runner@2.8.1/com.carrotsearch.randomizedtesting.ThreadLeakControl$StatementRunner.run(ThreadLeakControl.java:390)
at randomizedtesting.runner@2.8.1/com.carrotsearch.randomizedtesting.ThreadLeakControl.forkTimeoutingTask(ThreadLeakControl.java:843)
at randomizedtesting.runner@2.8.1/com.carrotsearch.randomizedtesting.ThreadLeakControl$3.evaluate(ThreadLeakControl.java:490)
at randomizedtesting.runner@2.8.1/com.carrotsearch.randomizedtesting.RandomizedRunner.runSingleTest(RandomizedRunner.java:955)
at randomizedtesting.runner@2.8.1/com.carrotsearch.randomizedtesting.RandomizedRunner$5.evaluate(RandomizedRunner.java:840)
at randomizedtesting.runner@2.8.1/com.carrotsearch.randomizedtesting.RandomizedRunner$6.evaluate(RandomizedRunner.java:891)
at randomizedtesting.runner@2.8.1/com.carrotsearch.randomizedtesting.RandomizedRunner$7.evaluate(RandomizedRunner.java:902)
at org.apache.lucene.test_framework@10.0.0-SNAPSHOT/org.apache.lucene.tests.util.AbstractBeforeAfterRule$1.evaluate(AbstractBeforeAfterRule.java:43)
at randomizedtesting.runner@2.8.1/com.carrotsearch.randomizedtesting.rules.StatementAdapter.evaluate(StatementAdapter.java:36)
at org.apache.lucene.test_framework@10.0.0-SNAPSHOT/org.apache.lucene.tests.util.TestRuleStoreClassName$1.evaluate(TestRuleStoreClassName.java:38)
at randomizedtesting.runner@2.8.1/com.carrotsearch.randomizedtesting.rules.NoShadowingOrOverridesOnMethodsRule$1.evaluate(NoShadowingOrOverridesOnMethodsRule.java:40)
at randomizedtesting.runner@2.8.1/com.carrotsearch.randomizedtesting.rules.NoShadowingOrOverridesOnMethodsRule$1.evaluate(NoShadowingOrOverridesOnMethodsRule.java:40)
at randomizedtesting.runner@2.8.1/com.carrotsearch.randomizedtesting.rules.StatementAdapter.evaluate(StatementAdapter.java:36)
at randomizedtesting.runner@2.8.1/com.carrotsearch.randomizedtesting.rules.StatementAdapter.evaluate(StatementAdapter.java:36)
at org.apache.lucene.test_framework@10.0.0-SNAPSHOT/org.apache.lucene.tests.util.TestRuleAssertionsRequired$1.evaluate(TestRuleAssertionsRequired.java:53)
at org.apache.lucene.test_framework@10.0.0-SNAPSHOT/org.apache.lucene.tests.util.AbstractBeforeAfterRule$1.evaluate(AbstractBeforeAfterRule.java:43)
at org.apache.lucene.test_framework@10.0.0-SNAPSHOT/org.apache.lucene.tests.util.TestRuleMarkFailure$1.evaluate(TestRuleMarkFailure.java:44)
at org.apache.lucene.test_framework@10.0.0-SNAPSHOT/org.apache.lucene.tests.util.TestRuleIgnoreAfterMaxFailures$1.evaluate(TestRuleIgnoreAfterMaxFailures.java:60)
at org.apache.lucene.test_framework@10.0.0-SNAPSHOT/org.apache.lucene.tests.util.TestRuleIgnoreTestSuites$1.evaluate(TestRuleIgnoreTestSuites.java:47)
at junit@4.13.1/org.junit.rules.RunRules.evaluate(RunRules.java:20)
at randomizedtesting.runner@2.8.1/com.carrotsearch.randomizedtesting.rules.StatementAdapter.evaluate(StatementAdapter.java:36)
at randomizedtesting.runner@2.8.1/com.carrotsearch.randomizedtesting.ThreadLeakControl$StatementRunner.run(ThreadLeakControl.java:390)
at randomizedtesting.runner@2.8.1/com.carrotsearch.randomizedtesting.ThreadLeakControl.lambda$forkTimeoutingTask$0(ThreadLeakControl.java:850)
at java.base/java.lang.Thread.run(Thread.java:1583)
FAILED: org.apache.lucene.backward_codecs.lucene80.TestBestCompressionLucene80DocValuesFormat.testSortedNumericMergeAwayAllValuesLargeSegment
Error Message:
java.lang.NullPointerException: Cannot invoke "org.apache.lucene.index.DocValuesSkipper.docCount()" because "skipper" is null
Stack Trace:
java.lang.NullPointerException: Cannot invoke "org.apache.lucene.index.DocValuesSkipper.docCount()" because "skipper" is null
at __randomizedtesting.SeedInfo.seed([713F9A11B6BF65AF:8816E575D041D6BC]:0)
at org.apache.lucene.test_framework@10.0.0-SNAPSHOT/org.apache.lucene.tests.index.BaseDocValuesFormatTestCase.testSortedNumericMergeAwayAllValuesLargeSegment(BaseDocValuesFormatTestCase.java:3674)
at java.base/jdk.internal.reflect.DirectMethodHandleAccessor.invoke(DirectMethodHandleAccessor.java:103)
at java.base/java.lang.reflect.Method.invoke(Method.java:580)
at randomizedtesting.runner@2.8.1/com.carrotsearch.randomizedtesting.RandomizedRunner.invoke(RandomizedRunner.java:1758)
at randomizedtesting.runner@2.8.1/com.carrotsearch.randomizedtesting.RandomizedRunner$8.evaluate(RandomizedRunner.java:946)
at randomizedtesting.runner@2.8.1/com.carrotsearch.randomizedtesting.RandomizedRunner$9.evaluate(RandomizedRunner.java:982)
at randomizedtesting.runner@2.8.1/com.carrotsearch.randomizedtesting.RandomizedRunner$10.evaluate(RandomizedRunner.java:996)
at org.apache.lucene.test_framework@10.0.0-SNAPSHOT/org.apache.lucene.tests.util.TestRuleSetupTeardownChained$1.evaluate(TestRuleSetupTeardownChained.java:48)
at org.apache.lucene.test_framework@10.0.0-SNAPSHOT/org.apache.lucene.tests.util.AbstractBeforeAfterRule$1.evaluate(AbstractBeforeAfterRule.java:43)
at org.apache.lucene.test_framework@10.0.0-SNAPSHOT/org.apache.lucene.tests.util.TestRuleThreadAndTestName$1.evaluate(TestRuleThreadAndTestName.java:45)
at org.apache.lucene.test_framework@10.0.0-SNAPSHOT/org.apache.lucene.tests.util.TestRuleIgnoreAfterMaxFailures$1.evaluate(TestRuleIgnoreAfterMaxFailures.java:60)
at org.apache.lucene.test_framework@10.0.0-SNAPSHOT/org.apache.lucene.tests.util.TestRuleMarkFailure$1.evaluate(TestRuleMarkFailure.java:44)
at junit@4.13.1/org.junit.rules.RunRules.evaluate(RunRules.java:20)
at randomizedtesting.runner@2.8.1/com.carrotsearch.randomizedtesting.rules.StatementAdapter.evaluate(StatementAdapter.java:36)
at randomizedtesting.runner@2.8.1/com.carrotsearch.randomizedtesting.ThreadLeakControl$StatementRunner.run(ThreadLeakControl.java:390)
at randomizedtesting.runner@2.8.1/com.carrotsearch.randomizedtesting.ThreadLeakControl.forkTimeoutingTask(ThreadLeakControl.java:843)
at randomizedtesting.runner@2.8.1/com.carrotsearch.randomizedtesting.ThreadLeakControl$3.evaluate(ThreadLeakControl.java:490)
at randomizedtesting.runner@2.8.1/com.carrotsearch.randomizedtesting.RandomizedRunner.runSingleTest(RandomizedRunner.java:955)
at randomizedtesting.runner@2.8.1/com.carrotsearch.randomizedtesting.RandomizedRunner$5.evaluate(RandomizedRunner.java:840)
at randomizedtesting.runner@2.8.1/com.carrotsearch.randomizedtesting.RandomizedRunner$6.evaluate(RandomizedRunner.java:891)
at randomizedtesting.runner@2.8.1/com.carrotsearch.randomizedtesting.RandomizedRunner$7.evaluate(RandomizedRunner.java:902)
at org.apache.lucene.test_framework@10.0.0-SNAPSHOT/org.apache.lucene.tests.util.AbstractBeforeAfterRule$1.evaluate(AbstractBeforeAfterRule.java:43)
at randomizedtesting.runner@2.8.1/com.carrotsearch.randomizedtesting.rules.StatementAdapter.evaluate(StatementAdapter.java:36)
at org.apache.lucene.test_framework@10.0.0-SNAPSHOT/org.apache.lucene.tests.util.TestRuleStoreClassName$1.evaluate(TestRuleStoreClassName.java:38)
at randomizedtesting.runner@2.8.1/com.carrotsearch.randomizedtesting.rules.NoShadowingOrOverridesOnMethodsRule$1.evaluate(NoShadowingOrOverridesOnMethodsRule.java:40)
at randomizedtesting.runner@2.8.1/com.carrotsearch.randomizedtesting.rules.NoShadowingOrOverridesOnMethodsRule$1.evaluate(NoShadowingOrOverridesOnMethodsRule.java:40)
at randomizedtesting.runner@2.8.1/com.carrotsearch.randomizedtesting.rules.StatementAdapter.evaluate(StatementAdapter.java:36)
at randomizedtesting.runner@2.8.1/com.carrotsearch.randomizedtesting.rules.StatementAdapter.evaluate(StatementAdapter.java:36)
at org.apache.lucene.test_framework@10.0.0-SNAPSHOT/org.apache.lucene.tests.util.TestRuleAssertionsRequired$1.evaluate(TestRuleAssertionsRequired.java:53)
at org.apache.lucene.test_framework@10.0.0-SNAPSHOT/org.apache.lucene.tests.util.AbstractBeforeAfterRule$1.evaluate(AbstractBeforeAfterRule.java:43)
at org.apache.lucene.test_framework@10.0.0-SNAPSHOT/org.apache.lucene.tests.util.TestRuleMarkFailure$1.evaluate(TestRuleMarkFailure.java:44)
at org.apache.lucene.test_framework@10.0.0-SNAPSHOT/org.apache.lucene.tests.util.TestRuleIgnoreAfterMaxFailures$1.evaluate(TestRuleIgnoreAfterMaxFailures.java:60)
at org.apache.lucene.test_framework@10.0.0-SNAPSHOT/org.apache.lucene.tests.util.TestRuleIgnoreTestSuites$1.evaluate(TestRuleIgnoreTestSuites.java:47)
at junit@4.13.1/org.junit.rules.RunRules.evaluate(RunRules.java:20)
at randomizedtesting.runner@2.8.1/com.carrotsearch.randomizedtesting.rules.StatementAdapter.evaluate(StatementAdapter.java:36)
at randomizedtesting.runner@2.8.1/com.carrotsearch.randomizedtesting.ThreadLeakControl$StatementRunner.run(ThreadLeakControl.java:390)
at randomizedtesting.runner@2.8.1/com.carrotsearch.randomizedtesting.ThreadLeakControl.lambda$forkTimeoutingTask$0(ThreadLeakControl.java:850)
at java.base/java.lang.Thread.run(Thread.java:1583)
FAILED: org.apache.lucene.backward_codecs.lucene80.TestBestCompressionLucene80DocValuesFormat.testSortedNumericDocValuesWithSkipperBig
Error Message:
java.lang.NullPointerException: Cannot invoke "org.apache.lucene.index.DocValuesSkipper.maxDocID(int)" because "skipper" is null
Stack Trace:
java.lang.NullPointerException: Cannot invoke "org.apache.lucene.index.DocValuesSkipper.maxDocID(int)" because "skipper" is null
at __randomizedtesting.SeedInfo.seed([713F9A11B6BF65AF:2A8F4D7CA0ECDE5F]:0)
at org.apache.lucene.core@10.0.0-SNAPSHOT/org.apache.lucene.index.CheckIndex.checkDocValueSkipper(CheckIndex.java:3280)
at org.apache.lucene.core@10.0.0-SNAPSHOT/org.apache.lucene.index.CheckIndex.checkDocValues(CheckIndex.java:3740)
at org.apache.lucene.core@10.0.0-SNAPSHOT/org.apache.lucene.index.CheckIndex.testDocValues(CheckIndex.java:3242)
at org.apache.lucene.test_framework@10.0.0-SNAPSHOT/org.apache.lucene.tests.index.BaseDocValuesFormatTestCase.assertDocValuesWithSkipper(BaseDocValuesFormatTestCase.java:4196)
at org.apache.lucene.test_framework@10.0.0-SNAPSHOT/org.apache.lucene.tests.index.BaseDocValuesFormatTestCase.doTestSortedNumericDocValuesWithSkipper(BaseDocValuesFormatTestCase.java:3945)
at org.apache.lucene.test_framework@10.0.0-SNAPSHOT/org.apache.lucene.tests.index.BaseDocValuesFormatTestCase.testSortedNumericDocValuesWithSkipperBig(BaseDocValuesFormatTestCase.java:3941)
at java.base/jdk.internal.reflect.DirectMethodHandleAccessor.invoke(DirectMethodHandleAccessor.java:103)
at java.base/java.lang.reflect.Method.invoke(Method.java:580)
at randomizedtesting.runner@2.8.1/com.carrotsearch.randomizedtesting.RandomizedRunner.invoke(RandomizedRunner.java:1758)
at randomizedtesting.runner@2.8.1/com.carrotsearch.randomizedtesting.RandomizedRunner$8.evaluate(RandomizedRunner.java:946)
at randomizedtesting.runner@2.8.1/com.carrotsearch.randomizedtesting.RandomizedRunner$9.evaluate(RandomizedRunner.java:982)
at randomizedtesting.runner@2.8.1/com.carrotsearch.randomizedtesting.RandomizedRunner$10.evaluate(RandomizedRunner.java:996)
at org.apache.lucene.test_framework@10.0.0-SNAPSHOT/org.apache.lucene.tests.util.TestRuleSetupTeardownChained$1.evaluate(TestRuleSetupTeardownChained.java:48)
at org.apache.lucene.test_framework@10.0.0-SNAPSHOT/org.apache.lucene.tests.util.AbstractBeforeAfterRule$1.evaluate(AbstractBeforeAfterRule.java:43)
at org.apache.lucene.test_framework@10.0.0-SNAPSHOT/org.apache.lucene.tests.util.TestRuleThreadAndTestName$1.evaluate(TestRuleThreadAndTestName.java:45)
at org.apache.lucene.test_framework@10.0.0-SNAPSHOT/org.apache.lucene.tests.util.TestRuleIgnoreAfterMaxFailures$1.evaluate(TestRuleIgnoreAfterMaxFailures.java:60)
at org.apache.lucene.test_framework@10.0.0-SNAPSHOT/org.apache.lucene.tests.util.TestRuleMarkFailure$1.evaluate(TestRuleMarkFailure.java:44)
at junit@4.13.1/org.junit.rules.RunRules.evaluate(RunRules.java:20)
at randomizedtesting.runner@2.8.1/com.carrotsearch.randomizedtesting.rules.StatementAdapter.evaluate(StatementAdapter.java:36)
at randomizedtesting.runner@2.8.1/com.carrotsearch.randomizedtesting.ThreadLeakControl$StatementRunner.run(ThreadLeakControl.java:390)
at randomizedtesting.runner@2.8.1/com.carrotsearch.randomizedtesting.ThreadLeakControl.forkTimeoutingTask(ThreadLeakControl.java:843)
at randomizedtesting.runner@2.8.1/com.carrotsearch.randomizedtesting.ThreadLeakControl$3.evaluate(ThreadLeakControl.java:490)
at randomizedtesting.runner@2.8.1/com.carrotsearch.randomizedtesting.RandomizedRunner.runSingleTest(RandomizedRunner.java:955)
at randomizedtesting.runner@2.8.1/com.carrotsearch.randomizedtesting.RandomizedRunner$5.evaluate(RandomizedRunner.java:840)
at randomizedtesting.runner@2.8.1/com.carrotsearch.randomizedtesting.RandomizedRunner$6.evaluate(RandomizedRunner.java:891)
at randomizedtesting.runner@2.8.1/com.carrotsearch.randomizedtesting.RandomizedRunner$7.evaluate(RandomizedRunner.java:902)
at org.apache.lucene.test_framework@10.0.0-SNAPSHOT/org.apache.lucene.tests.util.AbstractBeforeAfterRule$1.evaluate(AbstractBeforeAfterRule.java:43)
at randomizedtesting.runner@2.8.1/com.carrotsearch.randomizedtesting.rules.StatementAdapter.evaluate(StatementAdapter.java:36)
at org.apache.lucene.test_framework@10.0.0-SNAPSHOT/org.apache.lucene.tests.util.TestRuleStoreClassName$1.evaluate(TestRuleStoreClassName.java:38)
at randomizedtesting.runner@2.8.1/com.carrotsearch.randomizedtesting.rules.NoShadowingOrOverridesOnMethodsRule$1.evaluate(NoShadowingOrOverridesOnMethodsRule.java:40)
at randomizedtesting.runner@2.8.1/com.carrotsearch.randomizedtesting.rules.NoShadowingOrOverridesOnMethodsRule$1.evaluate(NoShadowingOrOverridesOnMethodsRule.java:40)
at randomizedtesting.runner@2.8.1/com.carrotsearch.randomizedtesting.rules.StatementAdapter.evaluate(StatementAdapter.java:36)
at randomizedtesting.runner@2.8.1/com.carrotsearch.randomizedtesting.rules.StatementAdapter.evaluate(StatementAdapter.java:36)
at org.apache.lucene.test_framework@10.0.0-SNAPSHOT/org.apache.lucene.tests.util.TestRuleAssertionsRequired$1.evaluate(TestRuleAssertionsRequired.java:53)
at org.apache.lucene.test_framework@10.0.0-SNAPSHOT/org.apache.lucene.tests.util.AbstractBeforeAfterRule$1.evaluate(AbstractBeforeAfterRule.java:43)
at org.apache.lucene.test_framework@10.0.0-SNAPSHOT/org.apache.lucene.tests.util.TestRuleMarkFailure$1.evaluate(TestRuleMarkFailure.java:44)
at org.apache.lucene.test_framework@10.0.0-SNAPSHOT/org.apache.lucene.tests.util.TestRuleIgnoreAfterMaxFailures$1.evaluate(TestRuleIgnoreAfterMaxFailures.java:60)
at org.apache.lucene.test_framework@10.0.0-SNAPSHOT/org.apache.lucene.tests.util.TestRuleIgnoreTestSuites$1.evaluate(TestRuleIgnoreTestSuites.java:47)
at junit@4.13.1/org.junit.rules.RunRules.evaluate(RunRules.java:20)
at randomizedtesting.runner@2.8.1/com.carrotsearch.randomizedtesting.rules.StatementAdapter.evaluate(StatementAdapter.java:36)
at randomizedtesting.runner@2.8.1/com.carrotsearch.randomizedtesting.ThreadLeakControl$StatementRunner.run(ThreadLeakControl.java:390)
at randomizedtesting.runner@2.8.1/com.carrotsearch.randomizedtesting.ThreadLeakControl.lambda$forkTimeoutingTask$0(ThreadLeakControl.java:850)
at java.base/java.lang.Thread.run(Thread.java:1583)
FAILED: org.apache.lucene.backward_codecs.lucene80.TestBestCompressionLucene80DocValuesFormat.testSortedMergeAwayAllValues
Error Message:
java.lang.NullPointerException: Cannot invoke "org.apache.lucene.index.DocValuesSkipper.docCount()" because "skipper" is null
Stack Trace:
java.lang.NullPointerException: Cannot invoke "org.apache.lucene.index.DocValuesSkipper.docCount()" because "skipper" is null
at __randomizedtesting.SeedInfo.seed([713F9A11B6BF65AF:44B617D967A9E84F]:0)
at org.apache.lucene.test_framework@10.0.0-SNAPSHOT/org.apache.lucene.tests.index.BaseDocValuesFormatTestCase.testSortedMergeAwayAllValues(BaseDocValuesFormatTestCase.java:924)
at java.base/jdk.internal.reflect.DirectMethodHandleAccessor.invoke(DirectMethodHandleAccessor.java:103)
at java.base/java.lang.reflect.Method.invoke(Method.java:580)
at randomizedtesting.runner@2.8.1/com.carrotsearch.randomizedtesting.RandomizedRunner.invoke(RandomizedRunner.java:1758)
at randomizedtesting.runner@2.8.1/com.carrotsearch.randomizedtesting.RandomizedRunner$8.evaluate(RandomizedRunner.java:946)
at randomizedtesting.runner@2.8.1/com.carrotsearch.randomizedtesting.RandomizedRunner$9.evaluate(RandomizedRunner.java:982)
at randomizedtesting.runner@2.8.1/com.carrotsearch.randomizedtesting.RandomizedRunner$10.evaluate(RandomizedRunner.java:996)
at org.apache.lucene.test_framework@10.0.0-SNAPSHOT/org.apache.lucene.tests.util.TestRuleSetupTeardownChained$1.evaluate(TestRuleSetupTeardownChained.java:48)
at org.apache.lucene.test_framework@10.0.0-SNAPSHOT/org.apache.lucene.tests.util.AbstractBeforeAfterRule$1.evaluate(AbstractBeforeAfterRule.java:43)
at org.apache.lucene.test_framework@10.0.0-SNAPSHOT/org.apache.lucene.tests.util.TestRuleThreadAndTestName$1.evaluate(TestRuleThreadAndTestName.java:45)
at org.apache.lucene.test_framework@10.0.0-SNAPSHOT/org.apache.lucene.tests.util.TestRuleIgnoreAfterMaxFailures$1.evaluate(TestRuleIgnoreAfterMaxFailures.java:60)
at org.apache.lucene.test_framework@10.0.0-SNAPSHOT/org.apache.lucene.tests.util.TestRuleMarkFailure$1.evaluate(TestRuleMarkFailure.java:44)
at junit@4.13.1/org.junit.rules.RunRules.evaluate(RunRules.java:20)
at randomizedtesting.runner@2.8.1/com.carrotsearch.randomizedtesting.rules.StatementAdapter.evaluate(StatementAdapter.java:36)
at randomizedtesting.runner@2.8.1/com.carrotsearch.randomizedtesting.ThreadLeakControl$StatementRunner.run(ThreadLeakControl.java:390)
at randomizedtesting.runner@2.8.1/com.carrotsearch.randomizedtesting.ThreadLeakControl.forkTimeoutingTask(ThreadLeakControl.java:843)
at randomizedtesting.runner@2.8.1/com.carrotsearch.randomizedtesting.ThreadLeakControl$3.evaluate(ThreadLeakControl.java:490)
at randomizedtesting.runner@2.8.1/com.carrotsearch.randomizedtesting.RandomizedRunner.runSingleTest(RandomizedRunner.java:955)
at randomizedtesting.runner@2.8.1/com.carrotsearch.randomizedtesting.RandomizedRunner$5.evaluate(RandomizedRunner.java:840)
at randomizedtesting.runner@2.8.1/com.carrotsearch.randomizedtesting.RandomizedRunner$6.evaluate(RandomizedRunner.java:891)
at randomizedtesting.runner@2.8.1/com.carrotsearch.randomizedtesting.RandomizedRunner$7.evaluate(RandomizedRunner.java:902)
at org.apache.lucene.test_framework@10.0.0-SNAPSHOT/org.apache.lucene.tests.util.AbstractBeforeAfterRule$1.evaluate(AbstractBeforeAfterRule.java:43)
at randomizedtesting.runner@2.8.1/com.carrotsearch.randomizedtesting.rules.StatementAdapter.evaluate(StatementAdapter.java:36)
at org.apache.lucene.test_framework@10.0.0-SNAPSHOT/org.apache.lucene.tests.util.TestRuleStoreClassName$1.evaluate(TestRuleStoreClassName.java:38)
at randomizedtesting.runner@2.8.1/com.carrotsearch.randomizedtesting.rules.NoShadowingOrOverridesOnMethodsRule$1.evaluate(NoShadowingOrOverridesOnMethodsRule.java:40)
at randomizedtesting.runner@2.8.1/com.carrotsearch.randomizedtesting.rules.NoShadowingOrOverridesOnMethodsRule$1.evaluate(NoShadowingOrOverridesOnMethodsRule.java:40)
at randomizedtesting.runner@2.8.1/com.carrotsearch.randomizedtesting.rules.StatementAdapter.evaluate(StatementAdapter.java:36)
at randomizedtesting.runner@2.8.1/com.carrotsearch.randomizedtesting.rules.StatementAdapter.evaluate(StatementAdapter.java:36)
at org.apache.lucene.test_framework@10.0.0-SNAPSHOT/org.apache.lucene.tests.util.TestRuleAssertionsRequired$1.evaluate(TestRuleAssertionsRequired.java:53)
at org.apache.lucene.test_framework@10.0.0-SNAPSHOT/org.apache.lucene.tests.util.AbstractBeforeAfterRule$1.evaluate(AbstractBeforeAfterRule.java:43)
at org.apache.lucene.test_framework@10.0.0-SNAPSHOT/org.apache.lucene.tests.util.TestRuleMarkFailure$1.evaluate(TestRuleMarkFailure.java:44)
at org.apache.lucene.test_framework@10.0.0-SNAPSHOT/org.apache.lucene.tests.util.TestRuleIgnoreAfterMaxFailures$1.evaluate(TestRuleIgnoreAfterMaxFailures.java:60)
at org.apache.lucene.test_framework@10.0.0-SNAPSHOT/org.apache.lucene.tests.util.TestRuleIgnoreTestSuites$1.evaluate(TestRuleIgnoreTestSuites.java:47)
at junit@4.13.1/org.junit.rules.RunRules.evaluate(RunRules.java:20)
at randomizedtesting.runner@2.8.1/com.carrotsearch.randomizedtesting.rules.StatementAdapter.evaluate(StatementAdapter.java:36)
at randomizedtesting.runner@2.8.1/com.carrotsearch.randomizedtesting.ThreadLeakControl$StatementRunner.run(ThreadLeakControl.java:390)
at randomizedtesting.runner@2.8.1/com.carrotsearch.randomizedtesting.ThreadLeakControl.lambda$forkTimeoutingTask$0(ThreadLeakControl.java:850)
at java.base/java.lang.Thread.run(Thread.java:1583)
FAILED: org.apache.lucene.backward_codecs.lucene80.TestBestCompressionLucene80DocValuesFormat.testSortedNumberMergeAwayAllValues
Error Message:
java.lang.NullPointerException: Cannot invoke "org.apache.lucene.index.DocValuesSkipper.docCount()" because "skipper" is null
Stack Trace:
java.lang.NullPointerException: Cannot invoke "org.apache.lucene.index.DocValuesSkipper.docCount()" because "skipper" is null
at __randomizedtesting.SeedInfo.seed([713F9A11B6BF65AF:B96F3059D9130871]:0)
at org.apache.lucene.test_framework@10.0.0-SNAPSHOT/org.apache.lucene.tests.index.BaseDocValuesFormatTestCase.testSortedNumberMergeAwayAllValues(BaseDocValuesFormatTestCase.java:3387)
at java.base/jdk.internal.reflect.DirectMethodHandleAccessor.invoke(DirectMethodHandleAccessor.java:103)
at java.base/java.lang.reflect.Method.invoke(Method.java:580)
at randomizedtesting.runner@2.8.1/com.carrotsearch.randomizedtesting.RandomizedRunner.invoke(RandomizedRunner.java:1758)
at randomizedtesting.runner@2.8.1/com.carrotsearch.randomizedtesting.RandomizedRunner$8.evaluate(RandomizedRunner.java:946)
at randomizedtesting.runner@2.8.1/com.carrotsearch.randomizedtesting.RandomizedRunner$9.evaluate(RandomizedRunner.java:982)
at randomizedtesting.runner@2.8.1/com.carrotsearch.randomizedtesting.RandomizedRunner$10.evaluate(RandomizedRunner.java:996)
at org.apache.lucene.test_framework@10.0.0-SNAPSHOT/org.apache.lucene.tests.util.TestRuleSetupTeardownChained$1.evaluate(TestRuleSetupTeardownChained.java:48)
at org.apache.lucene.test_framework@10.0.0-SNAPSHOT/org.apache.lucene.tests.util.AbstractBeforeAfterRule$1.evaluate(AbstractBeforeAfterRule.java:43)
at org.apache.lucene.test_framework@10.0.0-SNAPSHOT/org.apache.lucene.tests.util.TestRuleThreadAndTestName$1.evaluate(TestRuleThreadAndTestName.java:45)
at org.apache.lucene.test_framework@10.0.0-SNAPSHOT/org.apache.lucene.tests.util.TestRuleIgnoreAfterMaxFailures$1.evaluate(TestRuleIgnoreAfterMaxFailures.java:60)
at org.apache.lucene.test_framework@10.0.0-SNAPSHOT/org.apache.lucene.tests.util.TestRuleMarkFailure$1.evaluate(TestRuleMarkFailure.java:44)
at junit@4.13.1/org.junit.rules.RunRules.evaluate(RunRules.java:20)
at randomizedtesting.runner@2.8.1/com.carrotsearch.randomizedtesting.rules.StatementAdapter.evaluate(StatementAdapter.java:36)
at randomizedtesting.runner@2.8.1/com.carrotsearch.randomizedtesting.ThreadLeakControl$StatementRunner.run(ThreadLeakControl.java:390)
at randomizedtesting.runner@2.8.1/com.carrotsearch.randomizedtesting.ThreadLeakControl.forkTimeoutingTask(ThreadLeakControl.java:843)
at randomizedtesting.runner@2.8.1/com.carrotsearch.randomizedtesting.ThreadLeakControl$3.evaluate(ThreadLeakControl.java:490)
at randomizedtesting.runner@2.8.1/com.carrotsearch.randomizedtesting.RandomizedRunner.runSingleTest(RandomizedRunner.java:955)
at randomizedtesting.runner@2.8.1/com.carrotsearch.randomizedtesting.RandomizedRunner$5.evaluate(RandomizedRunner.java:840)
at randomizedtesting.runner@2.8.1/com.carrotsearch.randomizedtesting.RandomizedRunner$6.evaluate(RandomizedRunner.java:891)
at randomizedtesting.runner@2.8.1/com.carrotsearch.randomizedtesting.RandomizedRunner$7.evaluate(RandomizedRunner.java:902)
at org.apache.lucene.test_framework@10.0.0-SNAPSHOT/org.apache.lucene.tests.util.AbstractBeforeAfterRule$1.evaluate(AbstractBeforeAfterRule.java:43)
at randomizedtesting.runner@2.8.1/com.carrotsearch.randomizedtesting.rules.StatementAdapter.evaluate(StatementAdapter.java:36)
at org.apache.lucene.test_framework@10.0.0-SNAPSHOT/org.apache.lucene.tests.util.TestRuleStoreClassName$1.evaluate(TestRuleStoreClassName.java:38)
at randomizedtesting.runner@2.8.1/com.carrotsearch.randomizedtesting.rules.NoShadowingOrOverridesOnMethodsRule$1.evaluate(NoShadowingOrOverridesOnMethodsRule.java:40)
at randomizedtesting.runner@2.8.1/com.carrotsearch.randomizedtesting.rules.NoShadowingOrOverridesOnMethodsRule$1.evaluate(NoShadowingOrOverridesOnMethodsRule.java:40)
at randomizedtesting.runner@2.8.1/com.carrotsearch.randomizedtesting.rules.StatementAdapter.evaluate(StatementAdapter.java:36)
at randomizedtesting.runner@2.8.1/com.carrotsearch.randomizedtesting.rules.StatementAdapter.evaluate(StatementAdapter.java:36)
at org.apache.lucene.test_framework@10.0.0-SNAPSHOT/org.apache.lucene.tests.util.TestRuleAssertionsRequired$1.evaluate(TestRuleAssertionsRequired.java:53)
at org.apache.lucene.test_framework@10.0.0-SNAPSHOT/org.apache.lucene.tests.util.AbstractBeforeAfterRule$1.evaluate(AbstractBeforeAfterRule.java:43)
at org.apache.lucene.test_framework@10.0.0-SNAPSHOT/org.apache.lucene.tests.util.TestRuleMarkFailure$1.evaluate(TestRuleMarkFailure.java:44)
at org.apache.lucene.test_framework@10.0.0-SNAPSHOT/org.apache.lucene.tests.util.TestRuleIgnoreAfterMaxFailures$1.evaluate(TestRuleIgnoreAfterMaxFailures.java:60)
at org.apache.lucene.test_framework@10.0.0-SNAPSHOT/org.apache.lucene.tests.util.TestRuleIgnoreTestSuites$1.evaluate(TestRuleIgnoreTestSuites.java:47)
at junit@4.13.1/org.junit.rules.RunRules.evaluate(RunRules.java:20)
at randomizedtesting.runner@2.8.1/com.carrotsearch.randomizedtesting.rules.StatementAdapter.evaluate(StatementAdapter.java:36)
at randomizedtesting.runner@2.8.1/com.carrotsearch.randomizedtesting.ThreadLeakControl$StatementRunner.run(ThreadLeakControl.java:390)
at randomizedtesting.runner@2.8.1/com.carrotsearch.randomizedtesting.ThreadLeakControl.lambda$forkTimeoutingTask$0(ThreadLeakControl.java:850)
at java.base/java.lang.Thread.run(Thread.java:1583)
FAILED: org.apache.lucene.backward_codecs.lucene80.TestBestCompressionLucene80DocValuesFormat.testSortedDocValuesWithSkipperBig
Error Message:
java.lang.NullPointerException: Cannot invoke "org.apache.lucene.index.DocValuesSkipper.maxDocID(int)" because "skipper" is null
Stack Trace:
java.lang.NullPointerException: Cannot invoke "org.apache.lucene.index.DocValuesSkipper.maxDocID(int)" because "skipper" is null
at __randomizedtesting.SeedInfo.seed([713F9A11B6BF65AF:9BC25C703BCAC9A1]:0)
at org.apache.lucene.core@10.0.0-SNAPSHOT/org.apache.lucene.index.CheckIndex.checkDocValueSkipper(CheckIndex.java:3280)
at org.apache.lucene.core@10.0.0-SNAPSHOT/org.apache.lucene.index.CheckIndex.checkDocValues(CheckIndex.java:3740)
at org.apache.lucene.core@10.0.0-SNAPSHOT/org.apache.lucene.index.CheckIndex.testDocValues(CheckIndex.java:3242)
at org.apache.lucene.test_framework@10.0.0-SNAPSHOT/org.apache.lucene.tests.index.BaseDocValuesFormatTestCase.assertDocValuesWithSkipper(BaseDocValuesFormatTestCase.java:4196)
at org.apache.lucene.test_framework@10.0.0-SNAPSHOT/org.apache.lucene.tests.index.BaseDocValuesFormatTestCase.doTestSortedDocValuesWithSkipper(BaseDocValuesFormatTestCase.java:4029)
at org.apache.lucene.test_framework@10.0.0-SNAPSHOT/org.apache.lucene.tests.index.BaseDocValuesFormatTestCase.testSortedDocValuesWithSkipperBig(BaseDocValuesFormatTestCase.java:4025)
at java.base/jdk.internal.reflect.DirectMethodHandleAccessor.invoke(DirectMethodHandleAccessor.java:103)
at java.base/java.lang.reflect.Method.invoke(Method.java:580)
at randomizedtesting.runner@2.8.1/com.carrotsearch.randomizedtesting.RandomizedRunner.invoke(RandomizedRunner.java:1758)
at randomizedtesting.runner@2.8.1/com.carrotsearch.randomizedtesting.RandomizedRunner$8.evaluate(RandomizedRunner.java:946)
at randomizedtesting.runner@2.8.1/com.carrotsearch.randomizedtesting.RandomizedRunner$9.evaluate(RandomizedRunner.java:982)
at randomizedtesting.runner@2.8.1/com.carrotsearch.randomizedtesting.RandomizedRunner$10.evaluate(RandomizedRunner.java:996)
at org.apache.lucene.test_framework@10.0.0-SNAPSHOT/org.apache.lucene.tests.util.TestRuleSetupTeardownChained$1.evaluate(TestRuleSetupTeardownChained.java:48)
at org.apache.lucene.test_framework@10.0.0-SNAPSHOT/org.apache.lucene.tests.util.AbstractBeforeAfterRule$1.evaluate(AbstractBeforeAfterRule.java:43)
at org.apache.lucene.test_framework@10.0.0-SNAPSHOT/org.apache.lucene.tests.util.TestRuleThreadAndTestName$1.evaluate(TestRuleThreadAndTestName.java:45)
at org.apache.lucene.test_framework@10.0.0-SNAPSHOT/org.apache.lucene.tests.util.TestRuleIgnoreAfterMaxFailures$1.evaluate(TestRuleIgnoreAfterMaxFailures.java:60)
at org.apache.lucene.test_framework@10.0.0-SNAPSHOT/org.apache.lucene.tests.util.TestRuleMarkFailure$1.evaluate(TestRuleMarkFailure.java:44)
at junit@4.13.1/org.junit.rules.RunRules.evaluate(RunRules.java:20)
at randomizedtesting.runner@2.8.1/com.carrotsearch.randomizedtesting.rules.StatementAdapter.evaluate(StatementAdapter.java:36)
at randomizedtesting.runner@2.8.1/com.carrotsearch.randomizedtesting.ThreadLeakControl$StatementRunner.run(ThreadLeakControl.java:390)
at randomizedtesting.runner@2.8.1/com.carrotsearch.randomizedtesting.ThreadLeakControl.forkTimeoutingTask(ThreadLeakControl.java:843)
at randomizedtesting.runner@2.8.1/com.carrotsearch.randomizedtesting.ThreadLeakControl$3.evaluate(ThreadLeakControl.java:490)
at randomizedtesting.runner@2.8.1/com.carrotsearch.randomizedtesting.RandomizedRunner.runSingleTest(RandomizedRunner.java:955)
at randomizedtesting.runner@2.8.1/com.carrotsearch.randomizedtesting.RandomizedRunner$5.evaluate(RandomizedRunner.java:840)
at randomizedtesting.runner@2.8.1/com.carrotsearch.randomizedtesting.RandomizedRunner$6.evaluate(RandomizedRunner.java:891)
at randomizedtesting.runner@2.8.1/com.carrotsearch.randomizedtesting.RandomizedRunner$7.evaluate(RandomizedRunner.java:902)
at org.apache.lucene.test_framework@10.0.0-SNAPSHOT/org.apache.lucene.tests.util.AbstractBeforeAfterRule$1.evaluate(AbstractBeforeAfterRule.java:43)
at randomizedtesting.runner@2.8.1/com.carrotsearch.randomizedtesting.rules.StatementAdapter.evaluate(StatementAdapter.java:36)
at org.apache.lucene.test_framework@10.0.0-SNAPSHOT/org.apache.lucene.tests.util.TestRuleStoreClassName$1.evaluate(TestRuleStoreClassName.java:38)
at randomizedtesting.runner@2.8.1/com.carrotsearch.randomizedtesting.rules.NoShadowingOrOverridesOnMethodsRule$1.evaluate(NoShadowingOrOverridesOnMethodsRule.java:40)
at randomizedtesting.runner@2.8.1/com.carrotsearch.randomizedtesting.rules.NoShadowingOrOverridesOnMethodsRule$1.evaluate(NoShadowingOrOverridesOnMethodsRule.java:40)
at randomizedtesting.runner@2.8.1/com.carrotsearch.randomizedtesting.rules.StatementAdapter.evaluate(StatementAdapter.java:36)
at randomizedtesting.runner@2.8.1/com.carrotsearch.randomizedtesting.rules.StatementAdapter.evaluate(StatementAdapter.java:36)
at org.apache.lucene.test_framework@10.0.0-SNAPSHOT/org.apache.lucene.tests.util.TestRuleAssertionsRequired$1.evaluate(TestRuleAssertionsRequired.java:53)
at org.apache.lucene.test_framework@10.0.0-SNAPSHOT/org.apache.lucene.tests.util.AbstractBeforeAfterRule$1.evaluate(AbstractBeforeAfterRule.java:43)
at org.apache.lucene.test_framework@10.0.0-SNAPSHOT/org.apache.lucene.tests.util.TestRuleMarkFailure$1.evaluate(TestRuleMarkFailure.java:44)
at org.apache.lucene.test_framework@10.0.0-SNAPSHOT/org.apache.lucene.tests.util.TestRuleIgnoreAfterMaxFailures$1.evaluate(TestRuleIgnoreAfterMaxFailures.java:60)
at org.apache.lucene.test_framework@10.0.0-SNAPSHOT/org.apache.lucene.tests.util.TestRuleIgnoreTestSuites$1.evaluate(TestRuleIgnoreTestSuites.java:47)
at junit@4.13.1/org.junit.rules.RunRules.evaluate(RunRules.java:20)
at randomizedtesting.runner@2.8.1/com.carrotsearch.randomizedtesting.rules.StatementAdapter.evaluate(StatementAdapter.java:36)
at randomizedtesting.runner@2.8.1/com.carrotsearch.randomizedtesting.ThreadLeakControl$StatementRunner.run(ThreadLeakControl.java:390)
at randomizedtesting.runner@2.8.1/com.carrotsearch.randomizedtesting.ThreadLeakControl.lambda$forkTimeoutingTask$0(ThreadLeakControl.java:850)
at java.base/java.lang.Thread.run(Thread.java:1583)
FAILED: org.apache.lucene.backward_codecs.lucene80.TestBestCompressionLucene80DocValuesFormat.testSortedSetMergeAwayAllValues
Error Message:
java.lang.NullPointerException: Cannot invoke "org.apache.lucene.index.DocValuesSkipper.docCount()" because "skipper" is null
Stack Trace:
java.lang.NullPointerException: Cannot invoke "org.apache.lucene.index.DocValuesSkipper.docCount()" because "skipper" is null
at __randomizedtesting.SeedInfo.seed([713F9A11B6BF65AF:B53FA0BE7CD10443]:0)
at org.apache.lucene.test_framework@10.0.0-SNAPSHOT/org.apache.lucene.tests.index.BaseDocValuesFormatTestCase.testSortedSetMergeAwayAllValues(BaseDocValuesFormatTestCase.java:2274)
at java.base/jdk.internal.reflect.DirectMethodHandleAccessor.invoke(DirectMethodHandleAccessor.java:103)
at java.base/java.lang.reflect.Method.invoke(Method.java:580)
at randomizedtesting.runner@2.8.1/com.carrotsearch.randomizedtesting.RandomizedRunner.invoke(RandomizedRunner.java:1758)
at randomizedtesting.runner@2.8.1/com.carrotsearch.randomizedtesting.RandomizedRunner$8.evaluate(RandomizedRunner.java:946)
at randomizedtesting.runner@2.8.1/com.carrotsearch.randomizedtesting.RandomizedRunner$9.evaluate(RandomizedRunner.java:982)
at randomizedtesting.runner@2.8.1/com.carrotsearch.randomizedtesting.RandomizedRunner$10.evaluate(RandomizedRunner.java:996)
at org.apache.lucene.test_framework@10.0.0-SNAPSHOT/org.apache.lucene.tests.util.TestRuleSetupTeardownChained$1.evaluate(TestRuleSetupTeardownChained.java:48)
at org.apache.lucene.test_framework@10.0.0-SNAPSHOT/org.apache.lucene.tests.util.AbstractBeforeAfterRule$1.evaluate(AbstractBeforeAfterRule.java:43)
at org.apache.lucene.test_framework@10.0.0-SNAPSHOT/org.apache.lucene.tests.util.TestRuleThreadAndTestName$1.evaluate(TestRuleThreadAndTestName.java:45)
at org.apache.lucene.test_framework@10.0.0-SNAPSHOT/org.apache.lucene.tests.util.TestRuleIgnoreAfterMaxFailures$1.evaluate(TestRuleIgnoreAfterMaxFailures.java:60)
at org.apache.lucene.test_framework@10.0.0-SNAPSHOT/org.apache.lucene.tests.util.TestRuleMarkFailure$1.evaluate(TestRuleMarkFailure.java:44)
at junit@4.13.1/org.junit.rules.RunRules.evaluate(RunRules.java:20)
at randomizedtesting.runner@2.8.1/com.carrotsearch.randomizedtesting.rules.StatementAdapter.evaluate(StatementAdapter.java:36)
at randomizedtesting.runner@2.8.1/com.carrotsearch.randomizedtesting.ThreadLeakControl$StatementRunner.run(ThreadLeakControl.java:390)
at randomizedtesting.runner@2.8.1/com.carrotsearch.randomizedtesting.ThreadLeakControl.forkTimeoutingTask(ThreadLeakControl.java:843)
at randomizedtesting.runner@2.8.1/com.carrotsearch.randomizedtesting.ThreadLeakControl$3.evaluate(ThreadLeakControl.java:490)
at randomizedtesting.runner@2.8.1/com.carrotsearch.randomizedtesting.RandomizedRunner.runSingleTest(RandomizedRunner.java:955)
at randomizedtesting.runner@2.8.1/com.carrotsearch.randomizedtesting.RandomizedRunner$5.evaluate(RandomizedRunner.java:840)
at randomizedtesting.runner@2.8.1/com.carrotsearch.randomizedtesting.RandomizedRunner$6.evaluate(RandomizedRunner.java:891)
at randomizedtesting.runner@2.8.1/com.carrotsearch.randomizedtesting.RandomizedRunner$7.evaluate(RandomizedRunner.java:902)
at org.apache.lucene.test_framework@10.0.0-SNAPSHOT/org.apache.lucene.tests.util.AbstractBeforeAfterRule$1.evaluate(AbstractBeforeAfterRule.java:43)
at randomizedtesting.runner@2.8.1/com.carrotsearch.randomizedtesting.rules.StatementAdapter.evaluate(StatementAdapter.java:36)
at org.apache.lucene.test_framework@10.0.0-SNAPSHOT/org.apache.lucene.tests.util.TestRuleStoreClassName$1.evaluate(TestRuleStoreClassName.java:38)
at randomizedtesting.runner@2.8.1/com.carrotsearch.randomizedtesting.rules.NoShadowingOrOverridesOnMethodsRule$1.evaluate(NoShadowingOrOverridesOnMethodsRule.java:40)
at randomizedtesting.runner@2.8.1/com.carrotsearch.randomizedtesting.rules.NoShadowingOrOverridesOnMethodsRule$1.evaluate(NoShadowingOrOverridesOnMethodsRule.java:40)
at randomizedtesting.runner@2.8.1/com.carrotsearch.randomizedtesting.rules.StatementAdapter.evaluate(StatementAdapter.java:36)
at randomizedtesting.runner@2.8.1/com.carrotsearch.randomizedtesting.rules.StatementAdapter.evaluate(StatementAdapter.java:36)
at org.apache.lucene.test_framework@10.0.0-SNAPSHOT/org.apache.lucene.tests.util.TestRuleAssertionsRequired$1.evaluate(TestRuleAssertionsRequired.java:53)
at org.apache.lucene.test_framework@10.0.0-SNAPSHOT/org.apache.lucene.tests.util.AbstractBeforeAfterRule$1.evaluate(AbstractBeforeAfterRule.java:43)
at org.apache.lucene.test_framework@10.0.0-SNAPSHOT/org.apache.lucene.tests.util.TestRuleMarkFailure$1.evaluate(TestRuleMarkFailure.java:44)
at org.apache.lucene.test_framework@10.0.0-SNAPSHOT/org.apache.lucene.tests.util.TestRuleIgnoreAfterMaxFailures$1.evaluate(TestRuleIgnoreAfterMaxFailures.java:60)
at org.apache.lucene.test_framework@10.0.0-SNAPSHOT/org.apache.lucene.tests.util.TestRuleIgnoreTestSuites$1.evaluate(TestRuleIgnoreTestSuites.java:47)
at junit@4.13.1/org.junit.rules.RunRules.evaluate(RunRules.java:20)
at randomizedtesting.runner@2.8.1/com.carrotsearch.randomizedtesting.rules.StatementAdapter.evaluate(StatementAdapter.java:36)
at randomizedtesting.runner@2.8.1/com.carrotsearch.randomizedtesting.ThreadLeakControl$StatementRunner.run(ThreadLeakControl.java:390)
at randomizedtesting.runner@2.8.1/com.carrotsearch.randomizedtesting.ThreadLeakControl.lambda$forkTimeoutingTask$0(ThreadLeakControl.java:850)
at java.base/java.lang.Thread.run(Thread.java:1583)
FAILED: org.apache.lucene.backward_codecs.lucene80.TestBestCompressionLucene80DocValuesFormat.testSortedDocValuesWithSkipperMedium
Error Message:
java.lang.NullPointerException: Cannot invoke "org.apache.lucene.index.DocValuesSkipper.maxDocID(int)" because "skipper" is null
Stack Trace:
java.lang.NullPointerException: Cannot invoke "org.apache.lucene.index.DocValuesSkipper.maxDocID(int)" because "skipper" is null
at __randomizedtesting.SeedInfo.seed([713F9A11B6BF65AF:C1B7ACD114D872BF]:0)
at org.apache.lucene.core@10.0.0-SNAPSHOT/org.apache.lucene.index.CheckIndex.checkDocValueSkipper(CheckIndex.java:3280)
at org.apache.lucene.core@10.0.0-SNAPSHOT/org.apache.lucene.index.CheckIndex.checkDocValues(CheckIndex.java:3740)
at org.apache.lucene.core@10.0.0-SNAPSHOT/org.apache.lucene.index.CheckIndex.testDocValues(CheckIndex.java:3242)
at org.apache.lucene.test_framework@10.0.0-SNAPSHOT/org.apache.lucene.tests.index.BaseDocValuesFormatTestCase.assertDocValuesWithSkipper(BaseDocValuesFormatTestCase.java:4196)
at org.apache.lucene.test_framework@10.0.0-SNAPSHOT/org.apache.lucene.tests.index.BaseDocValuesFormatTestCase.doTestSortedDocValuesWithSkipper(BaseDocValuesFormatTestCase.java:4029)
at org.apache.lucene.test_framework@10.0.0-SNAPSHOT/org.apache.lucene.tests.index.BaseDocValuesFormatTestCase.testSortedDocValuesWithSkipperMedium(BaseDocValuesFormatTestCase.java:4020)
at java.base/jdk.internal.reflect.DirectMethodHandleAccessor.invoke(DirectMethodHandleAccessor.java:103)
at java.base/java.lang.reflect.Method.invoke(Method.java:580)
at randomizedtesting.runner@2.8.1/com.carrotsearch.randomizedtesting.RandomizedRunner.invoke(RandomizedRunner.java:1758)
at randomizedtesting.runner@2.8.1/com.carrotsearch.randomizedtesting.RandomizedRunner$8.evaluate(RandomizedRunner.java:946)
at randomizedtesting.runner@2.8.1/com.carrotsearch.randomizedtesting.RandomizedRunner$9.evaluate(RandomizedRunner.java:982)
at randomizedtesting.runner@2.8.1/com.carrotsearch.randomizedtesting.RandomizedRunner$10.evaluate(RandomizedRunner.java:996)
at org.apache.lucene.test_framework@10.0.0-SNAPSHOT/org.apache.lucene.tests.util.TestRuleSetupTeardownChained$1.evaluate(TestRuleSetupTeardownChained.java:48)
at org.apache.lucene.test_framework@10.0.0-SNAPSHOT/org.apache.lucene.tests.util.AbstractBeforeAfterRule$1.evaluate(AbstractBeforeAfterRule.java:43)
at org.apache.lucene.test_framework@10.0.0-SNAPSHOT/org.apache.lucene.tests.util.TestRuleThreadAndTestName$1.evaluate(TestRuleThreadAndTestName.java:45)
at org.apache.lucene.test_framework@10.0.0-SNAPSHOT/org.apache.lucene.tests.util.TestRuleIgnoreAfterMaxFailures$1.evaluate(TestRuleIgnoreAfterMaxFailures.java:60)
at org.apache.lucene.test_framework@10.0.0-SNAPSHOT/org.apache.lucene.tests.util.TestRuleMarkFailure$1.evaluate(TestRuleMarkFailure.java:44)
at junit@4.13.1/org.junit.rules.RunRules.evaluate(RunRules.java:20)
at randomizedtesting.runner@2.8.1/com.carrotsearch.randomizedtesting.rules.StatementAdapter.evaluate(StatementAdapter.java:36)
at randomizedtesting.runner@2.8.1/com.carrotsearch.randomizedtesting.ThreadLeakControl$StatementRunner.run(ThreadLeakControl.java:390)
at randomizedtesting.runner@2.8.1/com.carrotsearch.randomizedtesting.ThreadLeakControl.forkTimeoutingTask(ThreadLeakControl.java:843)
at randomizedtesting.runner@2.8.1/com.carrotsearch.randomizedtesting.ThreadLeakControl$3.evaluate(ThreadLeakControl.java:490)
at randomizedtesting.runner@2.8.1/com.carrotsearch.randomizedtesting.RandomizedRunner.runSingleTest(RandomizedRunner.java:955)
at randomizedtesting.runner@2.8.1/com.carrotsearch.randomizedtesting.RandomizedRunner$5.evaluate(RandomizedRunner.java:840)
at randomizedtesting.runner@2.8.1/com.carrotsearch.randomizedtesting.RandomizedRunner$6.evaluate(RandomizedRunner.java:891)
at randomizedtesting.runner@2.8.1/com.carrotsearch.randomizedtesting.RandomizedRunner$7.evaluate(RandomizedRunner.java:902)
at org.apache.lucene.test_framework@10.0.0-SNAPSHOT/org.apache.lucene.tests.util.AbstractBeforeAfterRule$1.evaluate(AbstractBeforeAfterRule.java:43)
at randomizedtesting.runner@2.8.1/com.carrotsearch.randomizedtesting.rules.StatementAdapter.evaluate(StatementAdapter.java:36)
at org.apache.lucene.test_framework@10.0.0-SNAPSHOT/org.apache.lucene.tests.util.TestRuleStoreClassName$1.evaluate(TestRuleStoreClassName.java:38)
at randomizedtesting.runner@2.8.1/com.carrotsearch.randomizedtesting.rules.NoShadowingOrOverridesOnMethodsRule$1.evaluate(NoShadowingOrOverridesOnMethodsRule.java:40)
at randomizedtesting.runner@2.8.1/com.carrotsearch.randomizedtesting.rules.NoShadowingOrOverridesOnMethodsRule$1.evaluate(NoShadowingOrOverridesOnMethodsRule.java:40)
at randomizedtesting.runner@2.8.1/com.carrotsearch.randomizedtesting.rules.StatementAdapter.evaluate(StatementAdapter.java:36)
at randomizedtesting.runner@2.8.1/com.carrotsearch.randomizedtesting.rules.StatementAdapter.evaluate(StatementAdapter.java:36)
at org.apache.lucene.test_framework@10.0.0-SNAPSHOT/org.apache.lucene.tests.util.TestRuleAssertionsRequired$1.evaluate(TestRuleAssertionsRequired.java:53)
at org.apache.lucene.test_framework@10.0.0-SNAPSHOT/org.apache.lucene.tests.util.AbstractBeforeAfterRule$1.evaluate(AbstractBeforeAfterRule.java:43)
at org.apache.lucene.test_framework@10.0.0-SNAPSHOT/org.apache.lucene.tests.util.TestRuleMarkFailure$1.evaluate(TestRuleMarkFailure.java:44)
at org.apache.lucene.test_framework@10.0.0-SNAPSHOT/org.apache.lucene.tests.util.TestRuleIgnoreAfterMaxFailures$1.evaluate(TestRuleIgnoreAfterMaxFailures.java:60)
at org.apache.lucene.test_framework@10.0.0-SNAPSHOT/org.apache.lucene.tests.util.TestRuleIgnoreTestSuites$1.evaluate(TestRuleIgnoreTestSuites.java:47)
at junit@4.13.1/org.junit.rules.RunRules.evaluate(RunRules.java:20)
at randomizedtesting.runner@2.8.1/com.carrotsearch.randomizedtesting.rules.StatementAdapter.evaluate(StatementAdapter.java:36)
at randomizedtesting.runner@2.8.1/com.carrotsearch.randomizedtesting.ThreadLeakControl$StatementRunner.run(ThreadLeakControl.java:390)
at randomizedtesting.runner@2.8.1/com.carrotsearch.randomizedtesting.ThreadLeakControl.lambda$forkTimeoutingTask$0(ThreadLeakControl.java:850)
at java.base/java.lang.Thread.run(Thread.java:1583)
FAILED: org.apache.lucene.backward_codecs.lucene80.TestBestCompressionLucene80DocValuesFormat.testSortedNumericDocValuesWithSkipperSmall
Error Message:
java.lang.NullPointerException: Cannot invoke "org.apache.lucene.index.DocValuesSkipper.maxDocID(int)" because "skipper" is null
Stack Trace:
java.lang.NullPointerException: Cannot invoke "org.apache.lucene.index.DocValuesSkipper.maxDocID(int)" because "skipper" is null
at __randomizedtesting.SeedInfo.seed([713F9A11B6BF65AF:CA9E1E3BF5AE1614]:0)
at org.apache.lucene.core@10.0.0-SNAPSHOT/org.apache.lucene.index.CheckIndex.checkDocValueSkipper(CheckIndex.java:3280)
at org.apache.lucene.core@10.0.0-SNAPSHOT/org.apache.lucene.index.CheckIndex.checkDocValues(CheckIndex.java:3740)
at org.apache.lucene.core@10.0.0-SNAPSHOT/org.apache.lucene.index.CheckIndex.testDocValues(CheckIndex.java:3242)
at org.apache.lucene.test_framework@10.0.0-SNAPSHOT/org.apache.lucene.tests.index.BaseDocValuesFormatTestCase.assertDocValuesWithSkipper(BaseDocValuesFormatTestCase.java:4196)
at org.apache.lucene.test_framework@10.0.0-SNAPSHOT/org.apache.lucene.tests.index.BaseDocValuesFormatTestCase.doTestSortedNumericDocValuesWithSkipper(BaseDocValuesFormatTestCase.java:3945)
at org.apache.lucene.test_framework@10.0.0-SNAPSHOT/org.apache.lucene.tests.index.BaseDocValuesFormatTestCase.testSortedNumericDocValuesWithSkipperSmall(BaseDocValuesFormatTestCase.java:3932)
at java.base/jdk.internal.reflect.DirectMethodHandleAccessor.invoke(DirectMethodHandleAccessor.java:103)
at java.base/java.lang.reflect.Method.invoke(Method.java:580)
at randomizedtesting.runner@2.8.1/com.carrotsearch.randomizedtesting.RandomizedRunner.invoke(RandomizedRunner.java:1758)
at randomizedtesting.runner@2.8.1/com.carrotsearch.randomizedtesting.RandomizedRunner$8.evaluate(RandomizedRunner.java:946)
at randomizedtesting.runner@2.8.1/com.carrotsearch.randomizedtesting.RandomizedRunner$9.evaluate(RandomizedRunner.java:982)
at randomizedtesting.runner@2.8.1/com.carrotsearch.randomizedtesting.RandomizedRunner$10.evaluate(RandomizedRunner.java:996)
at org.apache.lucene.test_framework@10.0.0-SNAPSHOT/org.apache.lucene.tests.util.TestRuleSetupTeardownChained$1.evaluate(TestRuleSetupTeardownChained.java:48)
at org.apache.lucene.test_framework@10.0.0-SNAPSHOT/org.apache.lucene.tests.util.AbstractBeforeAfterRule$1.evaluate(AbstractBeforeAfterRule.java:43)
at org.apache.lucene.test_framework@10.0.0-SNAPSHOT/org.apache.lucene.tests.util.TestRuleThreadAndTestName$1.evaluate(TestRuleThreadAndTestName.java:45)
at org.apache.lucene.test_framework@10.0.0-SNAPSHOT/org.apache.lucene.tests.util.TestRuleIgnoreAfterMaxFailures$1.evaluate(TestRuleIgnoreAfterMaxFailures.java:60)
at org.apache.lucene.test_framework@10.0.0-SNAPSHOT/org.apache.lucene.tests.util.TestRuleMarkFailure$1.evaluate(TestRuleMarkFailure.java:44)
at junit@4.13.1/org.junit.rules.RunRules.evaluate(RunRules.java:20)
at randomizedtesting.runner@2.8.1/com.carrotsearch.randomizedtesting.rules.StatementAdapter.evaluate(StatementAdapter.java:36)
at randomizedtesting.runner@2.8.1/com.carrotsearch.randomizedtesting.ThreadLeakControl$StatementRunner.run(ThreadLeakControl.java:390)
at randomizedtesting.runner@2.8.1/com.carrotsearch.randomizedtesting.ThreadLeakControl.forkTimeoutingTask(ThreadLeakControl.java:843)
at randomizedtesting.runner@2.8.1/com.carrotsearch.randomizedtesting.ThreadLeakControl$3.evaluate(ThreadLeakControl.java:490)
at randomizedtesting.runner@2.8.1/com.carrotsearch.randomizedtesting.RandomizedRunner.runSingleTest(RandomizedRunner.java:955)
at randomizedtesting.runner@2.8.1/com.carrotsearch.randomizedtesting.RandomizedRunner$5.evaluate(RandomizedRunner.java:840)
at randomizedtesting.runner@2.8.1/com.carrotsearch.randomizedtesting.RandomizedRunner$6.evaluate(RandomizedRunner.java:891)
at randomizedtesting.runner@2.8.1/com.carrotsearch.randomizedtesting.RandomizedRunner$7.evaluate(RandomizedRunner.java:902)
at org.apache.lucene.test_framework@10.0.0-SNAPSHOT/org.apache.lucene.tests.util.AbstractBeforeAfterRule$1.evaluate(AbstractBeforeAfterRule.java:43)
at randomizedtesting.runner@2.8.1/com.carrotsearch.randomizedtesting.rules.StatementAdapter.evaluate(StatementAdapter.java:36)
at org.apache.lucene.test_framework@10.0.0-SNAPSHOT/org.apache.lucene.tests.util.TestRuleStoreClassName$1.evaluate(TestRuleStoreClassName.java:38)
at randomizedtesting.runner@2.8.1/com.carrotsearch.randomizedtesting.rules.NoShadowingOrOverridesOnMethodsRule$1.evaluate(NoShadowingOrOverridesOnMethodsRule.java:40)
at randomizedtesting.runner@2.8.1/com.carrotsearch.randomizedtesting.rules.NoShadowingOrOverridesOnMethodsRule$1.evaluate(NoShadowingOrOverridesOnMethodsRule.java:40)
at randomizedtesting.runner@2.8.1/com.carrotsearch.randomizedtesting.rules.StatementAdapter.evaluate(StatementAdapter.java:36)
at randomizedtesting.runner@2.8.1/com.carrotsearch.randomizedtesting.rules.StatementAdapter.evaluate(StatementAdapter.java:36)
at org.apache.lucene.test_framework@10.0.0-SNAPSHOT/org.apache.lucene.tests.util.TestRuleAssertionsRequired$1.evaluate(TestRuleAssertionsRequired.java:53)
at org.apache.lucene.test_framework@10.0.0-SNAPSHOT/org.apache.lucene.tests.util.AbstractBeforeAfterRule$1.evaluate(AbstractBeforeAfterRule.java:43)
at org.apache.lucene.test_framework@10.0.0-SNAPSHOT/org.apache.lucene.tests.util.TestRuleMarkFailure$1.evaluate(TestRuleMarkFailure.java:44)
at org.apache.lucene.test_framework@10.0.0-SNAPSHOT/org.apache.lucene.tests.util.TestRuleIgnoreAfterMaxFailures$1.evaluate(TestRuleIgnoreAfterMaxFailures.java:60)
at org.apache.lucene.test_framework@10.0.0-SNAPSHOT/org.apache.lucene.tests.util.TestRuleIgnoreTestSuites$1.evaluate(TestRuleIgnoreTestSuites.java:47)
at junit@4.13.1/org.junit.rules.RunRules.evaluate(RunRules.java:20)
at randomizedtesting.runner@2.8.1/com.carrotsearch.randomizedtesting.rules.StatementAdapter.evaluate(StatementAdapter.java:36)
at randomizedtesting.runner@2.8.1/com.carrotsearch.randomizedtesting.ThreadLeakControl$StatementRunner.run(ThreadLeakControl.java:390)
at randomizedtesting.runner@2.8.1/com.carrotsearch.randomizedtesting.ThreadLeakControl.lambda$forkTimeoutingTask$0(ThreadLeakControl.java:850)
at java.base/java.lang.Thread.run(Thread.java:1583)
FAILED: org.apache.lucene.backward_codecs.lucene80.TestBestCompressionLucene80DocValuesFormat.testSortedNumericDocValuesWithSkipperMedium
Error Message:
java.lang.NullPointerException: Cannot invoke "org.apache.lucene.index.DocValuesSkipper.maxDocID(int)" because "skipper" is null
Stack Trace:
java.lang.NullPointerException: Cannot invoke "org.apache.lucene.index.DocValuesSkipper.maxDocID(int)" because "skipper" is null
at __randomizedtesting.SeedInfo.seed([713F9A11B6BF65AF:3FC4D8F23773CEAF]:0)
at org.apache.lucene.core@10.0.0-SNAPSHOT/org.apache.lucene.index.CheckIndex.checkDocValueSkipper(CheckIndex.java:3280)
at org.apache.lucene.core@10.0.0-SNAPSHOT/org.apache.lucene.index.CheckIndex.checkDocValues(CheckIndex.java:3740)
at org.apache.lucene.core@10.0.0-SNAPSHOT/org.apache.lucene.index.CheckIndex.testDocValues(CheckIndex.java:3242)
at org.apache.lucene.test_framework@10.0.0-SNAPSHOT/org.apache.lucene.tests.index.BaseDocValuesFormatTestCase.assertDocValuesWithSkipper(BaseDocValuesFormatTestCase.java:4196)
at org.apache.lucene.test_framework@10.0.0-SNAPSHOT/org.apache.lucene.tests.index.BaseDocValuesFormatTestCase.doTestSortedNumericDocValuesWithSkipper(BaseDocValuesFormatTestCase.java:3945)
at org.apache.lucene.test_framework@10.0.0-SNAPSHOT/org.apache.lucene.tests.index.BaseDocValuesFormatTestCase.testSortedNumericDocValuesWithSkipperMedium(BaseDocValuesFormatTestCase.java:3936)
at java.base/jdk.internal.reflect.DirectMethodHandleAccessor.invoke(DirectMethodHandleAccessor.java:103)
at java.base/java.lang.reflect.Method.invoke(Method.java:580)
at randomizedtesting.runner@2.8.1/com.carrotsearch.randomizedtesting.RandomizedRunner.invoke(RandomizedRunner.java:1758)
at randomizedtesting.runner@2.8.1/com.carrotsearch.randomizedtesting.RandomizedRunner$8.evaluate(RandomizedRunner.java:946)
at randomizedtesting.runner@2.8.1/com.carrotsearch.randomizedtesting.RandomizedRunner$9.evaluate(RandomizedRunner.java:982)
at randomizedtesting.runner@2.8.1/com.carrotsearch.randomizedtesting.RandomizedRunner$10.evaluate(RandomizedRunner.java:996)
at org.apache.lucene.test_framework@10.0.0-SNAPSHOT/org.apache.lucene.tests.util.TestRuleSetupTeardownChained$1.evaluate(TestRuleSetupTeardownChained.java:48)
at org.apache.lucene.test_framework@10.0.0-SNAPSHOT/org.apache.lucene.tests.util.AbstractBeforeAfterRule$1.evaluate(AbstractBeforeAfterRule.java:43)
at org.apache.lucene.test_framework@10.0.0-SNAPSHOT/org.apache.lucene.tests.util.TestRuleThreadAndTestName$1.evaluate(TestRuleThreadAndTestName.java:45)
at org.apache.lucene.test_framework@10.0.0-SNAPSHOT/org.apache.lucene.tests.util.TestRuleIgnoreAfterMaxFailures$1.evaluate(TestRuleIgnoreAfterMaxFailures.java:60)
at org.apache.lucene.test_framework@10.0.0-SNAPSHOT/org.apache.lucene.tests.util.TestRuleMarkFailure$1.evaluate(TestRuleMarkFailure.java:44)
at junit@4.13.1/org.junit.rules.RunRules.evaluate(RunRules.java:20)
at randomizedtesting.runner@2.8.1/com.carrotsearch.randomizedtesting.rules.StatementAdapter.evaluate(StatementAdapter.java:36)
at randomizedtesting.runner@2.8.1/com.carrotsearch.randomizedtesting.ThreadLeakControl$StatementRunner.run(ThreadLeakControl.java:390)
at randomizedtesting.runner@2.8.1/com.carrotsearch.randomizedtesting.ThreadLeakControl.forkTimeoutingTask(ThreadLeakControl.java:843)
at randomizedtesting.runner@2.8.1/com.carrotsearch.randomizedtesting.ThreadLeakControl$3.evaluate(ThreadLeakControl.java:490)
at randomizedtesting.runner@2.8.1/com.carrotsearch.randomizedtesting.RandomizedRunner.runSingleTest(RandomizedRunner.java:955)
at randomizedtesting.runner@2.8.1/com.carrotsearch.randomizedtesting.RandomizedRunner$5.evaluate(RandomizedRunner.java:840)
at randomizedtesting.runner@2.8.1/com.carrotsearch.randomizedtesting.RandomizedRunner$6.evaluate(RandomizedRunner.java:891)
at randomizedtesting.runner@2.8.1/com.carrotsearch.randomizedtesting.RandomizedRunner$7.evaluate(RandomizedRunner.java:902)
at org.apache.lucene.test_framework@10.0.0-SNAPSHOT/org.apache.lucene.tests.util.AbstractBeforeAfterRule$1.evaluate(AbstractBeforeAfterRule.java:43)
at randomizedtesting.runner@2.8.1/com.carrotsearch.randomizedtesting.rules.StatementAdapter.evaluate(StatementAdapter.java:36)
at org.apache.lucene.test_framework@10.0.0-SNAPSHOT/org.apache.lucene.tests.util.TestRuleStoreClassName$1.evaluate(TestRuleStoreClassName.java:38)
at randomizedtesting.runner@2.8.1/com.carrotsearch.randomizedtesting.rules.NoShadowingOrOverridesOnMethodsRule$1.evaluate(NoShadowingOrOverridesOnMethodsRule.java:40)
at randomizedtesting.runner@2.8.1/com.carrotsearch.randomizedtesting.rules.NoShadowingOrOverridesOnMethodsRule$1.evaluate(NoShadowingOrOverridesOnMethodsRule.java:40)
at randomizedtesting.runner@2.8.1/com.carrotsearch.randomizedtesting.rules.StatementAdapter.evaluate(StatementAdapter.java:36)
at randomizedtesting.runner@2.8.1/com.carrotsearch.randomizedtesting.rules.StatementAdapter.evaluate(StatementAdapter.java:36)
at org.apache.lucene.test_framework@10.0.0-SNAPSHOT/org.apache.lucene.tests.util.TestRuleAssertionsRequired$1.evaluate(TestRuleAssertionsRequired.java:53)
at org.apache.lucene.test_framework@10.0.0-SNAPSHOT/org.apache.lucene.tests.util.AbstractBeforeAfterRule$1.evaluate(AbstractBeforeAfterRule.java:43)
at org.apache.lucene.test_framework@10.0.0-SNAPSHOT/org.apache.lucene.tests.util.TestRuleMarkFailure$1.evaluate(TestRuleMarkFailure.java:44)
at org.apache.lucene.test_framework@10.0.0-SNAPSHOT/org.apache.lucene.tests.util.TestRuleIgnoreAfterMaxFailures$1.evaluate(TestRuleIgnoreAfterMaxFailures.java:60)
at org.apache.lucene.test_framework@10.0.0-SNAPSHOT/org.apache.lucene.tests.util.TestRuleIgnoreTestSuites$1.evaluate(TestRuleIgnoreTestSuites.java:47)
at junit@4.13.1/org.junit.rules.RunRules.evaluate(RunRules.java:20)
at randomizedtesting.runner@2.8.1/com.carrotsearch.randomizedtesting.rules.StatementAdapter.evaluate(StatementAdapter.java:36)
at randomizedtesting.runner@2.8.1/com.carrotsearch.randomizedtesting.ThreadLeakControl$StatementRunner.run(ThreadLeakControl.java:390)
at randomizedtesting.runner@2.8.1/com.carrotsearch.randomizedtesting.ThreadLeakControl.lambda$forkTimeoutingTask$0(ThreadLeakControl.java:850)
at java.base/java.lang.Thread.run(Thread.java:1583)
FAILED: org.apache.lucene.backward_codecs.lucene80.TestBestCompressionLucene80DocValuesFormat.testSortedSetDocValuesWithSkipperSmall
Error Message:
java.lang.NullPointerException: Cannot invoke "org.apache.lucene.index.DocValuesSkipper.maxDocID(int)" because "skipper" is null
Stack Trace:
java.lang.NullPointerException: Cannot invoke "org.apache.lucene.index.DocValuesSkipper.maxDocID(int)" because "skipper" is null
at __randomizedtesting.SeedInfo.seed([713F9A11B6BF65AF:DC91A8C3C741F339]:0)
at org.apache.lucene.core@10.0.0-SNAPSHOT/org.apache.lucene.index.CheckIndex.checkDocValueSkipper(CheckIndex.java:3280)
at org.apache.lucene.core@10.0.0-SNAPSHOT/org.apache.lucene.index.CheckIndex.checkDocValues(CheckIndex.java:3740)
at org.apache.lucene.core@10.0.0-SNAPSHOT/org.apache.lucene.index.CheckIndex.testDocValues(CheckIndex.java:3242)
at org.apache.lucene.test_framework@10.0.0-SNAPSHOT/org.apache.lucene.tests.index.BaseDocValuesFormatTestCase.assertDocValuesWithSkipper(BaseDocValuesFormatTestCase.java:4196)
at org.apache.lucene.test_framework@10.0.0-SNAPSHOT/org.apache.lucene.tests.index.BaseDocValuesFormatTestCase.doTestSortedSetDocValuesWithSkipper(BaseDocValuesFormatTestCase.java:4090)
at org.apache.lucene.test_framework@10.0.0-SNAPSHOT/org.apache.lucene.tests.index.BaseDocValuesFormatTestCase.testSortedSetDocValuesWithSkipperSmall(BaseDocValuesFormatTestCase.java:4077)
at java.base/jdk.internal.reflect.DirectMethodHandleAccessor.invoke(DirectMethodHandleAccessor.java:103)
at java.base/java.lang.reflect.Method.invoke(Method.java:580)
at randomizedtesting.runner@2.8.1/com.carrotsearch.randomizedtesting.RandomizedRunner.invoke(RandomizedRunner.java:1758)
at randomizedtesting.runner@2.8.1/com.carrotsearch.randomizedtesting.RandomizedRunner$8.evaluate(RandomizedRunner.java:946)
at randomizedtesting.runner@2.8.1/com.carrotsearch.randomizedtesting.RandomizedRunner$9.evaluate(RandomizedRunner.java:982)
at randomizedtesting.runner@2.8.1/com.carrotsearch.randomizedtesting.RandomizedRunner$10.evaluate(RandomizedRunner.java:996)
at org.apache.lucene.test_framework@10.0.0-SNAPSHOT/org.apache.lucene.tests.util.TestRuleSetupTeardownChained$1.evaluate(TestRuleSetupTeardownChained.java:48)
at org.apache.lucene.test_framework@10.0.0-SNAPSHOT/org.apache.lucene.tests.util.AbstractBeforeAfterRule$1.evaluate(AbstractBeforeAfterRule.java:43)
at org.apache.lucene.test_framework@10.0.0-SNAPSHOT/org.apache.lucene.tests.util.TestRuleThreadAndTestName$1.evaluate(TestRuleThreadAndTestName.java:45)
at org.apache.lucene.test_framework@10.0.0-SNAPSHOT/org.apache.lucene.tests.util.TestRuleIgnoreAfterMaxFailures$1.evaluate(TestRuleIgnoreAfterMaxFailures.java:60)
at org.apache.lucene.test_framework@10.0.0-SNAPSHOT/org.apache.lucene.tests.util.TestRuleMarkFailure$1.evaluate(TestRuleMarkFailure.java:44)
at junit@4.13.1/org.junit.rules.RunRules.evaluate(RunRules.java:20)
at randomizedtesting.runner@2.8.1/com.carrotsearch.randomizedtesting.rules.StatementAdapter.evaluate(StatementAdapter.java:36)
at randomizedtesting.runner@2.8.1/com.carrotsearch.randomizedtesting.ThreadLeakControl$StatementRunner.run(ThreadLeakControl.java:390)
at randomizedtesting.runner@2.8.1/com.carrotsearch.randomizedtesting.ThreadLeakControl.forkTimeoutingTask(ThreadLeakControl.java:843)
at randomizedtesting.runner@2.8.1/com.carrotsearch.randomizedtesting.ThreadLeakControl$3.evaluate(ThreadLeakControl.java:490)
at randomizedtesting.runner@2.8.1/com.carrotsearch.randomizedtesting.RandomizedRunner.runSingleTest(RandomizedRunner.java:955)
at randomizedtesting.runner@2.8.1/com.carrotsearch.randomizedtesting.RandomizedRunner$5.evaluate(RandomizedRunner.java:840)
at randomizedtesting.runner@2.8.1/com.carrotsearch.randomizedtesting.RandomizedRunner$6.evaluate(RandomizedRunner.java:891)
at randomizedtesting.runner@2.8.1/com.carrotsearch.randomizedtesting.RandomizedRunner$7.evaluate(RandomizedRunner.java:902)
at org.apache.lucene.test_framework@10.0.0-SNAPSHOT/org.apache.lucene.tests.util.AbstractBeforeAfterRule$1.evaluate(AbstractBeforeAfterRule.java:43)
at randomizedtesting.runner@2.8.1/com.carrotsearch.randomizedtesting.rules.StatementAdapter.evaluate(StatementAdapter.java:36)
at org.apache.lucene.test_framework@10.0.0-SNAPSHOT/org.apache.lucene.tests.util.TestRuleStoreClassName$1.evaluate(TestRuleStoreClassName.java:38)
at randomizedtesting.runner@2.8.1/com.carrotsearch.randomizedtesting.rules.NoShadowingOrOverridesOnMethodsRule$1.evaluate(NoShadowingOrOverridesOnMethodsRule.java:40)
at randomizedtesting.runner@2.8.1/com.carrotsearch.randomizedtesting.rules.NoShadowingOrOverridesOnMethodsRule$1.evaluate(NoShadowingOrOverridesOnMethodsRule.java:40)
at randomizedtesting.runner@2.8.1/com.carrotsearch.randomizedtesting.rules.StatementAdapter.evaluate(StatementAdapter.java:36)
at randomizedtesting.runner@2.8.1/com.carrotsearch.randomizedtesting.rules.StatementAdapter.evaluate(StatementAdapter.java:36)
at org.apache.lucene.test_framework@10.0.0-SNAPSHOT/org.apache.lucene.tests.util.TestRuleAssertionsRequired$1.evaluate(TestRuleAssertionsRequired.java:53)
at org.apache.lucene.test_framework@10.0.0-SNAPSHOT/org.apache.lucene.tests.util.AbstractBeforeAfterRule$1.evaluate(AbstractBeforeAfterRule.java:43)
at org.apache.lucene.test_framework@10.0.0-SNAPSHOT/org.apache.lucene.tests.util.TestRuleMarkFailure$1.evaluate(TestRuleMarkFailure.java:44)
at org.apache.lucene.test_framework@10.0.0-SNAPSHOT/org.apache.lucene.tests.util.TestRuleIgnoreAfterMaxFailures$1.evaluate(TestRuleIgnoreAfterMaxFailures.java:60)
at org.apache.lucene.test_framework@10.0.0-SNAPSHOT/org.apache.lucene.tests.util.TestRuleIgnoreTestSuites$1.evaluate(TestRuleIgnoreTestSuites.java:47)
at junit@4.13.1/org.junit.rules.RunRules.evaluate(RunRules.java:20)
at randomizedtesting.runner@2.8.1/com.carrotsearch.randomizedtesting.rules.StatementAdapter.evaluate(StatementAdapter.java:36)
at randomizedtesting.runner@2.8.1/com.carrotsearch.randomizedtesting.ThreadLeakControl$StatementRunner.run(ThreadLeakControl.java:390)
at randomizedtesting.runner@2.8.1/com.carrotsearch.randomizedtesting.ThreadLeakControl.lambda$forkTimeoutingTask$0(ThreadLeakControl.java:850)
at java.base/java.lang.Thread.run(Thread.java:1583)
FAILED: org.apache.lucene.backward_codecs.lucene80.TestBestCompressionLucene80DocValuesFormat.testSortedMergeAwayAllValuesLargeSegment
Error Message:
java.lang.NullPointerException: Cannot invoke "org.apache.lucene.index.DocValuesSkipper.docCount()" because "skipper" is null
Stack Trace:
java.lang.NullPointerException: Cannot invoke "org.apache.lucene.index.DocValuesSkipper.docCount()" because "skipper" is null
at __randomizedtesting.SeedInfo.seed([713F9A11B6BF65AF:52C1BF795DFD65F0]:0)
at org.apache.lucene.test_framework@10.0.0-SNAPSHOT/org.apache.lucene.tests.index.BaseDocValuesFormatTestCase.testSortedMergeAwayAllValuesLargeSegment(BaseDocValuesFormatTestCase.java:3558)
at java.base/jdk.internal.reflect.DirectMethodHandleAccessor.invoke(DirectMethodHandleAccessor.java:103)
at java.base/java.lang.reflect.Method.invoke(Method.java:580)
at randomizedtesting.runner@2.8.1/com.carrotsearch.randomizedtesting.RandomizedRunner.invoke(RandomizedRunner.java:1758)
at randomizedtesting.runner@2.8.1/com.carrotsearch.randomizedtesting.RandomizedRunner$8.evaluate(RandomizedRunner.java:946)
at randomizedtesting.runner@2.8.1/com.carrotsearch.randomizedtesting.RandomizedRunner$9.evaluate(RandomizedRunner.java:982)
at randomizedtesting.runner@2.8.1/com.carrotsearch.randomizedtesting.RandomizedRunner$10.evaluate(RandomizedRunner.java:996)
at org.apache.lucene.test_framework@10.0.0-SNAPSHOT/org.apache.lucene.tests.util.TestRuleSetupTeardownChained$1.evaluate(TestRuleSetupTeardownChained.java:48)
at org.apache.lucene.test_framework@10.0.0-SNAPSHOT/org.apache.lucene.tests.util.AbstractBeforeAfterRule$1.evaluate(AbstractBeforeAfterRule.java:43)
at org.apache.lucene.test_framework@10.0.0-SNAPSHOT/org.apache.lucene.tests.util.TestRuleThreadAndTestName$1.evaluate(TestRuleThreadAndTestName.java:45)
at org.apache.lucene.test_framework@10.0.0-SNAPSHOT/org.apache.lucene.tests.util.TestRuleIgnoreAfterMaxFailures$1.evaluate(TestRuleIgnoreAfterMaxFailures.java:60)
at org.apache.lucene.test_framework@10.0.0-SNAPSHOT/org.apache.lucene.tests.util.TestRuleMarkFailure$1.evaluate(TestRuleMarkFailure.java:44)
at junit@4.13.1/org.junit.rules.RunRules.evaluate(RunRules.java:20)
at randomizedtesting.runner@2.8.1/com.carrotsearch.randomizedtesting.rules.StatementAdapter.evaluate(StatementAdapter.java:36)
at randomizedtesting.runner@2.8.1/com.carrotsearch.randomizedtesting.ThreadLeakControl$StatementRunner.run(ThreadLeakControl.java:390)
at randomizedtesting.runner@2.8.1/com.carrotsearch.randomizedtesting.ThreadLeakControl.forkTimeoutingTask(ThreadLeakControl.java:843)
at randomizedtesting.runner@2.8.1/com.carrotsearch.randomizedtesting.ThreadLeakControl$3.evaluate(ThreadLeakControl.java:490)
at randomizedtesting.runner@2.8.1/com.carrotsearch.randomizedtesting.RandomizedRunner.runSingleTest(RandomizedRunner.java:955)
at randomizedtesting.runner@2.8.1/com.carrotsearch.randomizedtesting.RandomizedRunner$5.evaluate(RandomizedRunner.java:840)
at randomizedtesting.runner@2.8.1/com.carrotsearch.randomizedtesting.RandomizedRunner$6.evaluate(RandomizedRunner.java:891)
at randomizedtesting.runner@2.8.1/com.carrotsearch.randomizedtesting.RandomizedRunner$7.evaluate(RandomizedRunner.java:902)
at org.apache.lucene.test_framework@10.0.0-SNAPSHOT/org.apache.lucene.tests.util.AbstractBeforeAfterRule$1.evaluate(AbstractBeforeAfterRule.java:43)
at randomizedtesting.runner@2.8.1/com.carrotsearch.randomizedtesting.rules.StatementAdapter.evaluate(StatementAdapter.java:36)
at org.apache.lucene.test_framework@10.0.0-SNAPSHOT/org.apache.lucene.tests.util.TestRuleStoreClassName$1.evaluate(TestRuleStoreClassName.java:38)
at randomizedtesting.runner@2.8.1/com.carrotsearch.randomizedtesting.rules.NoShadowingOrOverridesOnMethodsRule$1.evaluate(NoShadowingOrOverridesOnMethodsRule.java:40)
at randomizedtesting.runner@2.8.1/com.carrotsearch.randomizedtesting.rules.NoShadowingOrOverridesOnMethodsRule$1.evaluate(NoShadowingOrOverridesOnMethodsRule.java:40)
at randomizedtesting.runner@2.8.1/com.carrotsearch.randomizedtesting.rules.StatementAdapter.evaluate(StatementAdapter.java:36)
at randomizedtesting.runner@2.8.1/com.carrotsearch.randomizedtesting.rules.StatementAdapter.evaluate(StatementAdapter.java:36)
at org.apache.lucene.test_framework@10.0.0-SNAPSHOT/org.apache.lucene.tests.util.TestRuleAssertionsRequired$1.evaluate(TestRuleAssertionsRequired.java:53)
at org.apache.lucene.test_framework@10.0.0-SNAPSHOT/org.apache.lucene.tests.util.AbstractBeforeAfterRule$1.evaluate(AbstractBeforeAfterRule.java:43)
at org.apache.lucene.test_framework@10.0.0-SNAPSHOT/org.apache.lucene.tests.util.TestRuleMarkFailure$1.evaluate(TestRuleMarkFailure.java:44)
at org.apache.lucene.test_framework@10.0.0-SNAPSHOT/org.apache.lucene.tests.util.TestRuleIgnoreAfterMaxFailures$1.evaluate(TestRuleIgnoreAfterMaxFailures.java:60)
at org.apache.lucene.test_framework@10.0.0-SNAPSHOT/org.apache.lucene.tests.util.TestRuleIgnoreTestSuites$1.evaluate(TestRuleIgnoreTestSuites.java:47)
at junit@4.13.1/org.junit.rules.RunRules.evaluate(RunRules.java:20)
at randomizedtesting.runner@2.8.1/com.carrotsearch.randomizedtesting.rules.StatementAdapter.evaluate(StatementAdapter.java:36)
at randomizedtesting.runner@2.8.1/com.carrotsearch.randomizedtesting.ThreadLeakControl$StatementRunner.run(ThreadLeakControl.java:390)
at randomizedtesting.runner@2.8.1/com.carrotsearch.randomizedtesting.ThreadLeakControl.lambda$forkTimeoutingTask$0(ThreadLeakControl.java:850)
at java.base/java.lang.Thread.run(Thread.java:1583)
FAILED: org.apache.lucene.backward_codecs.lucene80.TestBestCompressionLucene80DocValuesFormat.testNumericMergeAwayAllValuesLargeSegment
Error Message:
java.lang.NullPointerException: Cannot invoke "org.apache.lucene.index.DocValuesSkipper.docCount()" because "skipper" is null
Stack Trace:
java.lang.NullPointerException: Cannot invoke "org.apache.lucene.index.DocValuesSkipper.docCount()" because "skipper" is null
at __randomizedtesting.SeedInfo.seed([713F9A11B6BF65AF:16B7C0F2E2971E26]:0)
at org.apache.lucene.test_framework@10.0.0-SNAPSHOT/org.apache.lucene.tests.index.BaseDocValuesFormatTestCase.testNumericMergeAwayAllValuesLargeSegment(BaseDocValuesFormatTestCase.java:3638)
at java.base/jdk.internal.reflect.DirectMethodHandleAccessor.invoke(DirectMethodHandleAccessor.java:103)
at java.base/java.lang.reflect.Method.invoke(Method.java:580)
at randomizedtesting.runner@2.8.1/com.carrotsearch.randomizedtesting.RandomizedRunner.invoke(RandomizedRunner.java:1758)
at randomizedtesting.runner@2.8.1/com.carrotsearch.randomizedtesting.RandomizedRunner$8.evaluate(RandomizedRunner.java:946)
at randomizedtesting.runner@2.8.1/com.carrotsearch.randomizedtesting.RandomizedRunner$9.evaluate(RandomizedRunner.java:982)
at randomizedtesting.runner@2.8.1/com.carrotsearch.randomizedtesting.RandomizedRunner$10.evaluate(RandomizedRunner.java:996)
at org.apache.lucene.test_framework@10.0.0-SNAPSHOT/org.apache.lucene.tests.util.TestRuleSetupTeardownChained$1.evaluate(TestRuleSetupTeardownChained.java:48)
at org.apache.lucene.test_framework@10.0.0-SNAPSHOT/org.apache.lucene.tests.util.AbstractBeforeAfterRule$1.evaluate(AbstractBeforeAfterRule.java:43)
at org.apache.lucene.test_framework@10.0.0-SNAPSHOT/org.apache.lucene.tests.util.TestRuleThreadAndTestName$1.evaluate(TestRuleThreadAndTestName.java:45)
at org.apache.lucene.test_framework@10.0.0-SNAPSHOT/org.apache.lucene.tests.util.TestRuleIgnoreAfterMaxFailures$1.evaluate(TestRuleIgnoreAfterMaxFailures.java:60)
at org.apache.lucene.test_framework@10.0.0-SNAPSHOT/org.apache.lucene.tests.util.TestRuleMarkFailure$1.evaluate(TestRuleMarkFailure.java:44)
at junit@4.13.1/org.junit.rules.RunRules.evaluate(RunRules.java:20)
at randomizedtesting.runner@2.8.1/com.carrotsearch.randomizedtesting.rules.StatementAdapter.evaluate(StatementAdapter.java:36)
at randomizedtesting.runner@2.8.1/com.carrotsearch.randomizedtesting.ThreadLeakControl$StatementRunner.run(ThreadLeakControl.java:390)
at randomizedtesting.runner@2.8.1/com.carrotsearch.randomizedtesting.ThreadLeakControl.forkTimeoutingTask(ThreadLeakControl.java:843)
at randomizedtesting.runner@2.8.1/com.carrotsearch.randomizedtesting.ThreadLeakControl$3.evaluate(ThreadLeakControl.java:490)
at randomizedtesting.runner@2.8.1/com.carrotsearch.randomizedtesting.RandomizedRunner.runSingleTest(RandomizedRunner.java:955)
at randomizedtesting.runner@2.8.1/com.carrotsearch.randomizedtesting.RandomizedRunner$5.evaluate(RandomizedRunner.java:840)
at randomizedtesting.runner@2.8.1/com.carrotsearch.randomizedtesting.RandomizedRunner$6.evaluate(RandomizedRunner.java:891)
at randomizedtesting.runner@2.8.1/com.carrotsearch.randomizedtesting.RandomizedRunner$7.evaluate(RandomizedRunner.java:902)
at org.apache.lucene.test_framework@10.0.0-SNAPSHOT/org.apache.lucene.tests.util.AbstractBeforeAfterRule$1.evaluate(AbstractBeforeAfterRule.java:43)
at randomizedtesting.runner@2.8.1/com.carrotsearch.randomizedtesting.rules.StatementAdapter.evaluate(StatementAdapter.java:36)
at org.apache.lucene.test_framework@10.0.0-SNAPSHOT/org.apache.lucene.tests.util.TestRuleStoreClassName$1.evaluate(TestRuleStoreClassName.java:38)
at randomizedtesting.runner@2.8.1/com.carrotsearch.randomizedtesting.rules.NoShadowingOrOverridesOnMethodsRule$1.evaluate(NoShadowingOrOverridesOnMethodsRule.java:40)
at randomizedtesting.runner@2.8.1/com.carrotsearch.randomizedtesting.rules.NoShadowingOrOverridesOnMethodsRule$1.evaluate(NoShadowingOrOverridesOnMethodsRule.java:40)
at randomizedtesting.runner@2.8.1/com.carrotsearch.randomizedtesting.rules.StatementAdapter.evaluate(StatementAdapter.java:36)
at randomizedtesting.runner@2.8.1/com.carrotsearch.randomizedtesting.rules.StatementAdapter.evaluate(StatementAdapter.java:36)
at org.apache.lucene.test_framework@10.0.0-SNAPSHOT/org.apache.lucene.tests.util.TestRuleAssertionsRequired$1.evaluate(TestRuleAssertionsRequired.java:53)
at org.apache.lucene.test_framework@10.0.0-SNAPSHOT/org.apache.lucene.tests.util.AbstractBeforeAfterRule$1.evaluate(AbstractBeforeAfterRule.java:43)
at org.apache.lucene.test_framework@10.0.0-SNAPSHOT/org.apache.lucene.tests.util.TestRuleMarkFailure$1.evaluate(TestRuleMarkFailure.java:44)
at org.apache.lucene.test_framework@10.0.0-SNAPSHOT/org.apache.lucene.tests.util.TestRuleIgnoreAfterMaxFailures$1.evaluate(TestRuleIgnoreAfterMaxFailures.java:60)
at org.apache.lucene.test_framework@10.0.0-SNAPSHOT/org.apache.lucene.tests.util.TestRuleIgnoreTestSuites$1.evaluate(TestRuleIgnoreTestSuites.java:47)
at junit@4.13.1/org.junit.rules.RunRules.evaluate(RunRules.java:20)
at randomizedtesting.runner@2.8.1/com.carrotsearch.randomizedtesting.rules.StatementAdapter.evaluate(StatementAdapter.java:36)
at randomizedtesting.runner@2.8.1/com.carrotsearch.randomizedtesting.ThreadLeakControl$StatementRunner.run(ThreadLeakControl.java:390)
at randomizedtesting.runner@2.8.1/com.carrotsearch.randomizedtesting.ThreadLeakControl.lambda$forkTimeoutingTask$0(ThreadLeakControl.java:850)
at java.base/java.lang.Thread.run(Thread.java:1583)
FAILED: org.apache.lucene.backward_codecs.lucene80.TestBestCompressionLucene80DocValuesFormat.testNumericDocValuesWithSkipperMedium
Error Message:
java.lang.NullPointerException: Cannot invoke "org.apache.lucene.index.DocValuesSkipper.maxDocID(int)" because "skipper" is null
Stack Trace:
java.lang.NullPointerException: Cannot invoke "org.apache.lucene.index.DocValuesSkipper.maxDocID(int)" because "skipper" is null
at __randomizedtesting.SeedInfo.seed([713F9A11B6BF65AF:1089A2CC87BD5956]:0)
at org.apache.lucene.core@10.0.0-SNAPSHOT/org.apache.lucene.index.CheckIndex.checkDocValueSkipper(CheckIndex.java:3280)
at org.apache.lucene.core@10.0.0-SNAPSHOT/org.apache.lucene.index.CheckIndex.checkDocValues(CheckIndex.java:3740)
at org.apache.lucene.core@10.0.0-SNAPSHOT/org.apache.lucene.index.CheckIndex.testDocValues(CheckIndex.java:3242)
at org.apache.lucene.test_framework@10.0.0-SNAPSHOT/org.apache.lucene.tests.index.BaseDocValuesFormatTestCase.assertDocValuesWithSkipper(BaseDocValuesFormatTestCase.java:4196)
at org.apache.lucene.test_framework@10.0.0-SNAPSHOT/org.apache.lucene.tests.index.BaseDocValuesFormatTestCase.doTestNumericDocValuesWithSkipper(BaseDocValuesFormatTestCase.java:3884)
at org.apache.lucene.test_framework@10.0.0-SNAPSHOT/org.apache.lucene.tests.index.BaseDocValuesFormatTestCase.testNumericDocValuesWithSkipperMedium(BaseDocValuesFormatTestCase.java:3875)
at java.base/jdk.internal.reflect.DirectMethodHandleAccessor.invoke(DirectMethodHandleAccessor.java:103)
at java.base/java.lang.reflect.Method.invoke(Method.java:580)
at randomizedtesting.runner@2.8.1/com.carrotsearch.randomizedtesting.RandomizedRunner.invoke(RandomizedRunner.java:1758)
at randomizedtesting.runner@2.8.1/com.carrotsearch.randomizedtesting.RandomizedRunner$8.evaluate(RandomizedRunner.java:946)
at randomizedtesting.runner@2.8.1/com.carrotsearch.randomizedtesting.RandomizedRunner$9.evaluate(RandomizedRunner.java:982)
at randomizedtesting.runner@2.8.1/com.carrotsearch.randomizedtesting.RandomizedRunner$10.evaluate(RandomizedRunner.java:996)
at org.apache.lucene.test_framework@10.0.0-SNAPSHOT/org.apache.lucene.tests.util.TestRuleSetupTeardownChained$1.evaluate(TestRuleSetupTeardownChained.java:48)
at org.apache.lucene.test_framework@10.0.0-SNAPSHOT/org.apache.lucene.tests.util.AbstractBeforeAfterRule$1.evaluate(AbstractBeforeAfterRule.java:43)
at org.apache.lucene.test_framework@10.0.0-SNAPSHOT/org.apache.lucene.tests.util.TestRuleThreadAndTestName$1.evaluate(TestRuleThreadAndTestName.java:45)
at org.apache.lucene.test_framework@10.0.0-SNAPSHOT/org.apache.lucene.tests.util.TestRuleIgnoreAfterMaxFailures$1.evaluate(TestRuleIgnoreAfterMaxFailures.java:60)
at org.apache.lucene.test_framework@10.0.0-SNAPSHOT/org.apache.lucene.tests.util.TestRuleMarkFailure$1.evaluate(TestRuleMarkFailure.java:44)
at junit@4.13.1/org.junit.rules.RunRules.evaluate(RunRules.java:20)
at randomizedtesting.runner@2.8.1/com.carrotsearch.randomizedtesting.rules.StatementAdapter.evaluate(StatementAdapter.java:36)
at randomizedtesting.runner@2.8.1/com.carrotsearch.randomizedtesting.ThreadLeakControl$StatementRunner.run(ThreadLeakControl.java:390)
at randomizedtesting.runner@2.8.1/com.carrotsearch.randomizedtesting.ThreadLeakControl.forkTimeoutingTask(ThreadLeakControl.java:843)
at randomizedtesting.runner@2.8.1/com.carrotsearch.randomizedtesting.ThreadLeakControl$3.evaluate(ThreadLeakControl.java:490)
at randomizedtesting.runner@2.8.1/com.carrotsearch.randomizedtesting.RandomizedRunner.runSingleTest(RandomizedRunner.java:955)
at randomizedtesting.runner@2.8.1/com.carrotsearch.randomizedtesting.RandomizedRunner$5.evaluate(RandomizedRunner.java:840)
at randomizedtesting.runner@2.8.1/com.carrotsearch.randomizedtesting.RandomizedRunner$6.evaluate(RandomizedRunner.java:891)
at randomizedtesting.runner@2.8.1/com.carrotsearch.randomizedtesting.RandomizedRunner$7.evaluate(RandomizedRunner.java:902)
at org.apache.lucene.test_framework@10.0.0-SNAPSHOT/org.apache.lucene.tests.util.AbstractBeforeAfterRule$1.evaluate(AbstractBeforeAfterRule.java:43)
at randomizedtesting.runner@2.8.1/com.carrotsearch.randomizedtesting.rules.StatementAdapter.evaluate(StatementAdapter.java:36)
at org.apache.lucene.test_framework@10.0.0-SNAPSHOT/org.apache.lucene.tests.util.TestRuleStoreClassName$1.evaluate(TestRuleStoreClassName.java:38)
at randomizedtesting.runner@2.8.1/com.carrotsearch.randomizedtesting.rules.NoShadowingOrOverridesOnMethodsRule$1.evaluate(NoShadowingOrOverridesOnMethodsRule.java:40)
at randomizedtesting.runner@2.8.1/com.carrotsearch.randomizedtesting.rules.NoShadowingOrOverridesOnMethodsRule$1.evaluate(NoShadowingOrOverridesOnMethodsRule.java:40)
at randomizedtesting.runner@2.8.1/com.carrotsearch.randomizedtesting.rules.StatementAdapter.evaluate(StatementAdapter.java:36)
at randomizedtesting.runner@2.8.1/com.carrotsearch.randomizedtesting.rules.StatementAdapter.evaluate(StatementAdapter.java:36)
at org.apache.lucene.test_framework@10.0.0-SNAPSHOT/org.apache.lucene.tests.util.TestRuleAssertionsRequired$1.evaluate(TestRuleAssertionsRequired.java:53)
at org.apache.lucene.test_framework@10.0.0-SNAPSHOT/org.apache.lucene.tests.util.AbstractBeforeAfterRule$1.evaluate(AbstractBeforeAfterRule.java:43)
at org.apache.lucene.test_framework@10.0.0-SNAPSHOT/org.apache.lucene.tests.util.TestRuleMarkFailure$1.evaluate(TestRuleMarkFailure.java:44)
at org.apache.lucene.test_framework@10.0.0-SNAPSHOT/org.apache.lucene.tests.util.TestRuleIgnoreAfterMaxFailures$1.evaluate(TestRuleIgnoreAfterMaxFailures.java:60)
at org.apache.lucene.test_framework@10.0.0-SNAPSHOT/org.apache.lucene.tests.util.TestRuleIgnoreTestSuites$1.evaluate(TestRuleIgnoreTestSuites.java:47)
at junit@4.13.1/org.junit.rules.RunRules.evaluate(RunRules.java:20)
at randomizedtesting.runner@2.8.1/com.carrotsearch.randomizedtesting.rules.StatementAdapter.evaluate(StatementAdapter.java:36)
at randomizedtesting.runner@2.8.1/com.carrotsearch.randomizedtesting.ThreadLeakControl$StatementRunner.run(ThreadLeakControl.java:390)
at randomizedtesting.runner@2.8.1/com.carrotsearch.randomizedtesting.ThreadLeakControl.lambda$forkTimeoutingTask$0(ThreadLeakControl.java:850)
at java.base/java.lang.Thread.run(Thread.java:1583)
FAILED: org.apache.lucene.backward_codecs.lucene80.TestBestCompressionLucene80DocValuesFormat.testSortedSetMergeAwayAllValuesLargeSegment
Error Message:
java.lang.NullPointerException: Cannot invoke "org.apache.lucene.index.DocValuesSkipper.docCount()" because "skipper" is null
Stack Trace:
java.lang.NullPointerException: Cannot invoke "org.apache.lucene.index.DocValuesSkipper.docCount()" because "skipper" is null
at __randomizedtesting.SeedInfo.seed([713F9A11B6BF65AF:B58CADB2ABC04550]:0)
at org.apache.lucene.test_framework@10.0.0-SNAPSHOT/org.apache.lucene.tests.index.BaseDocValuesFormatTestCase.testSortedSetMergeAwayAllValuesLargeSegment(BaseDocValuesFormatTestCase.java:3598)
at java.base/jdk.internal.reflect.DirectMethodHandleAccessor.invoke(DirectMethodHandleAccessor.java:103)
at java.base/java.lang.reflect.Method.invoke(Method.java:580)
at randomizedtesting.runner@2.8.1/com.carrotsearch.randomizedtesting.RandomizedRunner.invoke(RandomizedRunner.java:1758)
at randomizedtesting.runner@2.8.1/com.carrotsearch.randomizedtesting.RandomizedRunner$8.evaluate(RandomizedRunner.java:946)
at randomizedtesting.runner@2.8.1/com.carrotsearch.randomizedtesting.RandomizedRunner$9.evaluate(RandomizedRunner.java:982)
at randomizedtesting.runner@2.8.1/com.carrotsearch.randomizedtesting.RandomizedRunner$10.evaluate(RandomizedRunner.java:996)
at org.apache.lucene.test_framework@10.0.0-SNAPSHOT/org.apache.lucene.tests.util.TestRuleSetupTeardownChained$1.evaluate(TestRuleSetupTeardownChained.java:48)
at org.apache.lucene.test_framework@10.0.0-S
[...truncated too long message...]
ld/test-results/test/outputs/OUTPUT-org.apache.lucene.backward_codecs.lucene80.TestBestSpeedLucene80DocValuesFormat.txt
Reproduce with: gradlew :lucene:backward-codecs:test --tests "org.apache.lucene.backward_codecs.lucene80.TestBestSpeedLucene80DocValuesFormat.testSortedSetMergeAwayAllValuesLargeSegment" -Ptests.jvms=4 -Ptests.jvmargs= -Ptests.seed=713F9A11B6BF65AF -Ptests.multiplier=2 -Ptests.nightly=true -Ptests.gui=true -Ptests.file.encoding=ISO-8859-1 -Ptests.linedocsfile=/home/jenkins/jenkins-slave/workspace/Lucene/Lucene-NightlyTests-main/test-data/enwiki.random.lines.txt -Ptests.vectorsize=default -Ptests.forceintegervectors=false
- org.apache.lucene.backward_codecs.lucene80.TestBestSpeedLucene80DocValuesFormat.testSortedSetDocValuesWithSkipperMedium (:lucene:backward-codecs)
Test output: /home/jenkins/jenkins-slave/workspace/Lucene/Lucene-NightlyTests-main/checkout/lucene/backward-codecs/build/test-results/test/outputs/OUTPUT-org.apache.lucene.backward_codecs.lucene80.TestBestSpeedLucene80DocValuesFormat.txt
Reproduce with: gradlew :lucene:backward-codecs:test --tests "org.apache.lucene.backward_codecs.lucene80.TestBestSpeedLucene80DocValuesFormat.testSortedSetDocValuesWithSkipperMedium" -Ptests.jvms=4 -Ptests.jvmargs= -Ptests.seed=713F9A11B6BF65AF -Ptests.multiplier=2 -Ptests.nightly=true -Ptests.gui=true -Ptests.file.encoding=ISO-8859-1 -Ptests.linedocsfile=/home/jenkins/jenkins-slave/workspace/Lucene/Lucene-NightlyTests-main/test-data/enwiki.random.lines.txt -Ptests.vectorsize=default -Ptests.forceintegervectors=false
- org.apache.lucene.backward_codecs.lucene80.TestBestCompressionLucene80DocValuesFormat.testSortedDocValuesWithSkipperSmall (:lucene:backward-codecs)
Test output: /home/jenkins/jenkins-slave/workspace/Lucene/Lucene-NightlyTests-main/checkout/lucene/backward-codecs/build/test-results/test/outputs/OUTPUT-org.apache.lucene.backward_codecs.lucene80.TestBestCompressionLucene80DocValuesFormat.txt
Reproduce with: gradlew :lucene:backward-codecs:test --tests "org.apache.lucene.backward_codecs.lucene80.TestBestCompressionLucene80DocValuesFormat.testSortedDocValuesWithSkipperSmall" -Ptests.jvms=4 -Ptests.jvmargs= -Ptests.seed=713F9A11B6BF65AF -Ptests.multiplier=2 -Ptests.nightly=true -Ptests.gui=true -Ptests.file.encoding=ISO-8859-1 -Ptests.linedocsfile=/home/jenkins/jenkins-slave/workspace/Lucene/Lucene-NightlyTests-main/test-data/enwiki.random.lines.txt -Ptests.vectorsize=default -Ptests.forceintegervectors=false
- org.apache.lucene.backward_codecs.lucene80.TestBestCompressionLucene80DocValuesFormat.testNumericDocValuesWithSkipperSmall (:lucene:backward-codecs)
Test output: /home/jenkins/jenkins-slave/workspace/Lucene/Lucene-NightlyTests-main/checkout/lucene/backward-codecs/build/test-results/test/outputs/OUTPUT-org.apache.lucene.backward_codecs.lucene80.TestBestCompressionLucene80DocValuesFormat.txt
Reproduce with: gradlew :lucene:backward-codecs:test --tests "org.apache.lucene.backward_codecs.lucene80.TestBestCompressionLucene80DocValuesFormat.testNumericDocValuesWithSkipperSmall" -Ptests.jvms=4 -Ptests.jvmargs= -Ptests.seed=713F9A11B6BF65AF -Ptests.multiplier=2 -Ptests.nightly=true -Ptests.gui=true -Ptests.file.encoding=ISO-8859-1 -Ptests.linedocsfile=/home/jenkins/jenkins-slave/workspace/Lucene/Lucene-NightlyTests-main/test-data/enwiki.random.lines.txt -Ptests.vectorsize=default -Ptests.forceintegervectors=false
- org.apache.lucene.backward_codecs.lucene80.TestBestSpeedLucene80DocValuesFormat.testSortedDocValuesWithSkipperSmall (:lucene:backward-codecs)
Test output: /home/jenkins/jenkins-slave/workspace/Lucene/Lucene-NightlyTests-main/checkout/lucene/backward-codecs/build/test-results/test/outputs/OUTPUT-org.apache.lucene.backward_codecs.lucene80.TestBestSpeedLucene80DocValuesFormat.txt
Reproduce with: gradlew :lucene:backward-codecs:test --tests "org.apache.lucene.backward_codecs.lucene80.TestBestSpeedLucene80DocValuesFormat.testSortedDocValuesWithSkipperSmall" -Ptests.jvms=4 -Ptests.jvmargs= -Ptests.seed=713F9A11B6BF65AF -Ptests.multiplier=2 -Ptests.nightly=true -Ptests.gui=true -Ptests.file.encoding=ISO-8859-1 -Ptests.linedocsfile=/home/jenkins/jenkins-slave/workspace/Lucene/Lucene-NightlyTests-main/test-data/enwiki.random.lines.txt -Ptests.vectorsize=default -Ptests.forceintegervectors=false
- org.apache.lucene.backward_codecs.lucene80.TestBestSpeedLucene80DocValuesFormat.testNumericDocValuesWithSkipperSmall (:lucene:backward-codecs)
Test output: /home/jenkins/jenkins-slave/workspace/Lucene/Lucene-NightlyTests-main/checkout/lucene/backward-codecs/build/test-results/test/outputs/OUTPUT-org.apache.lucene.backward_codecs.lucene80.TestBestSpeedLucene80DocValuesFormat.txt
Reproduce with: gradlew :lucene:backward-codecs:test --tests "org.apache.lucene.backward_codecs.lucene80.TestBestSpeedLucene80DocValuesFormat.testNumericDocValuesWithSkipperSmall" -Ptests.jvms=4 -Ptests.jvmargs= -Ptests.seed=713F9A11B6BF65AF -Ptests.multiplier=2 -Ptests.nightly=true -Ptests.gui=true -Ptests.file.encoding=ISO-8859-1 -Ptests.linedocsfile=/home/jenkins/jenkins-slave/workspace/Lucene/Lucene-NightlyTests-main/test-data/enwiki.random.lines.txt -Ptests.vectorsize=default -Ptests.forceintegervectors=false
- org.apache.lucene.backward_codecs.lucene80.TestBestCompressionLucene80DocValuesFormat.testNumericDocValuesWithSkipperBig (:lucene:backward-codecs)
Test output: /home/jenkins/jenkins-slave/workspace/Lucene/Lucene-NightlyTests-main/checkout/lucene/backward-codecs/build/test-results/test/outputs/OUTPUT-org.apache.lucene.backward_codecs.lucene80.TestBestCompressionLucene80DocValuesFormat.txt
Reproduce with: gradlew :lucene:backward-codecs:test --tests "org.apache.lucene.backward_codecs.lucene80.TestBestCompressionLucene80DocValuesFormat.testNumericDocValuesWithSkipperBig" -Ptests.jvms=4 -Ptests.jvmargs= -Ptests.seed=713F9A11B6BF65AF -Ptests.multiplier=2 -Ptests.nightly=true -Ptests.gui=true -Ptests.file.encoding=ISO-8859-1 -Ptests.linedocsfile=/home/jenkins/jenkins-slave/workspace/Lucene/Lucene-NightlyTests-main/test-data/enwiki.random.lines.txt -Ptests.vectorsize=default -Ptests.forceintegervectors=false
- org.apache.lucene.backward_codecs.lucene80.TestBestSpeedLucene80DocValuesFormat.testNumericDocValuesWithSkipperBig (:lucene:backward-codecs)
Test output: /home/jenkins/jenkins-slave/workspace/Lucene/Lucene-NightlyTests-main/checkout/lucene/backward-codecs/build/test-results/test/outputs/OUTPUT-org.apache.lucene.backward_codecs.lucene80.TestBestSpeedLucene80DocValuesFormat.txt
Reproduce with: gradlew :lucene:backward-codecs:test --tests "org.apache.lucene.backward_codecs.lucene80.TestBestSpeedLucene80DocValuesFormat.testNumericDocValuesWithSkipperBig" -Ptests.jvms=4 -Ptests.jvmargs= -Ptests.seed=713F9A11B6BF65AF -Ptests.multiplier=2 -Ptests.nightly=true -Ptests.gui=true -Ptests.file.encoding=ISO-8859-1 -Ptests.linedocsfile=/home/jenkins/jenkins-slave/workspace/Lucene/Lucene-NightlyTests-main/test-data/enwiki.random.lines.txt -Ptests.vectorsize=default -Ptests.forceintegervectors=false
- org.apache.lucene.backward_codecs.lucene80.TestBestCompressionLucene80DocValuesFormat.testSortedSetDocValuesWithSkipperBig (:lucene:backward-codecs)
Test output: /home/jenkins/jenkins-slave/workspace/Lucene/Lucene-NightlyTests-main/checkout/lucene/backward-codecs/build/test-results/test/outputs/OUTPUT-org.apache.lucene.backward_codecs.lucene80.TestBestCompressionLucene80DocValuesFormat.txt
Reproduce with: gradlew :lucene:backward-codecs:test --tests "org.apache.lucene.backward_codecs.lucene80.TestBestCompressionLucene80DocValuesFormat.testSortedSetDocValuesWithSkipperBig" -Ptests.jvms=4 -Ptests.jvmargs= -Ptests.seed=713F9A11B6BF65AF -Ptests.multiplier=2 -Ptests.nightly=true -Ptests.gui=true -Ptests.file.encoding=ISO-8859-1 -Ptests.linedocsfile=/home/jenkins/jenkins-slave/workspace/Lucene/Lucene-NightlyTests-main/test-data/enwiki.random.lines.txt -Ptests.vectorsize=default -Ptests.forceintegervectors=false
- org.apache.lucene.backward_codecs.lucene80.TestBestSpeedLucene80DocValuesFormat.testSortedSetDocValuesWithSkipperBig (:lucene:backward-codecs)
Test output: /home/jenkins/jenkins-slave/workspace/Lucene/Lucene-NightlyTests-main/checkout/lucene/backward-codecs/build/test-results/test/outputs/OUTPUT-org.apache.lucene.backward_codecs.lucene80.TestBestSpeedLucene80DocValuesFormat.txt
Reproduce with: gradlew :lucene:backward-codecs:test --tests "org.apache.lucene.backward_codecs.lucene80.TestBestSpeedLucene80DocValuesFormat.testSortedSetDocValuesWithSkipperBig" -Ptests.jvms=4 -Ptests.jvmargs= -Ptests.seed=713F9A11B6BF65AF -Ptests.multiplier=2 -Ptests.nightly=true -Ptests.gui=true -Ptests.file.encoding=ISO-8859-1 -Ptests.linedocsfile=/home/jenkins/jenkins-slave/workspace/Lucene/Lucene-NightlyTests-main/test-data/enwiki.random.lines.txt -Ptests.vectorsize=default -Ptests.forceintegervectors=false
Deprecated Gradle features were used in this build, making it incompatible with Gradle 9.0.
You can use '--warning-mode all' to show the individual deprecation warnings and determine if they come from your own scripts or plugins.
For more on this, please refer to https://docs.gradle.org/8.8/userguide/command_line_interface.html#sec:command_line_warnings in the Gradle documentation.
BUILD SUCCESSFUL in 2h 33m 53s
244 actionable tasks: 77 executed, 167 up-to-date
Publishing build scan...
https://ge.apache.org/s/xubris63756do
Build step 'Invoke Gradle script' changed build result to SUCCESS
Archiving artifacts
‘**/*.events’ doesn’t match anything: ‘**’ exists but not ‘**/*.events’
No artifacts found that match the file pattern "**/*.events,heapdumps/**,**/hs_err_pid*". Configuration error?
Recording test results
[Checks API] No suitable checks publisher found.
Build step 'Publish JUnit test result report' changed build result to UNSTABLE
Email was triggered for: Unstable (Test Failures)
Sending email for trigger: Unstable (Test Failures)