You are viewing a plain text version of this content. The canonical link for it is here.
Posted to dev@stanbol.apache.org by Apache Jenkins Server <je...@builds.apache.org> on 2012/06/21 17:16:51 UTC
Build failed in Jenkins: stanbol-trunk-1.6 #963
See <https://builds.apache.org/job/stanbol-trunk-1.6/963/changes>
Changes:
[bdelacretaz] add staged release checking scripts
[rwesten] fixes STANBOL-659: changed dependency of the factstore to commons.web.base from "0.10.0-incubating-SNAPSHOT" to 0.9.0-incubating.
NOTE: "0.10.0-incubating-SNAPSHOT" was wrong in any case, because the trunk now uses 0.10.1.
[rwesten] fixes STANBOL-659:
* JSON-LD now sorts properties alphabetical
* roles in the factstore are also sorted alphabetical
* adapted unit/integration test to not depend on the serialisation of RDF triples
[rwesten] STANBOL-608: Upgrade Apache Sling dependencies: Most important the sling.launchpad
* added required javax.** packages that are no longer exported by the sling launcher to the Stanbol framework fragment (see comment to STANBOL-608 for details)
* switched to javax.servlet 1.5
Upgraded to Apache Felix Web Console 4.0.0
* including WebConsole plugin changes
* added "org.apache.geronimo.bundles:json:20090211_1" bundle to stanbolcommons bundle list. This exports "org.json" now required by the Felix Web Console 4.0.0
* changed start level for WebConsole so that it starts after the common bundles (especially 'json' and 'commons-fileupload')
* Adapted OSGI console test because the /shell subpath is no longer available. Added test for missing Web Console tabs.
[rwesten] STANBOL-583: deactivated CELI NER engine test for server side issue.
[rwesten] STANBOL-654: Fixes the problem of quoted tokens containing wildcards
[fchrist] STANBOL-639 Updating to latest Entityhub SNAPSHOTs
[rwesten] STANBOL-583: reactivated IllegalFormattedLicenseKey test; added test for default account
[rwesten] STANBOL-583: implemented license key handling as described by http://markmail.org/message/pzbtwv3ujek7pipz; activated the CELI engines in the Enhancer Bundlelist
[alexdma] STANBOL-655 : class loading for rule adapters now uses Class.forName()
[rwesten] STANBOL-639: corrected ref to stanbol parent in entityhub reactor pom
[rwesten] fixes STANBOL-654 by adding quotes to all tokens created by QueryUtils#parseIndexValues(..)
[fchrist] STANBOL-639:prepare for next development iteration
[fchrist] STANBOL-639:prepare release apache-stanbol-entityhub-0.10.0-incubating
[fchrist] STANBOL-639 Added missing parent POM. Changed name of reactor to create a final apache-stanbol-entityhub artifact for releasing
[fchrist] STANBOL-639:rollback the release of apache-stanbol-entityhub-0.10.0-incubating
[fchrist] STANBOL-639:prepare for next development iteration
[fchrist] STANBOL-639:prepare release apache-stanbol-entityhub-0.10.0-incubating
[fchrist] STANBOL-639:rollback the release of org.apache.stanbol.entityhub.reactor-0.10.0-incubating
[fchrist] STANBOL-639:prepare for next development iteration
[fchrist] STANBOL-639:prepare release org.apache.stanbol.entityhub.reactor-0.10.0-incubating
[fchrist] STANBOL-639 Made reactor POM ready for release. Added missing license headers
------------------------------------------
[...truncated 10114 lines...]
[JENKINS] Archiving disabled - not archiving <https://builds.apache.org/job/stanbol-trunk-1.6/ws/trunk/entityhub/indexing/dblp/pom.xml>
[JENKINS] Archiving disabled - not archiving <https://builds.apache.org/job/stanbol-trunk-1.6/ws/trunk/entityhub/indexing/dblp/target/org.apache.stanbol.entityhub.indexing.dblp-0.10.1-incubating-SNAPSHOT.jar>
[INFO] [source:jar {execution: attach-sources}]
[INFO] META-INF already added, skipping
[INFO] META-INF/DISCLAIMER already added, skipping
[INFO] META-INF/NOTICE already added, skipping
[INFO] META-INF/DEPENDENCIES already added, skipping
[INFO] META-INF/LICENSE already added, skipping
[INFO] Building jar: <https://builds.apache.org/job/stanbol-trunk-1.6/ws/trunk/entityhub/indexing/dblp/target/org.apache.stanbol.entityhub.indexing.dblp-0.10.1-incubating-SNAPSHOT-sources.jar>
[INFO] META-INF already added, skipping
[INFO] META-INF/DISCLAIMER already added, skipping
[INFO] META-INF/NOTICE already added, skipping
[INFO] META-INF/DEPENDENCIES already added, skipping
[INFO] META-INF/LICENSE already added, skipping
[INFO] [install:install {execution: default-install}]
[INFO] Installing <https://builds.apache.org/job/stanbol-trunk-1.6/ws/trunk/entityhub/indexing/dblp/target/org.apache.stanbol.entityhub.indexing.dblp-0.10.1-incubating-SNAPSHOT.jar> to /home/jenkins/jenkins-slave/maven-repositories/0/org/apache/stanbol/org.apache.stanbol.entityhub.indexing.dblp/0.10.1-incubating-SNAPSHOT/org.apache.stanbol.entityhub.indexing.dblp-0.10.1-incubating-SNAPSHOT.jar
[INFO] Installing <https://builds.apache.org/job/stanbol-trunk-1.6/ws/trunk/entityhub/indexing/dblp/target/org.apache.stanbol.entityhub.indexing.dblp-0.10.1-incubating-SNAPSHOT-sources.jar> to /home/jenkins/jenkins-slave/maven-repositories/0/org/apache/stanbol/org.apache.stanbol.entityhub.indexing.dblp/0.10.1-incubating-SNAPSHOT/org.apache.stanbol.entityhub.indexing.dblp-0.10.1-incubating-SNAPSHOT-sources.jar
[JENKINS] Archiving disabled - not archiving <https://builds.apache.org/job/stanbol-trunk-1.6/ws/trunk/entityhub/indexing/dblp/pom.xml>
[JENKINS] Archiving disabled - not archiving <https://builds.apache.org/job/stanbol-trunk-1.6/ws/trunk/entityhub/indexing/dblp/target/org.apache.stanbol.entityhub.indexing.dblp-0.10.1-incubating-SNAPSHOT.jar>
[JENKINS] Archiving disabled - not archiving <https://builds.apache.org/job/stanbol-trunk-1.6/ws/trunk/entityhub/indexing/dblp/target/org.apache.stanbol.entityhub.indexing.dblp-0.10.1-incubating-SNAPSHOT-sources.jar>
[INFO] ------------------------------------------------------------------------
[INFO] Building Apache Stanbol Entityhub Indexing Reactor
[INFO] task-segment: [clean, install]
[INFO] ------------------------------------------------------------------------
[INFO] [clean:clean {execution: default-clean}]
[INFO] Deleting <https://builds.apache.org/job/stanbol-trunk-1.6/ws/trunk/entityhub/indexing/target>
[INFO] [remote-resources:process {execution: default}]
[INFO] [site:attach-descriptor {execution: default-attach-descriptor}]
[INFO] [install:install {execution: default-install}]
[INFO] Installing <https://builds.apache.org/job/stanbol-trunk-1.6/ws/trunk/entityhub/indexing/pom.xml> to /home/jenkins/jenkins-slave/maven-repositories/0/org/apache/stanbol/org.apache.stanbol.entityhub.indexing.reactor/0.10.1-incubating-SNAPSHOT/org.apache.stanbol.entityhub.indexing.reactor-0.10.1-incubating-SNAPSHOT.pom
[JENKINS] Archiving disabled - not archiving <https://builds.apache.org/job/stanbol-trunk-1.6/ws/trunk/entityhub/indexing/pom.xml>
[JENKINS] Archiving disabled - not archiving /home/jenkins/jenkins-slave/maven-repositories/0/org/apache/stanbol/org.apache.stanbol.entityhub.indexing.reactor/0.10.1-incubating-SNAPSHOT/org.apache.stanbol.entityhub.indexing.reactor-0.10.1-incubating-SNAPSHOT.pom
[INFO] ------------------------------------------------------------------------
[INFO] Building Apache Stanbol Entityhub Default Configuration
[INFO] task-segment: [clean, install]
[INFO] ------------------------------------------------------------------------
[INFO] [clean:clean {execution: default-clean}]
[INFO] Deleting <https://builds.apache.org/job/stanbol-trunk-1.6/ws/trunk/entityhub/defaults/target>
[INFO] [enforcer:enforce {execution: enforce-java}]
[INFO] [remote-resources:process {execution: default}]
[debug] execute contextualize
[INFO] [resources:resources {execution: default-resources}]
[INFO] Using 'UTF-8' encoding to copy filtered resources.
[INFO] Copying 3 resources
[INFO] Copying 4 resources
[INFO] [compiler:compile {execution: default-compile}]
[INFO] No sources to compile
[INFO] [scr:scr {execution: generate-scr-scrdescriptor}]
[WARNING] Source tree does not exist. Ignoring <https://builds.apache.org/job/stanbol-trunk-1.6/ws/trunk/entityhub/defaults/src/main/java>
[debug] execute contextualize
[INFO] [resources:testResources {execution: default-testResources}]
[INFO] Using 'UTF-8' encoding to copy filtered resources.
[INFO] skip non existing resourceDirectory <https://builds.apache.org/job/stanbol-trunk-1.6/ws/trunk/entityhub/defaults/src/test/resources>
[INFO] Copying 4 resources
[INFO] [compiler:testCompile {execution: default-testCompile}]
[INFO] No sources to compile
[INFO] [surefire:test {execution: default-test}]
[INFO] Surefire report directory: <https://builds.apache.org/job/stanbol-trunk-1.6/ws/trunk/entityhub/defaults/target/surefire-reports>
-------------------------------------------------------
T E S T S
-------------------------------------------------------
Results :
Tests run: 0, Failures: 0, Errors: 0, Skipped: 0
[JENKINS] Recording test results[INFO] [bundle:bundle {execution: default-bundle}]
[WARNING] Bundle org.apache.stanbol:org.apache.stanbol.entityhub.defaults:bundle:0.10.1-incubating-SNAPSHOT : Instructions in Export-Package that are never used: org\.apache\.stanbol\.entityhub\.defaults
Classpath: Jar:.
[WARNING] Bundle org.apache.stanbol:org.apache.stanbol.entityhub.defaults:bundle:0.10.1-incubating-SNAPSHOT : Superfluous export-package instructions: [org.apache.stanbol.entityhub.defaults]
[INFO] Preparing source:jar
[WARNING] Removing: jar from forked lifecycle, to prevent recursive invocation.
[JENKINS] Archiving disabled - not archiving <https://builds.apache.org/job/stanbol-trunk-1.6/ws/trunk/entityhub/defaults/pom.xml>
[JENKINS] Archiving disabled - not archiving <https://builds.apache.org/job/stanbol-trunk-1.6/ws/trunk/entityhub/defaults/target/org.apache.stanbol.entityhub.defaults-0.10.1-incubating-SNAPSHOT.jar>
[INFO] [enforcer:enforce {execution: enforce-java}]
[JENKINS] Archiving disabled - not archiving <https://builds.apache.org/job/stanbol-trunk-1.6/ws/trunk/entityhub/defaults/pom.xml>
[JENKINS] Archiving disabled - not archiving <https://builds.apache.org/job/stanbol-trunk-1.6/ws/trunk/entityhub/defaults/target/org.apache.stanbol.entityhub.defaults-0.10.1-incubating-SNAPSHOT.jar>
[INFO] [source:jar {execution: attach-sources}]
[INFO] META-INF already added, skipping
[INFO] META-INF/DISCLAIMER already added, skipping
[INFO] META-INF/NOTICE already added, skipping
[INFO] META-INF/DEPENDENCIES already added, skipping
[INFO] META-INF/LICENSE already added, skipping
[INFO] Building jar: <https://builds.apache.org/job/stanbol-trunk-1.6/ws/trunk/entityhub/defaults/target/org.apache.stanbol.entityhub.defaults-0.10.1-incubating-SNAPSHOT-sources.jar>
[INFO] META-INF already added, skipping
[INFO] META-INF/DISCLAIMER already added, skipping
[INFO] META-INF/NOTICE already added, skipping
[INFO] META-INF/DEPENDENCIES already added, skipping
[INFO] META-INF/LICENSE already added, skipping
[INFO] [install:install {execution: default-install}]
[INFO] Installing <https://builds.apache.org/job/stanbol-trunk-1.6/ws/trunk/entityhub/defaults/target/org.apache.stanbol.entityhub.defaults-0.10.1-incubating-SNAPSHOT.jar> to /home/jenkins/jenkins-slave/maven-repositories/0/org/apache/stanbol/org.apache.stanbol.entityhub.defaults/0.10.1-incubating-SNAPSHOT/org.apache.stanbol.entityhub.defaults-0.10.1-incubating-SNAPSHOT.jar
[INFO] Installing <https://builds.apache.org/job/stanbol-trunk-1.6/ws/trunk/entityhub/defaults/target/org.apache.stanbol.entityhub.defaults-0.10.1-incubating-SNAPSHOT-sources.jar> to /home/jenkins/jenkins-slave/maven-repositories/0/org/apache/stanbol/org.apache.stanbol.entityhub.defaults/0.10.1-incubating-SNAPSHOT/org.apache.stanbol.entityhub.defaults-0.10.1-incubating-SNAPSHOT-sources.jar
[INFO] [bundle:install {execution: default-install}]
[INFO] Installing org/apache/stanbol/org.apache.stanbol.entityhub.defaults/0.10.1-incubating-SNAPSHOT/org.apache.stanbol.entityhub.defaults-0.10.1-incubating-SNAPSHOT.jar
[INFO] Writing OBR metadata
[JENKINS] Archiving disabled - not archiving <https://builds.apache.org/job/stanbol-trunk-1.6/ws/trunk/entityhub/defaults/pom.xml>
[JENKINS] Archiving disabled - not archiving <https://builds.apache.org/job/stanbol-trunk-1.6/ws/trunk/entityhub/defaults/target/org.apache.stanbol.entityhub.defaults-0.10.1-incubating-SNAPSHOT.jar>
[JENKINS] Archiving disabled - not archiving <https://builds.apache.org/job/stanbol-trunk-1.6/ws/trunk/entityhub/defaults/target/org.apache.stanbol.entityhub.defaults-0.10.1-incubating-SNAPSHOT-sources.jar>
[INFO] ------------------------------------------------------------------------
[INFO] Building Apache Stanbol Entityhub Bundle List
[INFO] task-segment: [clean, install]
[INFO] ------------------------------------------------------------------------
[INFO] [clean:clean {execution: default-clean}]
[INFO] Deleting <https://builds.apache.org/job/stanbol-trunk-1.6/ws/trunk/entityhub/bundlelist/target>
[INFO] [enforcer:enforce {execution: enforce-java}]
[INFO] [remote-resources:process {execution: default}]
[INFO] [launchpad:attach-partial-bundle-list {execution: default-attach-partial-bundle-list}]
[INFO] Attaching bundle list configuration
[INFO] Preparing source:jar
[WARNING] Removing: jar from forked lifecycle, to prevent recursive invocation.
[JENKINS] Archiving disabled - not archiving <https://builds.apache.org/job/stanbol-trunk-1.6/ws/trunk/entityhub/bundlelist/pom.xml>
[JENKINS] Archiving disabled - not archiving <https://builds.apache.org/job/stanbol-trunk-1.6/ws/trunk/entityhub/bundlelist/src/main/bundles/list.xml>
[INFO] [enforcer:enforce {execution: enforce-java}]
[JENKINS] Archiving disabled - not archiving <https://builds.apache.org/job/stanbol-trunk-1.6/ws/trunk/entityhub/bundlelist/pom.xml>
[JENKINS] Archiving disabled - not archiving <https://builds.apache.org/job/stanbol-trunk-1.6/ws/trunk/entityhub/bundlelist/src/main/bundles/list.xml>
[INFO] [source:jar {execution: attach-sources}]
[INFO] META-INF already added, skipping
[INFO] META-INF/DISCLAIMER already added, skipping
[INFO] META-INF/NOTICE already added, skipping
[INFO] META-INF/DEPENDENCIES already added, skipping
[INFO] META-INF/LICENSE already added, skipping
[INFO] Building jar: <https://builds.apache.org/job/stanbol-trunk-1.6/ws/trunk/entityhub/bundlelist/target/org.apache.stanbol.entityhub.bundlelist-0.10.1-incubating-SNAPSHOT-sources.jar>
[INFO] META-INF already added, skipping
[INFO] META-INF/DISCLAIMER already added, skipping
[INFO] META-INF/NOTICE already added, skipping
[INFO] META-INF/DEPENDENCIES already added, skipping
[INFO] META-INF/LICENSE already added, skipping
[INFO] [install:install {execution: default-install}]
[INFO] Installing <https://builds.apache.org/job/stanbol-trunk-1.6/ws/trunk/entityhub/bundlelist/src/main/bundles/list.xml> to /home/jenkins/jenkins-slave/maven-repositories/0/org/apache/stanbol/org.apache.stanbol.entityhub.bundlelist/0.10.1-incubating-SNAPSHOT/org.apache.stanbol.entityhub.bundlelist-0.10.1-incubating-SNAPSHOT.xml
[INFO] Installing <https://builds.apache.org/job/stanbol-trunk-1.6/ws/trunk/entityhub/bundlelist/target/org.apache.stanbol.entityhub.bundlelist-0.10.1-incubating-SNAPSHOT-sources.jar> to /home/jenkins/jenkins-slave/maven-repositories/0/org/apache/stanbol/org.apache.stanbol.entityhub.bundlelist/0.10.1-incubating-SNAPSHOT/org.apache.stanbol.entityhub.bundlelist-0.10.1-incubating-SNAPSHOT-sources.jar
[JENKINS] Archiving disabled - not archiving <https://builds.apache.org/job/stanbol-trunk-1.6/ws/trunk/entityhub/bundlelist/pom.xml>
[JENKINS] Archiving disabled - not archiving <https://builds.apache.org/job/stanbol-trunk-1.6/ws/trunk/entityhub/bundlelist/src/main/bundles/list.xml>
[JENKINS] Archiving disabled - not archiving <https://builds.apache.org/job/stanbol-trunk-1.6/ws/trunk/entityhub/bundlelist/target/org.apache.stanbol.entityhub.bundlelist-0.10.1-incubating-SNAPSHOT-sources.jar>
[INFO] ------------------------------------------------------------------------
[INFO] Building Apache Stanbol Entityhub
[INFO] task-segment: [clean, install]
[INFO] ------------------------------------------------------------------------
[INFO] [clean:clean {execution: default-clean}]
[INFO] Deleting <https://builds.apache.org/job/stanbol-trunk-1.6/ws/trunk/entityhub/target>
[INFO] [enforcer:enforce {execution: enforce-java}]
[INFO] [remote-resources:process {execution: default}]
[INFO] [site:attach-descriptor {execution: default-attach-descriptor}]
[INFO] Preparing source:jar
[WARNING] Removing: jar from forked lifecycle, to prevent recursive invocation.
[JENKINS] Archiving disabled - not archiving <https://builds.apache.org/job/stanbol-trunk-1.6/ws/trunk/entityhub/pom.xml>
[INFO] [enforcer:enforce {execution: enforce-java}]
[JENKINS] Archiving disabled - not archiving <https://builds.apache.org/job/stanbol-trunk-1.6/ws/trunk/entityhub/pom.xml>
[INFO] [source:jar {execution: attach-sources}]
[INFO] [install:install {execution: default-install}]
[INFO] Installing <https://builds.apache.org/job/stanbol-trunk-1.6/ws/trunk/entityhub/pom.xml> to /home/jenkins/jenkins-slave/maven-repositories/0/org/apache/stanbol/apache-stanbol-entityhub/0.10.1-incubating-SNAPSHOT/apache-stanbol-entityhub-0.10.1-incubating-SNAPSHOT.pom
[JENKINS] Archiving disabled - not archiving <https://builds.apache.org/job/stanbol-trunk-1.6/ws/trunk/entityhub/pom.xml>
[JENKINS] Archiving disabled - not archiving /home/jenkins/jenkins-slave/maven-repositories/0/org/apache/stanbol/apache-stanbol-entityhub/0.10.1-incubating-SNAPSHOT/apache-stanbol-entityhub-0.10.1-incubating-SNAPSHOT.pom
[INFO] ------------------------------------------------------------------------
[INFO] Building Apache Stanbol Ontology Manager Network Manager
[INFO] task-segment: [clean, install]
[INFO] ------------------------------------------------------------------------
[INFO] [clean:clean {execution: default-clean}]
[INFO] Deleting <https://builds.apache.org/job/stanbol-trunk-1.6/ws/trunk/ontologymanager/ontonet/target>
[INFO] [enforcer:enforce {execution: enforce-java}]
[INFO] [remote-resources:process {execution: default}]
[debug] execute contextualize
[INFO] [resources:resources {execution: default-resources}]
[INFO] Using 'UTF-8' encoding to copy filtered resources.
[INFO] Copying 2 resources
[INFO] Copying 4 resources
[INFO] [compiler:compile {execution: default-compile}]
[INFO] Compiling 79 source files to <https://builds.apache.org/job/stanbol-trunk-1.6/ws/trunk/ontologymanager/ontonet/target/classes>
[INFO] -------------------------------------------------------------
[ERROR] COMPILATION ERROR :
[INFO] -------------------------------------------------------------
[ERROR] <https://builds.apache.org/job/stanbol-trunk-1.6/ws/trunk/ontologymanager/ontonet/src/main/java/org/apache/stanbol/ontologymanager/ontonet/api/io/AbstractClerezzaGraphInputSource.java>:[58,51] incompatible types
found : org.semanticweb.owlapi.model.OWLOntologyID
required: org.apache.clerezza.rdf.core.UriRef
[ERROR] <https://builds.apache.org/job/stanbol-trunk-1.6/ws/trunk/ontologymanager/ontonet/src/main/java/org/apache/stanbol/ontologymanager/ontonet/impl/owlapi/AbstractOntologySpaceImpl.java>:[308,25] put(org.semanticweb.owlapi.model.IRI,org.semanticweb.owlapi.model.OWLOntology) in java.util.Map<org.semanticweb.owlapi.model.IRI,org.semanticweb.owlapi.model.OWLOntology> cannot be applied to (org.semanticweb.owlapi.model.OWLOntologyID,org.semanticweb.owlapi.model.OWLOntology)
[ERROR] <https://builds.apache.org/job/stanbol-trunk-1.6/ws/trunk/ontologymanager/ontonet/src/main/java/org/apache/stanbol/ontologymanager/ontonet/impl/owlapi/AbstractOntologySpaceImpl.java>:[310,8] fireOntologyAdded(org.semanticweb.owlapi.model.IRI) in org.apache.stanbol.ontologymanager.ontonet.impl.owlapi.AbstractOntologySpaceImpl cannot be applied to (org.semanticweb.owlapi.model.OWLOntologyID)
[ERROR] <https://builds.apache.org/job/stanbol-trunk-1.6/ws/trunk/ontologymanager/ontonet/src/main/java/org/apache/stanbol/ontologymanager/ontonet/impl/owlapi/AbstractOntologySpaceImpl.java>:[369,50] incompatible types
found : org.semanticweb.owlapi.model.OWLOntologyID
required: org.semanticweb.owlapi.model.IRI
[ERROR] <https://builds.apache.org/job/stanbol-trunk-1.6/ws/trunk/ontologymanager/ontonet/src/main/java/org/apache/stanbol/ontologymanager/ontonet/impl/owlapi/AbstractOntologySpaceImpl.java>:[386,58] incompatible types
found : org.semanticweb.owlapi.model.OWLOntologyID
required: org.semanticweb.owlapi.model.IRI
[ERROR] <https://builds.apache.org/job/stanbol-trunk-1.6/ws/trunk/ontologymanager/ontonet/src/main/java/org/apache/stanbol/ontologymanager/ontonet/impl/clerezza/ClerezzaOntologyProvider.java>:[693,39] cannot find symbol
symbol : method guessOWLOntologyID(org.apache.clerezza.rdf.core.TripleCollection)
location: class org.apache.stanbol.commons.owl.util.OWLUtils
[ERROR] <https://builds.apache.org/job/stanbol-trunk-1.6/ws/trunk/ontologymanager/ontonet/src/main/java/org/apache/stanbol/ontologymanager/ontonet/impl/clerezza/ClerezzaOntologyProvider.java>:[702,59] cannot find symbol
symbol : method getUnicodeString()
location: class org.semanticweb.owlapi.model.OWLOntologyID
[ERROR] <https://builds.apache.org/job/stanbol-trunk-1.6/ws/trunk/ontologymanager/ontonet/src/main/java/org/apache/stanbol/ontologymanager/ontonet/impl/clerezza/AbstractOntologyCollectorImpl.java>:[152,50] incompatible types
found : org.semanticweb.owlapi.model.OWLOntologyID
required: org.apache.clerezza.rdf.core.UriRef
[INFO] 8 errors
[INFO] -------------------------------------------------------------
[JENKINS] Archiving disabled - not archiving <https://builds.apache.org/job/stanbol-trunk-1.6/ws/trunk/ontologymanager/ontonet/pom.xml>
[INFO] ------------------------------------------------------------------------
[ERROR] BUILD FAILURE
[INFO] ------------------------------------------------------------------------
[INFO] Compilation failure
<https://builds.apache.org/job/stanbol-trunk-1.6/ws/trunk/ontologymanager/ontonet/src/main/java/org/apache/stanbol/ontologymanager/ontonet/api/io/AbstractClerezzaGraphInputSource.java>:[58,51] incompatible types
found : org.semanticweb.owlapi.model.OWLOntologyID
required: org.apache.clerezza.rdf.core.UriRef
<https://builds.apache.org/job/stanbol-trunk-1.6/ws/trunk/ontologymanager/ontonet/src/main/java/org/apache/stanbol/ontologymanager/ontonet/impl/owlapi/AbstractOntologySpaceImpl.java>:[308,25] put(org.semanticweb.owlapi.model.IRI,org.semanticweb.owlapi.model.OWLOntology) in java.util.Map<org.semanticweb.owlapi.model.IRI,org.semanticweb.owlapi.model.OWLOntology> cannot be applied to (org.semanticweb.owlapi.model.OWLOntologyID,org.semanticweb.owlapi.model.OWLOntology)
<https://builds.apache.org/job/stanbol-trunk-1.6/ws/trunk/ontologymanager/ontonet/src/main/java/org/apache/stanbol/ontologymanager/ontonet/impl/owlapi/AbstractOntologySpaceImpl.java>:[310,8] fireOntologyAdded(org.semanticweb.owlapi.model.IRI) in org.apache.stanbol.ontologymanager.ontonet.impl.owlapi.AbstractOntologySpaceImpl cannot be applied to (org.semanticweb.owlapi.model.OWLOntologyID)
<https://builds.apache.org/job/stanbol-trunk-1.6/ws/trunk/ontologymanager/ontonet/src/main/java/org/apache/stanbol/ontologymanager/ontonet/impl/owlapi/AbstractOntologySpaceImpl.java>:[369,50] incompatible types
found : org.semanticweb.owlapi.model.OWLOntologyID
required: org.semanticweb.owlapi.model.IRI
<https://builds.apache.org/job/stanbol-trunk-1.6/ws/trunk/ontologymanager/ontonet/src/main/java/org/apache/stanbol/ontologymanager/ontonet/impl/owlapi/AbstractOntologySpaceImpl.java>:[386,58] incompatible types
found : org.semanticweb.owlapi.model.OWLOntologyID
required: org.semanticweb.owlapi.model.IRI
<https://builds.apache.org/job/stanbol-trunk-1.6/ws/trunk/ontologymanager/ontonet/src/main/java/org/apache/stanbol/ontologymanager/ontonet/impl/clerezza/ClerezzaOntologyProvider.java>:[693,39] cannot find symbol
symbol : method guessOWLOntologyID(org.apache.clerezza.rdf.core.TripleCollection)
location: class org.apache.stanbol.commons.owl.util.OWLUtils
<https://builds.apache.org/job/stanbol-trunk-1.6/ws/trunk/ontologymanager/ontonet/src/main/java/org/apache/stanbol/ontologymanager/ontonet/impl/clerezza/ClerezzaOntologyProvider.java>:[702,59] cannot find symbol
symbol : method getUnicodeString()
location: class org.semanticweb.owlapi.model.OWLOntologyID
<https://builds.apache.org/job/stanbol-trunk-1.6/ws/trunk/ontologymanager/ontonet/src/main/java/org/apache/stanbol/ontologymanager/ontonet/impl/clerezza/AbstractOntologyCollectorImpl.java>:[152,50] incompatible types
found : org.semanticweb.owlapi.model.OWLOntologyID
required: org.apache.clerezza.rdf.core.UriRef
[INFO] ------------------------------------------------------------------------
[INFO] For more information, run Maven with the -e switch
[INFO] ------------------------------------------------------------------------
[INFO] Total time: 9 minutes 36 seconds
[INFO] Finished at: Thu Jun 21 15:16:37 UTC 2012
[INFO] Final Memory: 514M/752M
[INFO] ------------------------------------------------------------------------
Sending e-mails to: stanbol-dev@incubator.apache.org
channel stopped
[locks-and-latches] Releasing all the locks
[locks-and-latches] All the locks released
Jenkins build is back to normal : stanbol-trunk-1.6 #964
Posted by Apache Jenkins Server <je...@builds.apache.org>.
See <https://builds.apache.org/job/stanbol-trunk-1.6/964/changes>