You are viewing a plain text version of this content. The canonical link for it is here.
Posted to dev@pdfbox.apache.org by Apache Jenkins Server <je...@builds.apache.org> on 2023/06/15 18:59:08 UTC

Build failed in Jenkins: PDFBox » PDFBox-trunk #1680

See <https://ci-builds.apache.org/job/PDFBox/job/PDFBox-trunk/1680/display/redirect>

Changes:


------------------------------------------
[...truncated 429.52 KB...]
15.06.2023 18:57:46 WARN  font.PDFont:147 - Invalid ToUnicode CMap in font MSReferenceSansSerif
15.06.2023 18:57:46 WARN  font.PDFont:161 - Using predefined identity CMap instead
15.06.2023 18:57:46 INFO  text.TestTextStripper:243 - Preparing to parse PDFBOX-3062-005717-p1.pdf for standard test
15.06.2023 18:57:46 INFO  text.TestTextStripper:239 - Preparing to parse PDFBOX-3062-005717-p1.pdf for sorted test
15.06.2023 18:57:46 INFO  text.TestTextStripper:243 - Preparing to parse PDFBOX-3025.pdf for standard test
15.06.2023 18:57:46 INFO  text.TestTextStripper:239 - Preparing to parse PDFBOX-3025.pdf for sorted test
15.06.2023 18:57:46 INFO  text.TestTextStripper:243 - Preparing to parse data-000001.pdf for standard test
15.06.2023 18:57:46 WARN  pdmodel.PDDocument:977 - You are overwriting the existing file pdfbox6992208277171784278.pdf, this will produce a corrupted file if you're also reading from it
15.06.2023 18:57:46 INFO  text.TestTextStripper:239 - Preparing to parse data-000001.pdf for sorted test
15.06.2023 18:57:46 INFO  text.TestTextStripper:243 - Preparing to parse PDFBOX-5002.pdf for standard test
15.06.2023 18:57:46 INFO  rendering.TestPDFToImage:237 - Comparing: PDFBOX-4750.pdf
15.06.2023 18:57:46 INFO  text.TestTextStripper:239 - Preparing to parse PDFBOX-5002.pdf for sorted test
15.06.2023 18:57:46 INFO  rendering.TestPDFToImage:291 - *** TEST OK *** for file: PDFBOX-4750.pdf-1.png
15.06.2023 18:57:46 INFO  rendering.TestPDFToImage:292 - Deleting: PDFBOX-4750.pdf-1.png
15.06.2023 18:57:46 INFO  rendering.TestPDFToImage:291 - *** TEST OK *** for file: PDFBOX-4750.pdf-2.png
15.06.2023 18:57:46 INFO  rendering.TestPDFToImage:292 - Deleting: PDFBOX-4750.pdf-2.png
[INFO] Tests run: 3, Failures: 0, Errors: 0, Skipped: 0, Time elapsed: 10.806 s - in org.apache.pdfbox.pdfwriter.ContentStreamWriterTest
[INFO] Tests run: 4, Failures: 0, Errors: 0, Skipped: 0, Time elapsed: 11.045 s - in org.apache.pdfbox.text.TestTextStripper
15.06.2023 18:57:46 WARN  font.PDTrueTypeFont:142 - Using fallback font LiberationSerif for CourierNewPSMT
15.06.2023 18:57:46 WARN  pdfparser.BaseParser:932 - Skipped unexpected dir object = '³' at offset 79 (start offset: 78)
15.06.2023 18:57:46 WARN  pdfparser.BaseParser:724 - Corrupt array element at offset 83, start offset: 77
15.06.2023 18:57:46 WARN  pdfparser.BaseParser:932 - Skipped unexpected dir object = '¼' at offset 109 (start offset: 108)
15.06.2023 18:57:46 WARN  pdfparser.COSParser:746 - Object (3:0) at offset 101 does not end with 'endobj' but with ''
15.06.2023 18:57:46 WARN  pdfparser.COSParser:1384 - Removed null object COSObject{3, 0} from pages dictionary
15.06.2023 18:57:46 WARN  pdfparser.COSParser:1301 - found wrong object number. expected [72] found [144]
15.06.2023 18:57:46 WARN  pdfparser.COSParser:1301 - found wrong object number. expected [168] found [199]
15.06.2023 18:57:46 WARN  pdfparser.COSParser:1301 - found wrong object number. expected [200] found [205]
15.06.2023 18:57:46 WARN  pdfparser.COSParser:1301 - found wrong object number. expected [208] found [210]
15.06.2023 18:57:46 WARN  pdfparser.COSParser:1301 - found wrong object number. expected [220] found [225]
15.06.2023 18:57:46 WARN  pdfparser.COSParser:1301 - found wrong object number. expected [239] found [240]
[INFO] Tests run: 8, Failures: 0, Errors: 0, Skipped: 0, Time elapsed: 11.125 s - in org.apache.pdfbox.pdfparser.TestPDFParser
15.06.2023 18:57:46 WARN  font.PDTrueTypeFont:142 - Using fallback font LiberationSerif for CourierNewPSMT
[INFO] Tests run: 4, Failures: 0, Errors: 0, Skipped: 0, Time elapsed: 11.875 s - in org.apache.pdfbox.multipdf.PDFMergerUtilityTest
15.06.2023 18:57:47 WARN  pdmodel.PDDocument:1282 - do not call setAllSecurityToBeRemoved(true) before calling protect(), as protect() implies setAllSecurityToBeRemoved(false)
[INFO] Tests run: 1, Failures: 0, Errors: 0, Skipped: 0, Time elapsed: 12.25 s - in org.apache.pdfbox.util.TestNumberFormatUtil
[INFO] Tests run: 1, Failures: 0, Errors: 0, Skipped: 0, Time elapsed: 12.299 s - in org.apache.pdfbox.rendering.TestQuality
15.06.2023 18:57:49 WARN  pdmodel.PDDocument:1282 - do not call setAllSecurityToBeRemoved(true) before calling protect(), as protect() implies setAllSecurityToBeRemoved(false)
15.06.2023 18:57:50 WARN  pdmodel.PDDocument:1282 - do not call setAllSecurityToBeRemoved(true) before calling protect(), as protect() implies setAllSecurityToBeRemoved(false)
[INFO] Tests run: 1, Failures: 0, Errors: 0, Skipped: 0, Time elapsed: 15.96 s - in org.apache.pdfbox.filter.TestFilters
15.06.2023 18:57:52 WARN  pdmodel.PDDocument:1282 - do not call setAllSecurityToBeRemoved(true) before calling protect(), as protect() implies setAllSecurityToBeRemoved(false)
[INFO] Tests run: 1, Failures: 0, Errors: 0, Skipped: 0, Time elapsed: 18.021 s - in org.apache.pdfbox.encryption.TestSymmetricKeyEncryption
[INFO] 
[INFO] Results:
[INFO] 
[WARNING] Tests run: 658, Failures: 0, Errors: 0, Skipped: 3
[INFO] 
[JENKINS] Recording test results
[INFO] 
[INFO] --- jacoco-maven-plugin:0.8.10:report (report) @ pdfbox ---
[INFO] Loading execution data file <https://ci-builds.apache.org/job/PDFBox/job/PDFBox-trunk/ws/pdfbox/target/jacoco.exec>
[INFO] Analyzed bundle 'Apache PDFBox' with 699 classes
[INFO] 
[INFO] --- animal-sniffer-maven-plugin:1.23:check (check-java-version) @ pdfbox ---
[INFO] Checking unresolved references to org.codehaus.mojo.signature:java18:1.0
[INFO] 
[INFO] --- maven-bundle-plugin:5.1.9:bundle (default-bundle) @ pdfbox ---
[INFO] Building bundle: <https://ci-builds.apache.org/job/PDFBox/job/PDFBox-trunk/ws/pdfbox/target/pdfbox-3.0.0-SNAPSHOT.jar>
[INFO] Writing manifest: <https://ci-builds.apache.org/job/PDFBox/job/PDFBox-trunk/ws/pdfbox/target/classes/META-INF/MANIFEST.MF>
[INFO] 
[INFO] --- maven-site-plugin:3.12.1:attach-descriptor (attach-descriptor) @ pdfbox ---
[INFO] Skipping because packaging 'bundle' is not pom.
[INFO] 
[INFO] >>> maven-source-plugin:3.2.1:jar (attach-sources) > generate-sources @ pdfbox >>>
[INFO] 
[INFO] --- maven-enforcer-plugin:3.3.0:enforce (default) @ pdfbox ---
[INFO] 
[INFO] --- maven-enforcer-plugin:3.3.0:enforce (enforce-maven-version) @ pdfbox ---
[INFO] 
[INFO] --- maven-enforcer-plugin:3.3.0:enforce (enforce-java-version) @ pdfbox ---
[INFO] 
[INFO] --- jacoco-maven-plugin:0.8.10:prepare-agent (default) @ pdfbox ---
[INFO] surefireArgLine set to -javaagent:/home/jenkins/.m2/repository/org/jacoco/org.jacoco.agent/0.8.10/org.jacoco.agent-0.8.10-runtime.jar=destfile=<https://ci-builds.apache.org/job/PDFBox/job/PDFBox-trunk/ws/pdfbox/target/jacoco.exec>
[WARNING] Failed to getClass for org.apache.maven.plugins.source.SourceJarMojo
[INFO] 
[INFO] <<< maven-source-plugin:3.2.1:jar (attach-sources) < generate-sources @ pdfbox <<<
[INFO] 
[INFO] 
[INFO] --- maven-source-plugin:3.2.1:jar (attach-sources) @ pdfbox ---
[INFO] Skipping source per configuration.
[INFO] 
[INFO] --- apache-rat-plugin:0.15:check (default) @ pdfbox ---
[INFO] Enabled default license matchers.
[INFO] Will parse SCM ignores for exclusions...
[INFO] Finished adding exclusions from SCM ignore files.
[INFO] 62 implicit excludes.
[INFO] 21 explicit excludes.
[INFO] 958 resources included
[INFO] Rat check: Summary over all files. Unapproved: 0, unknown: 0, generated: 0, approved: 784 licenses.
[INFO] 
[INFO] --- dependency-check-maven:8.3.1:check (default) @ pdfbox ---
[INFO] Checking for updates
[INFO] Skipping NVD check since last check was within 4 hours.
[INFO] Skipping RetireJS update since last update was within 24 hours.
[INFO] Skipping Hosted Suppressions file update since last update was within 2 hours.
[INFO] Skipping Known Exploited Vulnerabilities update check since last check was within 24 hours.
[INFO] Check for updates complete (46 ms)
[INFO] 

Dependency-Check is an open source tool performing a best effort analysis of 3rd party dependencies; false positives and false negatives may exist in the analysis performed by the tool. Use of the tool and the reporting provided constitutes acceptance for use in an AS IS condition, and there are NO warranties, implied or otherwise, with regard to the analysis or its use. Any use of the tool and the reporting provided is at the user?s risk. In no event shall the copyright holder or OWASP be held liable for any damages whatsoever arising out of or in connection with the use of this tool, the analysis performed, or the resulting report.


   About ODC: https://jeremylong.github.io/DependencyCheck/general/internals.html
   False Positives: https://jeremylong.github.io/DependencyCheck/general/suppression.html

? Sponsor: https://github.com/sponsors/jeremylong


[INFO] Analysis Started
[INFO] Finished Archive Analyzer (0 seconds)
[INFO] Finished File Name Analyzer (0 seconds)
[INFO] Finished Jar Analyzer (0 seconds)
[INFO] Finished Dependency Merging Analyzer (0 seconds)
[INFO] Finished Version Filter Analyzer (0 seconds)
[INFO] Finished Hint Analyzer (0 seconds)
[INFO] Created CPE Index (1 seconds)
[INFO] Finished CPE Analyzer (1 seconds)
[INFO] Finished False Positive Analyzer (0 seconds)
[INFO] Finished NVD CVE Analyzer (0 seconds)
[INFO] Finished Sonatype OSS Index Analyzer (0 seconds)
[INFO] Finished Vulnerability Suppression Analyzer (0 seconds)
[INFO] Finished Known Exploited Vulnerability Analyzer (0 seconds)
[INFO] Finished Dependency Bundling Analyzer (0 seconds)
[INFO] Finished Unused Suppression Rule Analyzer (0 seconds)
[INFO] Analysis Complete (2 seconds)
[INFO] Writing report to: <https://ci-builds.apache.org/job/PDFBox/job/PDFBox-trunk/ws/pdfbox/target/dependency-check-report.html>
[INFO] 
[INFO] --- maven-install-plugin:3.1.0:install (default-install) @ pdfbox ---
[INFO] Installing <https://ci-builds.apache.org/job/PDFBox/job/PDFBox-trunk/ws/pdfbox/pom.xml> to /home/jenkins/.m2/repository/org/apache/pdfbox/pdfbox/3.0.0-SNAPSHOT/pdfbox-3.0.0-SNAPSHOT.pom
[INFO] Installing <https://ci-builds.apache.org/job/PDFBox/job/PDFBox-trunk/ws/pdfbox/target/pdfbox-3.0.0-SNAPSHOT.jar> to /home/jenkins/.m2/repository/org/apache/pdfbox/pdfbox/3.0.0-SNAPSHOT/pdfbox-3.0.0-SNAPSHOT.jar
[INFO] 
[INFO] --- maven-bundle-plugin:5.1.9:install (default-install) @ pdfbox ---
[INFO] Installing org/apache/pdfbox/pdfbox/3.0.0-SNAPSHOT/pdfbox-3.0.0-SNAPSHOT.jar
[INFO] Writing OBR metadata
[INFO] 
[INFO] --- maven-deploy-plugin:2.8.2:deploy (default-deploy) @ pdfbox ---
[INFO] Downloading from apache.snapshots.https: https://repository.apache.org/content/repositories/snapshots/org/apache/pdfbox/pdfbox/3.0.0-SNAPSHOT/maven-metadata.xml
[INFO] Downloaded from apache.snapshots.https: https://repository.apache.org/content/repositories/snapshots/org/apache/pdfbox/pdfbox/3.0.0-SNAPSHOT/maven-metadata.xml (782 B at 1.1 kB/s)
[INFO] Uploading to apache.snapshots.https: https://repository.apache.org/content/repositories/snapshots/org/apache/pdfbox/pdfbox/3.0.0-SNAPSHOT/pdfbox-3.0.0-20230615.185414-3594.jar
[INFO] Uploaded to apache.snapshots.https: https://repository.apache.org/content/repositories/snapshots/org/apache/pdfbox/pdfbox/3.0.0-SNAPSHOT/pdfbox-3.0.0-20230615.185414-3594.jar (2.0 MB at 871 kB/s)
[INFO] Uploading to apache.snapshots.https: https://repository.apache.org/content/repositories/snapshots/org/apache/pdfbox/pdfbox/3.0.0-SNAPSHOT/pdfbox-3.0.0-20230615.185414-3594.pom
[INFO] Uploaded to apache.snapshots.https: https://repository.apache.org/content/repositories/snapshots/org/apache/pdfbox/pdfbox/3.0.0-SNAPSHOT/pdfbox-3.0.0-20230615.185414-3594.pom (44 kB at 43 kB/s)
[INFO] Downloading from apache.snapshots.https: https://repository.apache.org/content/repositories/snapshots/org/apache/pdfbox/pdfbox/maven-metadata.xml
[INFO] Downloaded from apache.snapshots.https: https://repository.apache.org/content/repositories/snapshots/org/apache/pdfbox/pdfbox/maven-metadata.xml (425 B at 1.2 kB/s)
[INFO] Uploading to apache.snapshots.https: https://repository.apache.org/content/repositories/snapshots/org/apache/pdfbox/pdfbox/3.0.0-SNAPSHOT/maven-metadata.xml
[INFO] Uploaded to apache.snapshots.https: https://repository.apache.org/content/repositories/snapshots/org/apache/pdfbox/pdfbox/3.0.0-SNAPSHOT/maven-metadata.xml (782 B at 751 B/s)
[INFO] Uploading to apache.snapshots.https: https://repository.apache.org/content/repositories/snapshots/org/apache/pdfbox/pdfbox/maven-metadata.xml
[INFO] Uploaded to apache.snapshots.https: https://repository.apache.org/content/repositories/snapshots/org/apache/pdfbox/pdfbox/maven-metadata.xml (425 B at 409 B/s)
[INFO] 
[INFO] --- maven-bundle-plugin:5.1.9:deploy (default-deploy) @ pdfbox ---
[INFO] Remote OBR update disabled (enable with -DremoteOBR)
[INFO] 
[INFO] --- ossindex-maven-plugin:3.1.0:audit (default-cli) @ pdfbox ---
[INFO] Checking for vulnerabilities; 26 artifacts
[INFO] Exclude coordinates: []
[INFO] Exclude vulnerability identifiers: []
[INFO] CVSS-score threshold: 0.0
[INFO] 
[INFO] --------------------< org.apache.pdfbox:preflight >---------------------
[INFO] Building Apache Preflight 3.0.0-SNAPSHOT                          [6/13]
[INFO] -------------------------------[ bundle ]-------------------------------
[INFO] 
[INFO] --- maven-clean-plugin:3.2.0:clean (default-clean) @ preflight ---
[INFO] 
[INFO] --- maven-enforcer-plugin:3.3.0:enforce (default) @ preflight ---
[INFO] 
[INFO] --- maven-enforcer-plugin:3.3.0:enforce (enforce-maven-version) @ preflight ---
[INFO] 
[INFO] --- maven-enforcer-plugin:3.3.0:enforce (enforce-java-version) @ preflight ---
[INFO] 
[INFO] --- jacoco-maven-plugin:0.8.10:prepare-agent (default) @ preflight ---
[INFO] surefireArgLine set to -javaagent:/home/jenkins/.m2/repository/org/jacoco/org.jacoco.agent/0.8.10/org.jacoco.agent-0.8.10-runtime.jar=destfile=<https://ci-builds.apache.org/job/PDFBox/job/PDFBox-trunk/ws/preflight/target/jacoco.exec>
[INFO] 
[INFO] --- maven-remote-resources-plugin:1.7.0:process (process-resource-bundles) @ preflight ---
[INFO] Preparing remote bundle org.apache:apache-jar-resource-bundle:1.4
[INFO] Copying 3 resources from 1 bundle.
[INFO] 
[INFO] --- maven-resources-plugin:3.3.0:resources (default-resources) @ preflight ---
[INFO] Copying 0 resource
[INFO] Copying 3 resources
[INFO] 
[INFO] --- maven-compiler-plugin:3.10.1:compile (default-compile) @ preflight ---
[INFO] Changes detected - recompiling the module!
[INFO] Compiling 116 source files to <https://ci-builds.apache.org/job/PDFBox/job/PDFBox-trunk/ws/preflight/target/classes>
[INFO] <https://ci-builds.apache.org/job/PDFBox/job/PDFBox-trunk/ws/preflight/src/main/java/org/apache/pdfbox/preflight/font/descriptor/FontDescriptorHelper.java>: <https://ci-builds.apache.org/job/PDFBox/job/PDFBox-trunk/ws/preflight/src/main/java/org/apache/pdfbox/preflight/font/descriptor/FontDescriptorHelper.java> uses unchecked or unsafe operations.
[INFO] <https://ci-builds.apache.org/job/PDFBox/job/PDFBox-trunk/ws/preflight/src/main/java/org/apache/pdfbox/preflight/font/descriptor/FontDescriptorHelper.java>: Recompile with -Xlint:unchecked for details.
[INFO] 
[INFO] --- download-maven-plugin:1.7.0:wget (get-isartor) @ preflight ---
[INFO] 
[INFO] --- download-maven-plugin:1.7.0:wget (get-bavaria) @ preflight ---
[INFO] ------------------------------------------------------------------------
[INFO] Reactor Summary for Apache PDFBox 3.0.0-SNAPSHOT:
[INFO] 
[INFO] PDFBox parent ...................................... SUCCESS [ 27.291 s]
[INFO] Apache PDFBox io ................................... SUCCESS [ 57.110 s]
[INFO] Apache FontBox ..................................... SUCCESS [ 35.448 s]
[INFO] Apache XmpBox ...................................... SUCCESS [ 26.201 s]
[INFO] Apache PDFBox ...................................... SUCCESS [01:21 min]
[INFO] Apache Preflight ................................... FAILURE [  5.755 s]
[INFO] Apache Preflight application ....................... SKIPPED
[INFO] Apache PDFBox Debugger ............................. SKIPPED
[INFO] Apache PDFBox tools ................................ SKIPPED
[INFO] Apache PDFBox application .......................... SKIPPED
[INFO] Apache PDFBox Debugger application ................. SKIPPED
[INFO] Apache PDFBox examples ............................. SKIPPED
[INFO] Apache PDFBox ...................................... SKIPPED
[INFO] ------------------------------------------------------------------------
[INFO] BUILD FAILURE
[INFO] ------------------------------------------------------------------------
[INFO] Total time:  04:28 min
[INFO] Finished at: 2023-06-15T18:58:43Z
[INFO] ------------------------------------------------------------------------
Waiting for Jenkins to finish collecting data
[ERROR] Failed to execute goal com.googlecode.maven-download-plugin:download-maven-plugin:1.7.0:wget (get-bavaria) on project preflight: Connect to web.archive.org:443 [web.archive.org/207.241.237.3] failed: Connection refused (Connection refused) -> [Help 1]
[ERROR] 
[ERROR] To see the full stack trace of the errors, re-run Maven with the -e switch.
[ERROR] Re-run Maven using the -X switch to enable full debug logging.
[ERROR] 
[ERROR] For more information about the errors and possible solutions, please read the following articles:
[ERROR] [Help 1] http://cwiki.apache.org/confluence/display/MAVEN/ConnectException
[ERROR] 
[ERROR] After correcting the problems, you can resume the build with the command
[ERROR]   mvn <goals> -rf :preflight
[JENKINS] Archiving <https://ci-builds.apache.org/job/PDFBox/job/PDFBox-trunk/ws/examples/pom.xml> to org.apache.pdfbox/pdfbox-examples/3.0.0-SNAPSHOT/pdfbox-examples-3.0.0-SNAPSHOT.pom
[JENKINS] Archiving <https://ci-builds.apache.org/job/PDFBox/job/PDFBox-trunk/ws/parent/pom.xml> to org.apache.pdfbox/pdfbox-parent/3.0.0-SNAPSHOT/pdfbox-parent-3.0.0-SNAPSHOT.pom
[JENKINS] Archiving <https://ci-builds.apache.org/job/PDFBox/job/PDFBox-trunk/ws/pdfbox/pom.xml> to org.apache.pdfbox/pdfbox/3.0.0-SNAPSHOT/pdfbox-3.0.0-SNAPSHOT.pom
[JENKINS] Archiving <https://ci-builds.apache.org/job/PDFBox/job/PDFBox-trunk/ws/pdfbox/target/pdfbox-3.0.0-SNAPSHOT.jar> to org.apache.pdfbox/pdfbox/3.0.0-20230615.185414-3594/pdfbox-3.0.0-20230615.185414-3594.jar
[JENKINS] Archiving <https://ci-builds.apache.org/job/PDFBox/job/PDFBox-trunk/ws/debugger-app/pom.xml> to org.apache.pdfbox/debugger-app/3.0.0-SNAPSHOT/debugger-app-3.0.0-SNAPSHOT.pom
[JENKINS] Archiving <https://ci-builds.apache.org/job/PDFBox/job/PDFBox-trunk/ws/io/pom.xml> to org.apache.pdfbox/pdfbox-io/3.0.0-SNAPSHOT/pdfbox-io-3.0.0-SNAPSHOT.pom
[JENKINS] Archiving <https://ci-builds.apache.org/job/PDFBox/job/PDFBox-trunk/ws/io/target/pdfbox-io-3.0.0-SNAPSHOT.jar> to org.apache.pdfbox/pdfbox-io/3.0.0-20230615.185414-31/pdfbox-io-3.0.0-20230615.185414-31.jar
[JENKINS] Archiving <https://ci-builds.apache.org/job/PDFBox/job/PDFBox-trunk/ws/fontbox/pom.xml> to org.apache.pdfbox/fontbox/3.0.0-SNAPSHOT/fontbox-3.0.0-SNAPSHOT.pom
[JENKINS] Archiving <https://ci-builds.apache.org/job/PDFBox/job/PDFBox-trunk/ws/fontbox/target/fontbox-3.0.0-SNAPSHOT.jar> to org.apache.pdfbox/fontbox/3.0.0-20230615.185414-3671/fontbox-3.0.0-20230615.185414-3671.jar
[JENKINS] Archiving <https://ci-builds.apache.org/job/PDFBox/job/PDFBox-trunk/ws/xmpbox/pom.xml> to org.apache.pdfbox/xmpbox/3.0.0-SNAPSHOT/xmpbox-3.0.0-SNAPSHOT.pom
[JENKINS] Archiving <https://ci-builds.apache.org/job/PDFBox/job/PDFBox-trunk/ws/xmpbox/target/xmpbox-3.0.0-SNAPSHOT.jar> to org.apache.pdfbox/xmpbox/3.0.0-20230615.185414-3663/xmpbox-3.0.0-20230615.185414-3663.jar
[JENKINS] Archiving <https://ci-builds.apache.org/job/PDFBox/job/PDFBox-trunk/ws/tools/pom.xml> to org.apache.pdfbox/pdfbox-tools/3.0.0-SNAPSHOT/pdfbox-tools-3.0.0-SNAPSHOT.pom
[JENKINS] Archiving <https://ci-builds.apache.org/job/PDFBox/job/PDFBox-trunk/ws/debugger/pom.xml> to org.apache.pdfbox/pdfbox-debugger/3.0.0-SNAPSHOT/pdfbox-debugger-3.0.0-SNAPSHOT.pom
[JENKINS] Archiving <https://ci-builds.apache.org/job/PDFBox/job/PDFBox-trunk/ws/preflight-app/pom.xml> to org.apache.pdfbox/preflight-app/3.0.0-SNAPSHOT/preflight-app-3.0.0-SNAPSHOT.pom
[JENKINS] Archiving <https://ci-builds.apache.org/job/PDFBox/job/PDFBox-trunk/ws/app/pom.xml> to org.apache.pdfbox/pdfbox-app/3.0.0-SNAPSHOT/pdfbox-app-3.0.0-SNAPSHOT.pom
[JENKINS] Archiving <https://ci-builds.apache.org/job/PDFBox/job/PDFBox-trunk/ws/preflight/pom.xml> to org.apache.pdfbox/preflight/3.0.0-SNAPSHOT/preflight-3.0.0-SNAPSHOT.pom
[JENKINS] Archiving <https://ci-builds.apache.org/job/PDFBox/job/PDFBox-trunk/ws/pom.xml> to org.apache.pdfbox/pdfbox-reactor/3.0.0-SNAPSHOT/pdfbox-reactor-3.0.0-SNAPSHOT.pom
No mail will be sent out, as 'PDFBox » PDFBox-trunk » Apache PDFBox examples #1680' does not have a result yet. Please make sure you set a proper result in case of pipeline/build scripts.
No mail will be sent out, as 'PDFBox » PDFBox-trunk » Apache PDFBox Debugger application #1680' does not have a result yet. Please make sure you set a proper result in case of pipeline/build scripts.
No mail will be sent out, as 'PDFBox » PDFBox-trunk » Apache PDFBox tools #1680' does not have a result yet. Please make sure you set a proper result in case of pipeline/build scripts.
No mail will be sent out, as 'PDFBox » PDFBox-trunk » Apache PDFBox Debugger #1680' does not have a result yet. Please make sure you set a proper result in case of pipeline/build scripts.
No mail will be sent out, as 'PDFBox » PDFBox-trunk » Apache Preflight application #1680' does not have a result yet. Please make sure you set a proper result in case of pipeline/build scripts.
No mail will be sent out, as 'PDFBox » PDFBox-trunk » Apache PDFBox application #1680' does not have a result yet. Please make sure you set a proper result in case of pipeline/build scripts.
Sending e-mails to: dev@pdfbox.apache.org
No mail will be sent out, as 'PDFBox » PDFBox-trunk » Apache PDFBox #1680' does not have a result yet. Please make sure you set a proper result in case of pipeline/build scripts.
channel stopped
Archiving artifacts

---------------------------------------------------------------------
To unsubscribe, e-mail: dev-unsubscribe@pdfbox.apache.org
For additional commands, e-mail: dev-help@pdfbox.apache.org


Jenkins build is back to normal : PDFBox » PDFBox-trunk #1683

Posted by Apache Jenkins Server <je...@builds.apache.org>.
See <https://ci-builds.apache.org/job/PDFBox/job/PDFBox-trunk/1683/display/redirect?page=changes>


---------------------------------------------------------------------
To unsubscribe, e-mail: dev-unsubscribe@pdfbox.apache.org
For additional commands, e-mail: dev-help@pdfbox.apache.org


Build failed in Jenkins: PDFBox » PDFBox-trunk #1682

Posted by Apache Jenkins Server <je...@builds.apache.org>.
See <https://ci-builds.apache.org/job/PDFBox/job/PDFBox-trunk/1682/display/redirect>

Changes:


------------------------------------------
[...truncated 441.03 KB...]
[INFO] 
[INFO] >>> maven-source-plugin:3.2.1:jar (attach-sources) > generate-sources @ pdfbox >>>
[INFO] 
[INFO] --- maven-enforcer-plugin:3.3.0:enforce (default) @ pdfbox ---
[INFO] 
[INFO] --- maven-enforcer-plugin:3.3.0:enforce (enforce-maven-version) @ pdfbox ---
[INFO] 
[INFO] --- maven-enforcer-plugin:3.3.0:enforce (enforce-java-version) @ pdfbox ---
[INFO] 
[INFO] --- jacoco-maven-plugin:0.8.10:prepare-agent (default) @ pdfbox ---
[INFO] surefireArgLine set to -javaagent:/home/jenkins/.m2/repository/org/jacoco/org.jacoco.agent/0.8.10/org.jacoco.agent-0.8.10-runtime.jar=destfile=<https://ci-builds.apache.org/job/PDFBox/job/PDFBox-trunk/ws/pdfbox/target/jacoco.exec>
[WARNING] Failed to getClass for org.apache.maven.plugins.source.SourceJarMojo
[INFO] 
[INFO] <<< maven-source-plugin:3.2.1:jar (attach-sources) < generate-sources @ pdfbox <<<
[INFO] 
[INFO] 
[INFO] --- maven-source-plugin:3.2.1:jar (attach-sources) @ pdfbox ---
[INFO] Skipping source per configuration.
[INFO] 
[INFO] --- apache-rat-plugin:0.15:check (default) @ pdfbox ---
[INFO] Enabled default license matchers.
[INFO] Will parse SCM ignores for exclusions...
[INFO] Finished adding exclusions from SCM ignore files.
[INFO] 62 implicit excludes.
[INFO] 21 explicit excludes.
[INFO] 958 resources included
[INFO] Rat check: Summary over all files. Unapproved: 0, unknown: 0, generated: 0, approved: 784 licenses.
[INFO] 
[INFO] --- dependency-check-maven:8.3.1:check (default) @ pdfbox ---
[INFO] Checking for updates
[INFO] Skipping NVD check since last check was within 4 hours.
[INFO] Skipping RetireJS update since last update was within 24 hours.
[INFO] Skipping Hosted Suppressions file update since last update was within 2 hours.
[INFO] Skipping Known Exploited Vulnerabilities update check since last check was within 24 hours.
[INFO] Check for updates complete (276 ms)
[INFO] 

Dependency-Check is an open source tool performing a best effort analysis of 3rd party dependencies; false positives and false negatives may exist in the analysis performed by the tool. Use of the tool and the reporting provided constitutes acceptance for use in an AS IS condition, and there are NO warranties, implied or otherwise, with regard to the analysis or its use. Any use of the tool and the reporting provided is at the user?s risk. In no event shall the copyright holder or OWASP be held liable for any damages whatsoever arising out of or in connection with the use of this tool, the analysis performed, or the resulting report.


   About ODC: https://jeremylong.github.io/DependencyCheck/general/internals.html
   False Positives: https://jeremylong.github.io/DependencyCheck/general/suppression.html

? Sponsor: https://github.com/sponsors/jeremylong


[INFO] Analysis Started
[INFO] Finished Archive Analyzer (0 seconds)
[INFO] Finished File Name Analyzer (0 seconds)
[INFO] Finished Jar Analyzer (0 seconds)
[INFO] Finished Dependency Merging Analyzer (0 seconds)
[INFO] Finished Version Filter Analyzer (0 seconds)
[INFO] Finished Hint Analyzer (0 seconds)
[INFO] Created CPE Index (2 seconds)
[INFO] Finished CPE Analyzer (2 seconds)
[INFO] Finished False Positive Analyzer (0 seconds)
[INFO] Finished NVD CVE Analyzer (0 seconds)
[INFO] Finished Sonatype OSS Index Analyzer (0 seconds)
[INFO] Finished Vulnerability Suppression Analyzer (0 seconds)
[INFO] Finished Known Exploited Vulnerability Analyzer (0 seconds)
[INFO] Finished Dependency Bundling Analyzer (0 seconds)
[INFO] Finished Unused Suppression Rule Analyzer (0 seconds)
[INFO] Analysis Complete (4 seconds)
[INFO] Writing report to: <https://ci-builds.apache.org/job/PDFBox/job/PDFBox-trunk/ws/pdfbox/target/dependency-check-report.html>
[INFO] 
[INFO] --- maven-install-plugin:3.1.0:install (default-install) @ pdfbox ---
[INFO] Installing <https://ci-builds.apache.org/job/PDFBox/job/PDFBox-trunk/ws/pdfbox/pom.xml> to /home/jenkins/.m2/repository/org/apache/pdfbox/pdfbox/3.0.0-SNAPSHOT/pdfbox-3.0.0-SNAPSHOT.pom
[INFO] Installing <https://ci-builds.apache.org/job/PDFBox/job/PDFBox-trunk/ws/pdfbox/target/pdfbox-3.0.0-SNAPSHOT.jar> to /home/jenkins/.m2/repository/org/apache/pdfbox/pdfbox/3.0.0-SNAPSHOT/pdfbox-3.0.0-SNAPSHOT.jar
[INFO] 
[INFO] --- maven-bundle-plugin:5.1.9:install (default-install) @ pdfbox ---
[INFO] Installing org/apache/pdfbox/pdfbox/3.0.0-SNAPSHOT/pdfbox-3.0.0-SNAPSHOT.jar
[INFO] Writing OBR metadata
[INFO] 
[INFO] --- maven-deploy-plugin:2.8.2:deploy (default-deploy) @ pdfbox ---
[INFO] Downloading from apache.snapshots.https: https://repository.apache.org/content/repositories/snapshots/org/apache/pdfbox/pdfbox/3.0.0-SNAPSHOT/maven-metadata.xml
[INFO] Downloaded from apache.snapshots.https: https://repository.apache.org/content/repositories/snapshots/org/apache/pdfbox/pdfbox/3.0.0-SNAPSHOT/maven-metadata.xml (782 B at 951 B/s)
[INFO] Uploading to apache.snapshots.https: https://repository.apache.org/content/repositories/snapshots/org/apache/pdfbox/pdfbox/3.0.0-SNAPSHOT/pdfbox-3.0.0-20230616.020515-3596.jar
[INFO] Uploaded to apache.snapshots.https: https://repository.apache.org/content/repositories/snapshots/org/apache/pdfbox/pdfbox/3.0.0-SNAPSHOT/pdfbox-3.0.0-20230616.020515-3596.jar (2.0 MB at 367 kB/s)
[INFO] Uploading to apache.snapshots.https: https://repository.apache.org/content/repositories/snapshots/org/apache/pdfbox/pdfbox/3.0.0-SNAPSHOT/pdfbox-3.0.0-20230616.020515-3596.pom
[INFO] Uploaded to apache.snapshots.https: https://repository.apache.org/content/repositories/snapshots/org/apache/pdfbox/pdfbox/3.0.0-SNAPSHOT/pdfbox-3.0.0-20230616.020515-3596.pom (44 kB at 42 kB/s)
[INFO] Downloading from apache.snapshots.https: https://repository.apache.org/content/repositories/snapshots/org/apache/pdfbox/pdfbox/maven-metadata.xml
[INFO] Downloaded from apache.snapshots.https: https://repository.apache.org/content/repositories/snapshots/org/apache/pdfbox/pdfbox/maven-metadata.xml (425 B at 1.3 kB/s)
[INFO] Uploading to apache.snapshots.https: https://repository.apache.org/content/repositories/snapshots/org/apache/pdfbox/pdfbox/3.0.0-SNAPSHOT/maven-metadata.xml
[INFO] Uploaded to apache.snapshots.https: https://repository.apache.org/content/repositories/snapshots/org/apache/pdfbox/pdfbox/3.0.0-SNAPSHOT/maven-metadata.xml (782 B at 696 B/s)
[INFO] Uploading to apache.snapshots.https: https://repository.apache.org/content/repositories/snapshots/org/apache/pdfbox/pdfbox/maven-metadata.xml
[INFO] Uploaded to apache.snapshots.https: https://repository.apache.org/content/repositories/snapshots/org/apache/pdfbox/pdfbox/maven-metadata.xml (425 B at 382 B/s)
[INFO] 
[INFO] --- maven-bundle-plugin:5.1.9:deploy (default-deploy) @ pdfbox ---
[INFO] Remote OBR update disabled (enable with -DremoteOBR)
[INFO] 
[INFO] --- ossindex-maven-plugin:3.2.0:audit (default-cli) @ pdfbox ---
[INFO] Checking for vulnerabilities; 26 artifacts
[INFO] Exclude coordinates: []
[INFO] Exclude vulnerability identifiers: []
[INFO] CVSS-score threshold: 0.0
[INFO] 
[INFO] --------------------< org.apache.pdfbox:preflight >---------------------
[INFO] Building Apache Preflight 3.0.0-SNAPSHOT                          [6/13]
[INFO] -------------------------------[ bundle ]-------------------------------
[INFO] 
[INFO] --- maven-clean-plugin:3.2.0:clean (default-clean) @ preflight ---
[INFO] 
[INFO] --- maven-enforcer-plugin:3.3.0:enforce (default) @ preflight ---
[INFO] 
[INFO] --- maven-enforcer-plugin:3.3.0:enforce (enforce-maven-version) @ preflight ---
[INFO] 
[INFO] --- maven-enforcer-plugin:3.3.0:enforce (enforce-java-version) @ preflight ---
[INFO] 
[INFO] --- jacoco-maven-plugin:0.8.10:prepare-agent (default) @ preflight ---
[INFO] surefireArgLine set to -javaagent:/home/jenkins/.m2/repository/org/jacoco/org.jacoco.agent/0.8.10/org.jacoco.agent-0.8.10-runtime.jar=destfile=<https://ci-builds.apache.org/job/PDFBox/job/PDFBox-trunk/ws/preflight/target/jacoco.exec>
[INFO] 
[INFO] --- maven-remote-resources-plugin:1.7.0:process (process-resource-bundles) @ preflight ---
[INFO] Preparing remote bundle org.apache:apache-jar-resource-bundle:1.4
[INFO] Copying 3 resources from 1 bundle.
[INFO] 
[INFO] --- maven-resources-plugin:3.3.0:resources (default-resources) @ preflight ---
[INFO] Copying 0 resource
[INFO] Copying 3 resources
[INFO] 
[INFO] --- maven-compiler-plugin:3.10.1:compile (default-compile) @ preflight ---
[INFO] Changes detected - recompiling the module!
[INFO] Compiling 116 source files to <https://ci-builds.apache.org/job/PDFBox/job/PDFBox-trunk/ws/preflight/target/classes>
[INFO] <https://ci-builds.apache.org/job/PDFBox/job/PDFBox-trunk/ws/preflight/src/main/java/org/apache/pdfbox/preflight/font/descriptor/FontDescriptorHelper.java>: <https://ci-builds.apache.org/job/PDFBox/job/PDFBox-trunk/ws/preflight/src/main/java/org/apache/pdfbox/preflight/font/descriptor/FontDescriptorHelper.java> uses unchecked or unsafe operations.
[INFO] <https://ci-builds.apache.org/job/PDFBox/job/PDFBox-trunk/ws/preflight/src/main/java/org/apache/pdfbox/preflight/font/descriptor/FontDescriptorHelper.java>: Recompile with -Xlint:unchecked for details.
[INFO] 
[INFO] --- download-maven-plugin:1.7.0:wget (get-isartor) @ preflight ---
[INFO] 
[INFO] --- download-maven-plugin:1.7.0:wget (get-bavaria) @ preflight ---
[ERROR] 
java.net.SocketTimeoutException: Read timed out
    at java.net.SocketInputStream.socketRead0 (Native Method)
    at java.net.SocketInputStream.socketRead (SocketInputStream.java:115)
    at java.net.SocketInputStream.read (SocketInputStream.java:168)
    at java.net.SocketInputStream.read (SocketInputStream.java:140)
    at sun.security.ssl.SSLSocketInputRecord.read (SSLSocketInputRecord.java:478)
    at sun.security.ssl.SSLSocketInputRecord.readFully (SSLSocketInputRecord.java:461)
    at sun.security.ssl.SSLSocketInputRecord.decodeInputRecord (SSLSocketInputRecord.java:243)
    at sun.security.ssl.SSLSocketInputRecord.decode (SSLSocketInputRecord.java:181)
    at sun.security.ssl.SSLTransport.decode (SSLTransport.java:111)
    at sun.security.ssl.SSLSocketImpl.decode (SSLSocketImpl.java:1509)
    at sun.security.ssl.SSLSocketImpl.readApplicationRecord (SSLSocketImpl.java:1476)
    at sun.security.ssl.SSLSocketImpl$AppInputStream.read (SSLSocketImpl.java:1065)
    at org.apache.http.impl.io.SessionInputBufferImpl.streamRead (SessionInputBufferImpl.java:137)
    at org.apache.http.impl.io.SessionInputBufferImpl.read (SessionInputBufferImpl.java:197)
    at org.apache.http.impl.io.ContentLengthInputStream.read (ContentLengthInputStream.java:176)
    at org.apache.http.conn.EofSensorInputStream.read (EofSensorInputStream.java:135)
    at org.apache.http.conn.EofSensorInputStream.read (EofSensorInputStream.java:148)
    at com.googlecode.download.maven.plugin.internal.HttpFileRequester.handleResponse (HttpFileRequester.java:306)
    at com.googlecode.download.maven.plugin.internal.HttpFileRequester.lambda$download$0 (HttpFileRequester.java:271)
    at org.apache.http.impl.client.CloseableHttpClient.execute (CloseableHttpClient.java:223)
    at org.apache.http.impl.client.CloseableHttpClient.execute (CloseableHttpClient.java:165)
    at com.googlecode.download.maven.plugin.internal.HttpFileRequester.download (HttpFileRequester.java:271)
    at com.googlecode.download.maven.plugin.internal.WGetMojo.doGet (WGetMojo.java:510)
    at com.googlecode.download.maven.plugin.internal.WGetMojo.execute (WGetMojo.java:390)
    at org.apache.maven.plugin.DefaultBuildPluginManager.executeMojo (DefaultBuildPluginManager.java:137)
    at org.apache.maven.lifecycle.internal.MojoExecutor.doExecute2 (MojoExecutor.java:370)
    at org.apache.maven.lifecycle.internal.MojoExecutor.doExecute (MojoExecutor.java:351)
    at org.apache.maven.lifecycle.internal.MojoExecutor.execute (MojoExecutor.java:215)
    at org.apache.maven.lifecycle.internal.MojoExecutor.execute (MojoExecutor.java:171)
    at org.apache.maven.lifecycle.internal.MojoExecutor.execute (MojoExecutor.java:163)
    at org.apache.maven.lifecycle.internal.LifecycleModuleBuilder.buildProject (LifecycleModuleBuilder.java:117)
    at org.apache.maven.lifecycle.internal.LifecycleModuleBuilder.buildProject (LifecycleModuleBuilder.java:81)
    at org.apache.maven.lifecycle.internal.builder.singlethreaded.SingleThreadedBuilder.build (SingleThreadedBuilder.java:56)
    at org.apache.maven.lifecycle.internal.LifecycleStarter.execute (LifecycleStarter.java:128)
    at org.apache.maven.DefaultMaven.doExecute (DefaultMaven.java:298)
    at org.apache.maven.DefaultMaven.doExecute (DefaultMaven.java:192)
    at org.apache.maven.DefaultMaven.execute (DefaultMaven.java:105)
    at org.jvnet.hudson.maven3.launcher.Maven35Launcher.main (Maven35Launcher.java:138)
    at jdk.internal.reflect.NativeMethodAccessorImpl.invoke0 (Native Method)
    at jdk.internal.reflect.NativeMethodAccessorImpl.invoke (NativeMethodAccessorImpl.java:62)
    at jdk.internal.reflect.DelegatingMethodAccessorImpl.invoke (DelegatingMethodAccessorImpl.java:43)
    at java.lang.reflect.Method.invoke (Method.java:566)
    at org.codehaus.plexus.classworlds.launcher.Launcher.launchEnhanced (Launcher.java:282)
    at org.codehaus.plexus.classworlds.launcher.Launcher.launch (Launcher.java:225)
    at jenkins.maven3.agent.Maven35Main.launch (Maven35Main.java:179)
    at jdk.internal.reflect.NativeMethodAccessorImpl.invoke0 (Native Method)
    at jdk.internal.reflect.NativeMethodAccessorImpl.invoke (NativeMethodAccessorImpl.java:62)
    at jdk.internal.reflect.DelegatingMethodAccessorImpl.invoke (DelegatingMethodAccessorImpl.java:43)
    at java.lang.reflect.Method.invoke (Method.java:566)
    at hudson.maven.Maven3Builder.call (Maven3Builder.java:139)
    at hudson.maven.Maven3Builder.call (Maven3Builder.java:70)
    at hudson.remoting.UserRequest.perform (UserRequest.java:211)
    at hudson.remoting.UserRequest.perform (UserRequest.java:54)
    at hudson.remoting.Request$2.run (Request.java:377)
    at hudson.remoting.InterceptingExecutorService.lambda$wrap$0 (InterceptingExecutorService.java:78)
    at java.util.concurrent.FutureTask.run (FutureTask.java:264)
    at java.util.concurrent.ThreadPoolExecutor.runWorker (ThreadPoolExecutor.java:1128)
    at java.util.concurrent.ThreadPoolExecutor$Worker.run (ThreadPoolExecutor.java:628)
    at java.lang.Thread.run (Thread.java:829)
[INFO] ------------------------------------------------------------------------
[INFO] Reactor Summary for Apache PDFBox 3.0.0-SNAPSHOT:
[INFO] 
[INFO] PDFBox parent ...................................... SUCCESS [01:29 min]
[INFO] Apache PDFBox io ................................... SUCCESS [01:11 min]
[INFO] Apache FontBox ..................................... SUCCESS [ 49.110 s]
[INFO] Apache XmpBox ...................................... SUCCESS [ 34.030 s]
[INFO] Apache PDFBox ...................................... SUCCESS [01:44 min]
[INFO] Apache Preflight ................................... FAILURE [ 26.154 s]
[INFO] Apache Preflight application ....................... SKIPPED
[INFO] Apache PDFBox Debugger ............................. SKIPPED
[INFO] Apache PDFBox tools ................................ SKIPPED
[INFO] Apache PDFBox application .......................... SKIPPED
[INFO] Apache PDFBox Debugger application ................. SKIPPED
[INFO] Apache PDFBox examples ............................. SKIPPED
[INFO] Apache PDFBox ...................................... SKIPPED
[INFO] ------------------------------------------------------------------------
[INFO] BUILD FAILURE
[INFO] ------------------------------------------------------------------------
[INFO] Total time:  06:51 min
[INFO] Finished at: 2023-06-16T02:12:07Z
[INFO] ------------------------------------------------------------------------
Waiting for Jenkins to finish collecting data
[ERROR] Failed to execute goal com.googlecode.maven-download-plugin:download-maven-plugin:1.7.0:wget (get-bavaria) on project preflight: Read timed out -> [Help 1]
[ERROR] 
[ERROR] To see the full stack trace of the errors, re-run Maven with the -e switch.
[ERROR] Re-run Maven using the -X switch to enable full debug logging.
[ERROR] 
[ERROR] For more information about the errors and possible solutions, please read the following articles:
[ERROR] [Help 1] http://cwiki.apache.org/confluence/display/MAVEN/MojoExecutionException
[ERROR] 
[ERROR] After correcting the problems, you can resume the build with the command
[ERROR]   mvn <goals> -rf :preflight
[JENKINS] Archiving <https://ci-builds.apache.org/job/PDFBox/job/PDFBox-trunk/ws/examples/pom.xml> to org.apache.pdfbox/pdfbox-examples/3.0.0-SNAPSHOT/pdfbox-examples-3.0.0-SNAPSHOT.pom
[JENKINS] Archiving <https://ci-builds.apache.org/job/PDFBox/job/PDFBox-trunk/ws/parent/pom.xml> to org.apache.pdfbox/pdfbox-parent/3.0.0-SNAPSHOT/pdfbox-parent-3.0.0-SNAPSHOT.pom
[JENKINS] Archiving <https://ci-builds.apache.org/job/PDFBox/job/PDFBox-trunk/ws/pdfbox/pom.xml> to org.apache.pdfbox/pdfbox/3.0.0-SNAPSHOT/pdfbox-3.0.0-SNAPSHOT.pom
[JENKINS] Archiving <https://ci-builds.apache.org/job/PDFBox/job/PDFBox-trunk/ws/pdfbox/target/pdfbox-3.0.0-SNAPSHOT.jar> to org.apache.pdfbox/pdfbox/3.0.0-20230616.020515-3596/pdfbox-3.0.0-20230616.020515-3596.jar
[JENKINS] Archiving <https://ci-builds.apache.org/job/PDFBox/job/PDFBox-trunk/ws/debugger-app/pom.xml> to org.apache.pdfbox/debugger-app/3.0.0-SNAPSHOT/debugger-app-3.0.0-SNAPSHOT.pom
[JENKINS] Archiving <https://ci-builds.apache.org/job/PDFBox/job/PDFBox-trunk/ws/io/pom.xml> to org.apache.pdfbox/pdfbox-io/3.0.0-SNAPSHOT/pdfbox-io-3.0.0-SNAPSHOT.pom
[JENKINS] Archiving <https://ci-builds.apache.org/job/PDFBox/job/PDFBox-trunk/ws/io/target/pdfbox-io-3.0.0-SNAPSHOT.jar> to org.apache.pdfbox/pdfbox-io/3.0.0-20230616.020515-33/pdfbox-io-3.0.0-20230616.020515-33.jar
[JENKINS] Archiving <https://ci-builds.apache.org/job/PDFBox/job/PDFBox-trunk/ws/fontbox/pom.xml> to org.apache.pdfbox/fontbox/3.0.0-SNAPSHOT/fontbox-3.0.0-SNAPSHOT.pom
[JENKINS] Archiving <https://ci-builds.apache.org/job/PDFBox/job/PDFBox-trunk/ws/fontbox/target/fontbox-3.0.0-SNAPSHOT.jar> to org.apache.pdfbox/fontbox/3.0.0-20230616.020515-3673/fontbox-3.0.0-20230616.020515-3673.jar
[JENKINS] Archiving <https://ci-builds.apache.org/job/PDFBox/job/PDFBox-trunk/ws/xmpbox/pom.xml> to org.apache.pdfbox/xmpbox/3.0.0-SNAPSHOT/xmpbox-3.0.0-SNAPSHOT.pom
[JENKINS] Archiving <https://ci-builds.apache.org/job/PDFBox/job/PDFBox-trunk/ws/xmpbox/target/xmpbox-3.0.0-SNAPSHOT.jar> to org.apache.pdfbox/xmpbox/3.0.0-20230616.020515-3665/xmpbox-3.0.0-20230616.020515-3665.jar
[JENKINS] Archiving <https://ci-builds.apache.org/job/PDFBox/job/PDFBox-trunk/ws/tools/pom.xml> to org.apache.pdfbox/pdfbox-tools/3.0.0-SNAPSHOT/pdfbox-tools-3.0.0-SNAPSHOT.pom
[JENKINS] Archiving <https://ci-builds.apache.org/job/PDFBox/job/PDFBox-trunk/ws/debugger/pom.xml> to org.apache.pdfbox/pdfbox-debugger/3.0.0-SNAPSHOT/pdfbox-debugger-3.0.0-SNAPSHOT.pom
[JENKINS] Archiving <https://ci-builds.apache.org/job/PDFBox/job/PDFBox-trunk/ws/preflight-app/pom.xml> to org.apache.pdfbox/preflight-app/3.0.0-SNAPSHOT/preflight-app-3.0.0-SNAPSHOT.pom
[JENKINS] Archiving <https://ci-builds.apache.org/job/PDFBox/job/PDFBox-trunk/ws/app/pom.xml> to org.apache.pdfbox/pdfbox-app/3.0.0-SNAPSHOT/pdfbox-app-3.0.0-SNAPSHOT.pom
[JENKINS] Archiving <https://ci-builds.apache.org/job/PDFBox/job/PDFBox-trunk/ws/preflight/pom.xml> to org.apache.pdfbox/preflight/3.0.0-SNAPSHOT/preflight-3.0.0-SNAPSHOT.pom
[JENKINS] Archiving <https://ci-builds.apache.org/job/PDFBox/job/PDFBox-trunk/ws/pom.xml> to org.apache.pdfbox/pdfbox-reactor/3.0.0-SNAPSHOT/pdfbox-reactor-3.0.0-SNAPSHOT.pom
No mail will be sent out, as 'PDFBox » PDFBox-trunk » Apache PDFBox examples #1682' does not have a result yet. Please make sure you set a proper result in case of pipeline/build scripts.
No mail will be sent out, as 'PDFBox » PDFBox-trunk » Apache PDFBox Debugger application #1682' does not have a result yet. Please make sure you set a proper result in case of pipeline/build scripts.
No mail will be sent out, as 'PDFBox » PDFBox-trunk » Apache PDFBox tools #1682' does not have a result yet. Please make sure you set a proper result in case of pipeline/build scripts.
No mail will be sent out, as 'PDFBox » PDFBox-trunk » Apache PDFBox Debugger #1682' does not have a result yet. Please make sure you set a proper result in case of pipeline/build scripts.
No mail will be sent out, as 'PDFBox » PDFBox-trunk » Apache Preflight application #1682' does not have a result yet. Please make sure you set a proper result in case of pipeline/build scripts.
No mail will be sent out, as 'PDFBox » PDFBox-trunk » Apache PDFBox application #1682' does not have a result yet. Please make sure you set a proper result in case of pipeline/build scripts.
Sending e-mails to: dev@pdfbox.apache.org
No mail will be sent out, as 'PDFBox » PDFBox-trunk » Apache PDFBox #1682' does not have a result yet. Please make sure you set a proper result in case of pipeline/build scripts.
channel stopped
Archiving artifacts

---------------------------------------------------------------------
To unsubscribe, e-mail: dev-unsubscribe@pdfbox.apache.org
For additional commands, e-mail: dev-help@pdfbox.apache.org


Build failed in Jenkins: PDFBox » PDFBox-trunk #1681

Posted by Apache Jenkins Server <je...@builds.apache.org>.
See <https://ci-builds.apache.org/job/PDFBox/job/PDFBox-trunk/1681/display/redirect>

Changes:


------------------------------------------
[...truncated 441.33 KB...]
15.06.2023 19:33:02 WARN  pdmodel.PDDocument:977 - You are overwriting the existing file pdfbox12575087165563754973.pdf, this will produce a corrupted file if you're also reading from it
15.06.2023 19:33:02 INFO  rendering.TestPDFToImage:292 - Deleting: Signed-Document-4.pdf-1.png
15.06.2023 19:33:02 INFO  rendering.TestPDFToImage:199 - Writing: FormI-9-English.pdf-5.png
15.06.2023 19:33:02 WARN  pdmodel.PDDocument:977 - You are overwriting the existing file pdfbox8509875215007215469.pdf, this will produce a corrupted file if you're also reading from it
15.06.2023 19:33:02 WARN  pdmodel.PDDocument:977 - You are overwriting the existing file pdfbox13868773697177037778.pdf, this will produce a corrupted file if you're also reading from it
15.06.2023 19:33:02 INFO  rendering.TestPDFToImage:237 - Comparing: Signed-Document-3.pdf
15.06.2023 19:33:02 INFO  rendering.TestPDFToImage:291 - *** TEST OK *** for file: Signed-Document-3.pdf-1.png
15.06.2023 19:33:02 INFO  rendering.TestPDFToImage:292 - Deleting: Signed-Document-3.pdf-1.png
15.06.2023 19:33:02 INFO  rendering.TestPDFToImage:237 - Comparing: PDFBOX-4955.pdf
15.06.2023 19:33:02 INFO  rendering.TestPDFToImage:237 - Comparing: PDFBOX-4889.pdf
15.06.2023 19:33:02 INFO  rendering.TestPDFToImage:291 - *** TEST OK *** for file: PDFBOX-4889.pdf-1.png
15.06.2023 19:33:02 INFO  rendering.TestPDFToImage:292 - Deleting: PDFBOX-4889.pdf-1.png
15.06.2023 19:33:02 WARN  pdmodel.PDDocument:977 - You are overwriting the existing file pdfbox14275158969577616256.pdf, this will produce a corrupted file if you're also reading from it
15.06.2023 19:33:02 INFO  rendering.TestPDFToImage:237 - Comparing: PDFBOX-4750.pdf
15.06.2023 19:33:02 INFO  rendering.TestPDFToImage:291 - *** TEST OK *** for file: PDFBOX-4750.pdf-2.png
15.06.2023 19:33:02 INFO  rendering.TestPDFToImage:292 - Deleting: PDFBOX-4750.pdf-2.png
15.06.2023 19:33:02 INFO  rendering.TestPDFToImage:291 - *** TEST OK *** for file: PDFBOX-4750.pdf-1.png
15.06.2023 19:33:02 INFO  rendering.TestPDFToImage:292 - Deleting: PDFBOX-4750.pdf-1.png
[INFO] Tests run: 4, Failures: 0, Errors: 0, Skipped: 0, Time elapsed: 10.378 s - in org.apache.pdfbox.pdfwriter.ContentStreamWriterTest
15.06.2023 19:33:02 WARN  pdmodel.PDDocument:977 - You are overwriting the existing file pdfbox1120031581433943739.pdf, this will produce a corrupted file if you're also reading from it
15.06.2023 19:33:02 INFO  rendering.TestPDFToImage:237 - Comparing: FormI-9-English.pdf
15.06.2023 19:33:02 INFO  rendering.TestPDFToImage:291 - *** TEST OK *** for file: FormI-9-English.pdf-5.png
15.06.2023 19:33:02 INFO  rendering.TestPDFToImage:292 - Deleting: FormI-9-English.pdf-5.png
15.06.2023 19:33:02 INFO  rendering.TestPDFToImage:291 - *** TEST OK *** for file: FormI-9-English.pdf-3.png
15.06.2023 19:33:02 INFO  rendering.TestPDFToImage:292 - Deleting: FormI-9-English.pdf-3.png
15.06.2023 19:33:02 INFO  rendering.TestPDFToImage:291 - *** TEST OK *** for file: FormI-9-English.pdf-2.png
15.06.2023 19:33:02 INFO  rendering.TestPDFToImage:292 - Deleting: FormI-9-English.pdf-2.png
15.06.2023 19:33:02 INFO  rendering.TestPDFToImage:291 - *** TEST OK *** for file: FormI-9-English.pdf-1.png
15.06.2023 19:33:02 INFO  rendering.TestPDFToImage:292 - Deleting: FormI-9-English.pdf-1.png
15.06.2023 19:33:02 INFO  rendering.TestPDFToImage:291 - *** TEST OK *** for file: FormI-9-English.pdf-4.png
15.06.2023 19:33:02 INFO  rendering.TestPDFToImage:292 - Deleting: FormI-9-English.pdf-4.png
[INFO] Tests run: 2, Failures: 0, Errors: 0, Skipped: 0, Time elapsed: 10.507 s - in org.apache.pdfbox.multipdf.PDFMergerUtilityTest
15.06.2023 19:33:02 INFO  rendering.TestPDFToImage:283 - *** TEST OK *** for file: PDFBOX-4955.pdf-1.png
15.06.2023 19:33:02 INFO  rendering.TestPDFToImage:284 - Deleting: PDFBOX-4955.pdf-1.png
[INFO] Tests run: 1, Failures: 0, Errors: 0, Skipped: 0, Time elapsed: 10.603 s - in org.apache.pdfbox.pdmodel.interactive.form.PDAcroFormFlattenTest
[INFO] Tests run: 1, Failures: 0, Errors: 0, Skipped: 0, Time elapsed: 10.906 s - in org.apache.pdfbox.rendering.TestQuality
15.06.2023 19:33:05 WARN  pdmodel.PDDocument:1282 - do not call setAllSecurityToBeRemoved(true) before calling protect(), as protect() implies setAllSecurityToBeRemoved(false)
15.06.2023 19:33:08 WARN  pdmodel.PDDocument:1282 - do not call setAllSecurityToBeRemoved(true) before calling protect(), as protect() implies setAllSecurityToBeRemoved(false)
[INFO] Tests run: 1, Failures: 0, Errors: 0, Skipped: 0, Time elapsed: 17.628 s - in org.apache.pdfbox.filter.TestFilters
15.06.2023 19:33:12 WARN  pdmodel.PDDocument:1282 - do not call setAllSecurityToBeRemoved(true) before calling protect(), as protect() implies setAllSecurityToBeRemoved(false)
[INFO] Tests run: 1, Failures: 0, Errors: 0, Skipped: 0, Time elapsed: 21.928 s - in org.apache.pdfbox.encryption.TestSymmetricKeyEncryption
[INFO] 
[INFO] Results:
[INFO] 
[WARNING] Tests run: 658, Failures: 0, Errors: 0, Skipped: 3
[INFO] 
[JENKINS] Recording test results
[INFO] 
[INFO] --- jacoco-maven-plugin:0.8.10:report (report) @ pdfbox ---
[INFO] Loading execution data file <https://ci-builds.apache.org/job/PDFBox/job/PDFBox-trunk/ws/pdfbox/target/jacoco.exec>
[INFO] Analyzed bundle 'Apache PDFBox' with 699 classes
[INFO] 
[INFO] --- animal-sniffer-maven-plugin:1.23:check (check-java-version) @ pdfbox ---
[INFO] Checking unresolved references to org.codehaus.mojo.signature:java18:1.0
[INFO] 
[INFO] --- maven-bundle-plugin:5.1.9:bundle (default-bundle) @ pdfbox ---
[INFO] Building bundle: <https://ci-builds.apache.org/job/PDFBox/job/PDFBox-trunk/ws/pdfbox/target/pdfbox-3.0.0-SNAPSHOT.jar>
[INFO] Writing manifest: <https://ci-builds.apache.org/job/PDFBox/job/PDFBox-trunk/ws/pdfbox/target/classes/META-INF/MANIFEST.MF>
[INFO] 
[INFO] --- maven-site-plugin:3.12.1:attach-descriptor (attach-descriptor) @ pdfbox ---
[INFO] Skipping because packaging 'bundle' is not pom.
[INFO] 
[INFO] >>> maven-source-plugin:3.2.1:jar (attach-sources) > generate-sources @ pdfbox >>>
[INFO] 
[INFO] --- maven-enforcer-plugin:3.3.0:enforce (default) @ pdfbox ---
[INFO] 
[INFO] --- maven-enforcer-plugin:3.3.0:enforce (enforce-maven-version) @ pdfbox ---
[INFO] 
[INFO] --- maven-enforcer-plugin:3.3.0:enforce (enforce-java-version) @ pdfbox ---
[INFO] 
[INFO] --- jacoco-maven-plugin:0.8.10:prepare-agent (default) @ pdfbox ---
[INFO] surefireArgLine set to -javaagent:/home/jenkins/.m2/repository/org/jacoco/org.jacoco.agent/0.8.10/org.jacoco.agent-0.8.10-runtime.jar=destfile=<https://ci-builds.apache.org/job/PDFBox/job/PDFBox-trunk/ws/pdfbox/target/jacoco.exec>
[WARNING] Failed to getClass for org.apache.maven.plugins.source.SourceJarMojo
[INFO] 
[INFO] <<< maven-source-plugin:3.2.1:jar (attach-sources) < generate-sources @ pdfbox <<<
[INFO] 
[INFO] 
[INFO] --- maven-source-plugin:3.2.1:jar (attach-sources) @ pdfbox ---
[INFO] Skipping source per configuration.
[INFO] 
[INFO] --- apache-rat-plugin:0.15:check (default) @ pdfbox ---
[INFO] Enabled default license matchers.
[INFO] Will parse SCM ignores for exclusions...
[INFO] Finished adding exclusions from SCM ignore files.
[INFO] 62 implicit excludes.
[INFO] 21 explicit excludes.
[INFO] 958 resources included
[INFO] Rat check: Summary over all files. Unapproved: 0, unknown: 0, generated: 0, approved: 784 licenses.
[INFO] 
[INFO] --- dependency-check-maven:8.3.1:check (default) @ pdfbox ---
[INFO] Checking for updates
[INFO] Skipping NVD check since last check was within 4 hours.
[INFO] Skipping RetireJS update since last update was within 24 hours.
[INFO] Skipping Hosted Suppressions file update since last update was within 2 hours.
[INFO] Skipping Known Exploited Vulnerabilities update check since last check was within 24 hours.
[INFO] Check for updates complete (41 ms)
[INFO] 

Dependency-Check is an open source tool performing a best effort analysis of 3rd party dependencies; false positives and false negatives may exist in the analysis performed by the tool. Use of the tool and the reporting provided constitutes acceptance for use in an AS IS condition, and there are NO warranties, implied or otherwise, with regard to the analysis or its use. Any use of the tool and the reporting provided is at the user?s risk. In no event shall the copyright holder or OWASP be held liable for any damages whatsoever arising out of or in connection with the use of this tool, the analysis performed, or the resulting report.


   About ODC: https://jeremylong.github.io/DependencyCheck/general/internals.html
   False Positives: https://jeremylong.github.io/DependencyCheck/general/suppression.html

? Sponsor: https://github.com/sponsors/jeremylong


[INFO] Analysis Started
[INFO] Finished Archive Analyzer (0 seconds)
[INFO] Finished File Name Analyzer (0 seconds)
[INFO] Finished Jar Analyzer (0 seconds)
[INFO] Finished Dependency Merging Analyzer (0 seconds)
[INFO] Finished Version Filter Analyzer (0 seconds)
[INFO] Finished Hint Analyzer (0 seconds)
[INFO] Created CPE Index (2 seconds)
[INFO] Finished CPE Analyzer (3 seconds)
[INFO] Finished False Positive Analyzer (0 seconds)
[INFO] Finished NVD CVE Analyzer (0 seconds)
[INFO] Finished Sonatype OSS Index Analyzer (0 seconds)
[INFO] Finished Vulnerability Suppression Analyzer (0 seconds)
[INFO] Finished Known Exploited Vulnerability Analyzer (0 seconds)
[INFO] Finished Dependency Bundling Analyzer (0 seconds)
[INFO] Finished Unused Suppression Rule Analyzer (0 seconds)
[INFO] Analysis Complete (4 seconds)
[INFO] Writing report to: <https://ci-builds.apache.org/job/PDFBox/job/PDFBox-trunk/ws/pdfbox/target/dependency-check-report.html>
[INFO] 
[INFO] --- maven-install-plugin:3.1.0:install (default-install) @ pdfbox ---
[INFO] Installing <https://ci-builds.apache.org/job/PDFBox/job/PDFBox-trunk/ws/pdfbox/pom.xml> to /home/jenkins/.m2/repository/org/apache/pdfbox/pdfbox/3.0.0-SNAPSHOT/pdfbox-3.0.0-SNAPSHOT.pom
[INFO] Installing <https://ci-builds.apache.org/job/PDFBox/job/PDFBox-trunk/ws/pdfbox/target/pdfbox-3.0.0-SNAPSHOT.jar> to /home/jenkins/.m2/repository/org/apache/pdfbox/pdfbox/3.0.0-SNAPSHOT/pdfbox-3.0.0-SNAPSHOT.jar
[INFO] 
[INFO] --- maven-bundle-plugin:5.1.9:install (default-install) @ pdfbox ---
[INFO] Installing org/apache/pdfbox/pdfbox/3.0.0-SNAPSHOT/pdfbox-3.0.0-SNAPSHOT.jar
[INFO] Writing OBR metadata
[INFO] 
[INFO] --- maven-deploy-plugin:2.8.2:deploy (default-deploy) @ pdfbox ---
[INFO] Downloading from apache.snapshots.https: https://repository.apache.org/content/repositories/snapshots/org/apache/pdfbox/pdfbox/3.0.0-SNAPSHOT/maven-metadata.xml
[INFO] Downloaded from apache.snapshots.https: https://repository.apache.org/content/repositories/snapshots/org/apache/pdfbox/pdfbox/3.0.0-SNAPSHOT/maven-metadata.xml (782 B at 1.1 kB/s)
[INFO] Uploading to apache.snapshots.https: https://repository.apache.org/content/repositories/snapshots/org/apache/pdfbox/pdfbox/3.0.0-SNAPSHOT/pdfbox-3.0.0-20230615.192717-3595.jar
[INFO] Uploaded to apache.snapshots.https: https://repository.apache.org/content/repositories/snapshots/org/apache/pdfbox/pdfbox/3.0.0-SNAPSHOT/pdfbox-3.0.0-20230615.192717-3595.jar (2.0 MB at 885 kB/s)
[INFO] Uploading to apache.snapshots.https: https://repository.apache.org/content/repositories/snapshots/org/apache/pdfbox/pdfbox/3.0.0-SNAPSHOT/pdfbox-3.0.0-20230615.192717-3595.pom
[INFO] Uploaded to apache.snapshots.https: https://repository.apache.org/content/repositories/snapshots/org/apache/pdfbox/pdfbox/3.0.0-SNAPSHOT/pdfbox-3.0.0-20230615.192717-3595.pom (44 kB at 43 kB/s)
[INFO] Downloading from apache.snapshots.https: https://repository.apache.org/content/repositories/snapshots/org/apache/pdfbox/pdfbox/maven-metadata.xml
[INFO] Downloaded from apache.snapshots.https: https://repository.apache.org/content/repositories/snapshots/org/apache/pdfbox/pdfbox/maven-metadata.xml (425 B at 1.2 kB/s)
[INFO] Uploading to apache.snapshots.https: https://repository.apache.org/content/repositories/snapshots/org/apache/pdfbox/pdfbox/3.0.0-SNAPSHOT/maven-metadata.xml
[INFO] Uploaded to apache.snapshots.https: https://repository.apache.org/content/repositories/snapshots/org/apache/pdfbox/pdfbox/3.0.0-SNAPSHOT/maven-metadata.xml (782 B at 757 B/s)
[INFO] Uploading to apache.snapshots.https: https://repository.apache.org/content/repositories/snapshots/org/apache/pdfbox/pdfbox/maven-metadata.xml
[INFO] Uploaded to apache.snapshots.https: https://repository.apache.org/content/repositories/snapshots/org/apache/pdfbox/pdfbox/maven-metadata.xml (425 B at 412 B/s)
[INFO] 
[INFO] --- maven-bundle-plugin:5.1.9:deploy (default-deploy) @ pdfbox ---
[INFO] Remote OBR update disabled (enable with -DremoteOBR)
[INFO] 
[INFO] --- ossindex-maven-plugin:3.2.0:audit (default-cli) @ pdfbox ---
[INFO] Checking for vulnerabilities; 26 artifacts
[INFO] Exclude coordinates: []
[INFO] Exclude vulnerability identifiers: []
[INFO] CVSS-score threshold: 0.0
[INFO] 
[INFO] --------------------< org.apache.pdfbox:preflight >---------------------
[INFO] Building Apache Preflight 3.0.0-SNAPSHOT                          [6/13]
[INFO] -------------------------------[ bundle ]-------------------------------
[INFO] 
[INFO] --- maven-clean-plugin:3.2.0:clean (default-clean) @ preflight ---
[INFO] 
[INFO] --- maven-enforcer-plugin:3.3.0:enforce (default) @ preflight ---
[INFO] 
[INFO] --- maven-enforcer-plugin:3.3.0:enforce (enforce-maven-version) @ preflight ---
[INFO] 
[INFO] --- maven-enforcer-plugin:3.3.0:enforce (enforce-java-version) @ preflight ---
[INFO] 
[INFO] --- jacoco-maven-plugin:0.8.10:prepare-agent (default) @ preflight ---
[INFO] surefireArgLine set to -javaagent:/home/jenkins/.m2/repository/org/jacoco/org.jacoco.agent/0.8.10/org.jacoco.agent-0.8.10-runtime.jar=destfile=<https://ci-builds.apache.org/job/PDFBox/job/PDFBox-trunk/ws/preflight/target/jacoco.exec>
[INFO] 
[INFO] --- maven-remote-resources-plugin:1.7.0:process (process-resource-bundles) @ preflight ---
[INFO] Preparing remote bundle org.apache:apache-jar-resource-bundle:1.4
[INFO] Copying 3 resources from 1 bundle.
[INFO] 
[INFO] --- maven-resources-plugin:3.3.0:resources (default-resources) @ preflight ---
[INFO] Copying 0 resource
[INFO] Copying 3 resources
[INFO] 
[INFO] --- maven-compiler-plugin:3.10.1:compile (default-compile) @ preflight ---
[INFO] Changes detected - recompiling the module!
[INFO] Compiling 116 source files to <https://ci-builds.apache.org/job/PDFBox/job/PDFBox-trunk/ws/preflight/target/classes>
[INFO] <https://ci-builds.apache.org/job/PDFBox/job/PDFBox-trunk/ws/preflight/src/main/java/org/apache/pdfbox/preflight/font/descriptor/FontDescriptorHelper.java>: <https://ci-builds.apache.org/job/PDFBox/job/PDFBox-trunk/ws/preflight/src/main/java/org/apache/pdfbox/preflight/font/descriptor/FontDescriptorHelper.java> uses unchecked or unsafe operations.
[INFO] <https://ci-builds.apache.org/job/PDFBox/job/PDFBox-trunk/ws/preflight/src/main/java/org/apache/pdfbox/preflight/font/descriptor/FontDescriptorHelper.java>: Recompile with -Xlint:unchecked for details.
[INFO] 
[INFO] --- download-maven-plugin:1.7.0:wget (get-isartor) @ preflight ---
[INFO] 
[INFO] --- download-maven-plugin:1.7.0:wget (get-bavaria) @ preflight ---
[INFO] ------------------------------------------------------------------------
[INFO] Reactor Summary for Apache PDFBox 3.0.0-SNAPSHOT:
[INFO] 
[INFO] PDFBox parent ...................................... SUCCESS [01:45 min]
[INFO] Apache PDFBox io ................................... SUCCESS [01:13 min]
[INFO] Apache FontBox ..................................... SUCCESS [ 49.505 s]
[INFO] Apache XmpBox ...................................... SUCCESS [ 34.413 s]
[INFO] Apache PDFBox ...................................... SUCCESS [01:52 min]
[INFO] Apache Preflight ................................... FAILURE [ 13.065 s]
[INFO] Apache Preflight application ....................... SKIPPED
[INFO] Apache PDFBox Debugger ............................. SKIPPED
[INFO] Apache PDFBox tools ................................ SKIPPED
[INFO] Apache PDFBox application .......................... SKIPPED
[INFO] Apache PDFBox Debugger application ................. SKIPPED
[INFO] Apache PDFBox examples ............................. SKIPPED
[INFO] Apache PDFBox ...................................... SKIPPED
[INFO] ------------------------------------------------------------------------
[INFO] BUILD FAILURE
[INFO] ------------------------------------------------------------------------
[INFO] Total time:  07:04 min
[INFO] Finished at: 2023-06-15T19:34:22Z
[INFO] ------------------------------------------------------------------------
Waiting for Jenkins to finish collecting data
[ERROR] Failed to execute goal com.googlecode.maven-download-plugin:download-maven-plugin:1.7.0:wget (get-bavaria) on project preflight: Read timed out -> [Help 1]
[ERROR] 
[ERROR] To see the full stack trace of the errors, re-run Maven with the -e switch.
[ERROR] Re-run Maven using the -X switch to enable full debug logging.
[ERROR] 
[ERROR] For more information about the errors and possible solutions, please read the following articles:
[ERROR] [Help 1] http://cwiki.apache.org/confluence/display/MAVEN/MojoExecutionException
[ERROR] 
[ERROR] After correcting the problems, you can resume the build with the command
[ERROR]   mvn <goals> -rf :preflight
[JENKINS] Archiving <https://ci-builds.apache.org/job/PDFBox/job/PDFBox-trunk/ws/examples/pom.xml> to org.apache.pdfbox/pdfbox-examples/3.0.0-SNAPSHOT/pdfbox-examples-3.0.0-SNAPSHOT.pom
[JENKINS] Archiving <https://ci-builds.apache.org/job/PDFBox/job/PDFBox-trunk/ws/parent/pom.xml> to org.apache.pdfbox/pdfbox-parent/3.0.0-SNAPSHOT/pdfbox-parent-3.0.0-SNAPSHOT.pom
[JENKINS] Archiving <https://ci-builds.apache.org/job/PDFBox/job/PDFBox-trunk/ws/pdfbox/pom.xml> to org.apache.pdfbox/pdfbox/3.0.0-SNAPSHOT/pdfbox-3.0.0-SNAPSHOT.pom
[JENKINS] Archiving <https://ci-builds.apache.org/job/PDFBox/job/PDFBox-trunk/ws/pdfbox/target/pdfbox-3.0.0-SNAPSHOT.jar> to org.apache.pdfbox/pdfbox/3.0.0-20230615.192717-3595/pdfbox-3.0.0-20230615.192717-3595.jar
[JENKINS] Archiving <https://ci-builds.apache.org/job/PDFBox/job/PDFBox-trunk/ws/debugger-app/pom.xml> to org.apache.pdfbox/debugger-app/3.0.0-SNAPSHOT/debugger-app-3.0.0-SNAPSHOT.pom
[JENKINS] Archiving <https://ci-builds.apache.org/job/PDFBox/job/PDFBox-trunk/ws/io/pom.xml> to org.apache.pdfbox/pdfbox-io/3.0.0-SNAPSHOT/pdfbox-io-3.0.0-SNAPSHOT.pom
[JENKINS] Archiving <https://ci-builds.apache.org/job/PDFBox/job/PDFBox-trunk/ws/io/target/pdfbox-io-3.0.0-SNAPSHOT.jar> to org.apache.pdfbox/pdfbox-io/3.0.0-20230615.192717-32/pdfbox-io-3.0.0-20230615.192717-32.jar
[JENKINS] Archiving <https://ci-builds.apache.org/job/PDFBox/job/PDFBox-trunk/ws/fontbox/pom.xml> to org.apache.pdfbox/fontbox/3.0.0-SNAPSHOT/fontbox-3.0.0-SNAPSHOT.pom
[JENKINS] Archiving <https://ci-builds.apache.org/job/PDFBox/job/PDFBox-trunk/ws/fontbox/target/fontbox-3.0.0-SNAPSHOT.jar> to org.apache.pdfbox/fontbox/3.0.0-20230615.192717-3672/fontbox-3.0.0-20230615.192717-3672.jar
[JENKINS] Archiving <https://ci-builds.apache.org/job/PDFBox/job/PDFBox-trunk/ws/xmpbox/pom.xml> to org.apache.pdfbox/xmpbox/3.0.0-SNAPSHOT/xmpbox-3.0.0-SNAPSHOT.pom
[JENKINS] Archiving <https://ci-builds.apache.org/job/PDFBox/job/PDFBox-trunk/ws/xmpbox/target/xmpbox-3.0.0-SNAPSHOT.jar> to org.apache.pdfbox/xmpbox/3.0.0-20230615.192717-3664/xmpbox-3.0.0-20230615.192717-3664.jar
[JENKINS] Archiving <https://ci-builds.apache.org/job/PDFBox/job/PDFBox-trunk/ws/tools/pom.xml> to org.apache.pdfbox/pdfbox-tools/3.0.0-SNAPSHOT/pdfbox-tools-3.0.0-SNAPSHOT.pom
[JENKINS] Archiving <https://ci-builds.apache.org/job/PDFBox/job/PDFBox-trunk/ws/debugger/pom.xml> to org.apache.pdfbox/pdfbox-debugger/3.0.0-SNAPSHOT/pdfbox-debugger-3.0.0-SNAPSHOT.pom
[JENKINS] Archiving <https://ci-builds.apache.org/job/PDFBox/job/PDFBox-trunk/ws/preflight-app/pom.xml> to org.apache.pdfbox/preflight-app/3.0.0-SNAPSHOT/preflight-app-3.0.0-SNAPSHOT.pom
[JENKINS] Archiving <https://ci-builds.apache.org/job/PDFBox/job/PDFBox-trunk/ws/app/pom.xml> to org.apache.pdfbox/pdfbox-app/3.0.0-SNAPSHOT/pdfbox-app-3.0.0-SNAPSHOT.pom
[JENKINS] Archiving <https://ci-builds.apache.org/job/PDFBox/job/PDFBox-trunk/ws/preflight/pom.xml> to org.apache.pdfbox/preflight/3.0.0-SNAPSHOT/preflight-3.0.0-SNAPSHOT.pom
[JENKINS] Archiving <https://ci-builds.apache.org/job/PDFBox/job/PDFBox-trunk/ws/pom.xml> to org.apache.pdfbox/pdfbox-reactor/3.0.0-SNAPSHOT/pdfbox-reactor-3.0.0-SNAPSHOT.pom
No mail will be sent out, as 'PDFBox » PDFBox-trunk » Apache PDFBox examples #1681' does not have a result yet. Please make sure you set a proper result in case of pipeline/build scripts.
No mail will be sent out, as 'PDFBox » PDFBox-trunk » Apache PDFBox Debugger application #1681' does not have a result yet. Please make sure you set a proper result in case of pipeline/build scripts.
No mail will be sent out, as 'PDFBox » PDFBox-trunk » Apache PDFBox tools #1681' does not have a result yet. Please make sure you set a proper result in case of pipeline/build scripts.
No mail will be sent out, as 'PDFBox » PDFBox-trunk » Apache PDFBox Debugger #1681' does not have a result yet. Please make sure you set a proper result in case of pipeline/build scripts.
No mail will be sent out, as 'PDFBox » PDFBox-trunk » Apache Preflight application #1681' does not have a result yet. Please make sure you set a proper result in case of pipeline/build scripts.
No mail will be sent out, as 'PDFBox » PDFBox-trunk » Apache PDFBox application #1681' does not have a result yet. Please make sure you set a proper result in case of pipeline/build scripts.
Sending e-mails to: dev@pdfbox.apache.org
No mail will be sent out, as 'PDFBox » PDFBox-trunk » Apache PDFBox #1681' does not have a result yet. Please make sure you set a proper result in case of pipeline/build scripts.
channel stopped
Archiving artifacts

---------------------------------------------------------------------
To unsubscribe, e-mail: dev-unsubscribe@pdfbox.apache.org
For additional commands, e-mail: dev-help@pdfbox.apache.org