You are viewing a plain text version of this content. The canonical link for it is here.
Posted to issues@tajo.apache.org by Apache Jenkins Server <je...@builds.apache.org> on 2016/03/08 09:54:15 UTC
Build failed in Jenkins: Tajo-0.11.2-build #179
See <https://builds.apache.org/job/Tajo-0.11.2-build/179/changes>
Changes:
[blrunner] TAJO-1793: result row count unmatched for UNION ALL.
------------------------------------------
[...truncated 6720 lines...]
at sun.reflect.NativeConstructorAccessorImpl.newInstance(NativeConstructorAccessorImpl.java:57)
at sun.reflect.DelegatingConstructorAccessorImpl.newInstance(DelegatingConstructorAccessorImpl.java:45)
at java.lang.reflect.Constructor.newInstance(Constructor.java:526)
at org.apache.tajo.exception.ExceptionUtil.toTajoExceptionCommon(ExceptionUtil.java:148)
at org.apache.tajo.exception.ExceptionUtil.toTajoException(ExceptionUtil.java:168)
at org.apache.tajo.exception.ExceptionUtil.throwIfError(ExceptionUtil.java:135)
at org.apache.tajo.client.QueryClientImpl.executeQueryAndGetResult(QueryClientImpl.java:198)
at org.apache.tajo.client.TajoClientImpl.executeQueryAndGetResult(TajoClientImpl.java:118)
at org.apache.tajo.QueryTestCaseBase.executeString(QueryTestCaseBase.java:393)
at org.apache.tajo.engine.query.TestHBaseTable.testInsertIntoMultiRegion2(TestHBaseTable.java:880)
at sun.reflect.NativeMethodAccessorImpl.invoke0(Native Method)
at sun.reflect.NativeMethodAccessorImpl.invoke(NativeMethodAccessorImpl.java:57)
at sun.reflect.DelegatingMethodAccessorImpl.invoke(DelegatingMethodAccessorImpl.java:43)
at java.lang.reflect.Method.invoke(Method.java:606)
at org.junit.runners.model.FrameworkMethod$1.runReflectiveCall(FrameworkMethod.java:50)
at org.junit.internal.runners.model.ReflectiveCallable.run(ReflectiveCallable.java:12)
at org.junit.runners.model.FrameworkMethod.invokeExplosively(FrameworkMethod.java:47)
at org.junit.internal.runners.statements.InvokeMethod.evaluate(InvokeMethod.java:17)
at org.junit.internal.runners.statements.RunBefores.evaluate(RunBefores.java:26)
at org.junit.rules.TestWatcher$1.evaluate(TestWatcher.java:55)
at org.junit.rules.TestWatcher$1.evaluate(TestWatcher.java:55)
at org.junit.rules.RunRules.evaluate(RunRules.java:20)
at org.junit.runners.ParentRunner.runLeaf(ParentRunner.java:325)
at org.junit.runners.BlockJUnit4ClassRunner.runChild(BlockJUnit4ClassRunner.java:78)
at org.junit.runners.BlockJUnit4ClassRunner.runChild(BlockJUnit4ClassRunner.java:57)
at org.junit.runners.ParentRunner$3.run(ParentRunner.java:290)
at org.junit.runners.ParentRunner$1.schedule(ParentRunner.java:71)
at org.junit.runners.ParentRunner.runChildren(ParentRunner.java:288)
at org.junit.runners.ParentRunner.access$000(ParentRunner.java:58)
at org.junit.runners.ParentRunner$2.evaluate(ParentRunner.java:268)
at org.junit.internal.runners.statements.RunBefores.evaluate(RunBefores.java:26)
at org.junit.internal.runners.statements.RunAfters.evaluate(RunAfters.java:27)
at org.junit.runners.ParentRunner.run(ParentRunner.java:363)
at org.apache.maven.surefire.junit4.JUnit4Provider.execute(JUnit4Provider.java:344)
at org.apache.maven.surefire.junit4.JUnit4Provider.executeWithRerun(JUnit4Provider.java:269)
at org.apache.maven.surefire.junit4.JUnit4Provider.executeTestSet(JUnit4Provider.java:240)
at org.apache.maven.surefire.junit4.JUnit4Provider.invoke(JUnit4Provider.java:184)
at org.apache.maven.surefire.booter.ForkedBooter.invokeProviderInSameClassLoader(ForkedBooter.java:286)
at org.apache.maven.surefire.booter.ForkedBooter.runSuitesInProcess(ForkedBooter.java:240)
at org.apache.maven.surefire.booter.ForkedBooter.main(ForkedBooter.java:121)
testInsertIntoUsingPut(org.apache.tajo.engine.query.TestHBaseTable) Time elapsed: 0.007 sec <<< ERROR!
org.apache.tajo.exception.DuplicateTableException: table 'TestHBaseTable.hbase_mapped_table' already exists
at sun.reflect.NativeConstructorAccessorImpl.newInstance0(Native Method)
at sun.reflect.NativeConstructorAccessorImpl.newInstance(NativeConstructorAccessorImpl.java:57)
at sun.reflect.DelegatingConstructorAccessorImpl.newInstance(DelegatingConstructorAccessorImpl.java:45)
at java.lang.reflect.Constructor.newInstance(Constructor.java:526)
at org.apache.tajo.exception.ExceptionUtil.toTajoExceptionCommon(ExceptionUtil.java:148)
at org.apache.tajo.exception.ExceptionUtil.toTajoException(ExceptionUtil.java:168)
at org.apache.tajo.exception.ExceptionUtil.throwIfError(ExceptionUtil.java:135)
at org.apache.tajo.client.QueryClientImpl.executeQueryAndGetResult(QueryClientImpl.java:198)
at org.apache.tajo.client.TajoClientImpl.executeQueryAndGetResult(TajoClientImpl.java:118)
at org.apache.tajo.QueryTestCaseBase.executeString(QueryTestCaseBase.java:393)
at org.apache.tajo.engine.query.TestHBaseTable.testInsertIntoUsingPut(TestHBaseTable.java:1340)
at sun.reflect.NativeMethodAccessorImpl.invoke0(Native Method)
at sun.reflect.NativeMethodAccessorImpl.invoke(NativeMethodAccessorImpl.java:57)
at sun.reflect.DelegatingMethodAccessorImpl.invoke(DelegatingMethodAccessorImpl.java:43)
at java.lang.reflect.Method.invoke(Method.java:606)
at org.junit.runners.model.FrameworkMethod$1.runReflectiveCall(FrameworkMethod.java:50)
at org.junit.internal.runners.model.ReflectiveCallable.run(ReflectiveCallable.java:12)
at org.junit.runners.model.FrameworkMethod.invokeExplosively(FrameworkMethod.java:47)
at org.junit.internal.runners.statements.InvokeMethod.evaluate(InvokeMethod.java:17)
at org.junit.internal.runners.statements.RunBefores.evaluate(RunBefores.java:26)
at org.junit.rules.TestWatcher$1.evaluate(TestWatcher.java:55)
at org.junit.rules.TestWatcher$1.evaluate(TestWatcher.java:55)
at org.junit.rules.RunRules.evaluate(RunRules.java:20)
at org.junit.runners.ParentRunner.runLeaf(ParentRunner.java:325)
at org.junit.runners.BlockJUnit4ClassRunner.runChild(BlockJUnit4ClassRunner.java:78)
at org.junit.runners.BlockJUnit4ClassRunner.runChild(BlockJUnit4ClassRunner.java:57)
at org.junit.runners.ParentRunner$3.run(ParentRunner.java:290)
at org.junit.runners.ParentRunner$1.schedule(ParentRunner.java:71)
at org.junit.runners.ParentRunner.runChildren(ParentRunner.java:288)
at org.junit.runners.ParentRunner.access$000(ParentRunner.java:58)
at org.junit.runners.ParentRunner$2.evaluate(ParentRunner.java:268)
at org.junit.internal.runners.statements.RunBefores.evaluate(RunBefores.java:26)
at org.junit.internal.runners.statements.RunAfters.evaluate(RunAfters.java:27)
at org.junit.runners.ParentRunner.run(ParentRunner.java:363)
at org.apache.maven.surefire.junit4.JUnit4Provider.execute(JUnit4Provider.java:344)
at org.apache.maven.surefire.junit4.JUnit4Provider.executeWithRerun(JUnit4Provider.java:269)
at org.apache.maven.surefire.junit4.JUnit4Provider.executeTestSet(JUnit4Provider.java:240)
at org.apache.maven.surefire.junit4.JUnit4Provider.invoke(JUnit4Provider.java:184)
at org.apache.maven.surefire.booter.ForkedBooter.invokeProviderInSameClassLoader(ForkedBooter.java:286)
at org.apache.maven.surefire.booter.ForkedBooter.runSuitesInProcess(ForkedBooter.java:240)
at org.apache.maven.surefire.booter.ForkedBooter.main(ForkedBooter.java:121)
testCreateHBaseTable(org.apache.tajo.engine.query.TestHBaseTable) Time elapsed: 0.145 sec <<< ERROR!
org.apache.tajo.exception.TajoInternalError: internal error: HBase table [hbase_table] already exists.
at org.apache.tajo.exception.ExceptionUtil.toTajoExceptionCommon(ExceptionUtil.java:141)
at org.apache.tajo.exception.ExceptionUtil.toTajoException(ExceptionUtil.java:168)
at org.apache.tajo.exception.ExceptionUtil.throwIfError(ExceptionUtil.java:135)
at org.apache.tajo.client.QueryClientImpl.executeQueryAndGetResult(QueryClientImpl.java:198)
at org.apache.tajo.client.TajoClientImpl.executeQueryAndGetResult(TajoClientImpl.java:118)
at org.apache.tajo.QueryTestCaseBase.executeString(QueryTestCaseBase.java:393)
at org.apache.tajo.engine.query.TestHBaseTable.testCreateHBaseTable(TestHBaseTable.java:127)
at sun.reflect.NativeMethodAccessorImpl.invoke0(Native Method)
at sun.reflect.NativeMethodAccessorImpl.invoke(NativeMethodAccessorImpl.java:57)
at sun.reflect.DelegatingMethodAccessorImpl.invoke(DelegatingMethodAccessorImpl.java:43)
at java.lang.reflect.Method.invoke(Method.java:606)
at org.junit.runners.model.FrameworkMethod$1.runReflectiveCall(FrameworkMethod.java:50)
at org.junit.internal.runners.model.ReflectiveCallable.run(ReflectiveCallable.java:12)
at org.junit.runners.model.FrameworkMethod.invokeExplosively(FrameworkMethod.java:47)
at org.junit.internal.runners.statements.InvokeMethod.evaluate(InvokeMethod.java:17)
at org.junit.internal.runners.statements.RunBefores.evaluate(RunBefores.java:26)
at org.junit.rules.TestWatcher$1.evaluate(TestWatcher.java:55)
at org.junit.rules.TestWatcher$1.evaluate(TestWatcher.java:55)
at org.junit.rules.RunRules.evaluate(RunRules.java:20)
at org.junit.runners.ParentRunner.runLeaf(ParentRunner.java:325)
at org.junit.runners.BlockJUnit4ClassRunner.runChild(BlockJUnit4ClassRunner.java:78)
at org.junit.runners.BlockJUnit4ClassRunner.runChild(BlockJUnit4ClassRunner.java:57)
at org.junit.runners.ParentRunner$3.run(ParentRunner.java:290)
at org.junit.runners.ParentRunner$1.schedule(ParentRunner.java:71)
at org.junit.runners.ParentRunner.runChildren(ParentRunner.java:288)
at org.junit.runners.ParentRunner.access$000(ParentRunner.java:58)
at org.junit.runners.ParentRunner$2.evaluate(ParentRunner.java:268)
at org.junit.internal.runners.statements.RunBefores.evaluate(RunBefores.java:26)
at org.junit.internal.runners.statements.RunAfters.evaluate(RunAfters.java:27)
at org.junit.runners.ParentRunner.run(ParentRunner.java:363)
at org.apache.maven.surefire.junit4.JUnit4Provider.execute(JUnit4Provider.java:344)
at org.apache.maven.surefire.junit4.JUnit4Provider.executeWithRerun(JUnit4Provider.java:269)
at org.apache.maven.surefire.junit4.JUnit4Provider.executeTestSet(JUnit4Provider.java:240)
at org.apache.maven.surefire.junit4.JUnit4Provider.invoke(JUnit4Provider.java:184)
at org.apache.maven.surefire.booter.ForkedBooter.invokeProviderInSameClassLoader(ForkedBooter.java:286)
at org.apache.maven.surefire.booter.ForkedBooter.runSuitesInProcess(ForkedBooter.java:240)
at org.apache.maven.surefire.booter.ForkedBooter.main(ForkedBooter.java:121)
testInsertIntoRowField(org.apache.tajo.engine.query.TestHBaseTable) Time elapsed: 0.017 sec <<< ERROR!
org.apache.tajo.exception.DuplicateTableException: table 'TestHBaseTable.hbase_mapped_table' already exists
at sun.reflect.NativeConstructorAccessorImpl.newInstance0(Native Method)
at sun.reflect.NativeConstructorAccessorImpl.newInstance(NativeConstructorAccessorImpl.java:57)
at sun.reflect.DelegatingConstructorAccessorImpl.newInstance(DelegatingConstructorAccessorImpl.java:45)
at java.lang.reflect.Constructor.newInstance(Constructor.java:526)
at org.apache.tajo.exception.ExceptionUtil.toTajoExceptionCommon(ExceptionUtil.java:148)
at org.apache.tajo.exception.ExceptionUtil.toTajoException(ExceptionUtil.java:168)
at org.apache.tajo.exception.ExceptionUtil.throwIfError(ExceptionUtil.java:135)
at org.apache.tajo.client.QueryClientImpl.executeQueryAndGetResult(QueryClientImpl.java:198)
at org.apache.tajo.client.TajoClientImpl.executeQueryAndGetResult(TajoClientImpl.java:118)
at org.apache.tajo.QueryTestCaseBase.executeString(QueryTestCaseBase.java:393)
at org.apache.tajo.engine.query.TestHBaseTable.testInsertIntoRowField(TestHBaseTable.java:1234)
at sun.reflect.NativeMethodAccessorImpl.invoke0(Native Method)
at sun.reflect.NativeMethodAccessorImpl.invoke(NativeMethodAccessorImpl.java:57)
at sun.reflect.DelegatingMethodAccessorImpl.invoke(DelegatingMethodAccessorImpl.java:43)
at java.lang.reflect.Method.invoke(Method.java:606)
at org.junit.runners.model.FrameworkMethod$1.runReflectiveCall(FrameworkMethod.java:50)
at org.junit.internal.runners.model.ReflectiveCallable.run(ReflectiveCallable.java:12)
at org.junit.runners.model.FrameworkMethod.invokeExplosively(FrameworkMethod.java:47)
at org.junit.internal.runners.statements.InvokeMethod.evaluate(InvokeMethod.java:17)
at org.junit.internal.runners.statements.RunBefores.evaluate(RunBefores.java:26)
at org.junit.rules.TestWatcher$1.evaluate(TestWatcher.java:55)
at org.junit.rules.TestWatcher$1.evaluate(TestWatcher.java:55)
at org.junit.rules.RunRules.evaluate(RunRules.java:20)
at org.junit.runners.ParentRunner.runLeaf(ParentRunner.java:325)
at org.junit.runners.BlockJUnit4ClassRunner.runChild(BlockJUnit4ClassRunner.java:78)
at org.junit.runners.BlockJUnit4ClassRunner.runChild(BlockJUnit4ClassRunner.java:57)
at org.junit.runners.ParentRunner$3.run(ParentRunner.java:290)
at org.junit.runners.ParentRunner$1.schedule(ParentRunner.java:71)
at org.junit.runners.ParentRunner.runChildren(ParentRunner.java:288)
at org.junit.runners.ParentRunner.access$000(ParentRunner.java:58)
at org.junit.runners.ParentRunner$2.evaluate(ParentRunner.java:268)
at org.junit.internal.runners.statements.RunBefores.evaluate(RunBefores.java:26)
at org.junit.internal.runners.statements.RunAfters.evaluate(RunAfters.java:27)
at org.junit.runners.ParentRunner.run(ParentRunner.java:363)
at org.apache.maven.surefire.junit4.JUnit4Provider.execute(JUnit4Provider.java:344)
at org.apache.maven.surefire.junit4.JUnit4Provider.executeWithRerun(JUnit4Provider.java:269)
at org.apache.maven.surefire.junit4.JUnit4Provider.executeTestSet(JUnit4Provider.java:240)
at org.apache.maven.surefire.junit4.JUnit4Provider.invoke(JUnit4Provider.java:184)
at org.apache.maven.surefire.booter.ForkedBooter.invokeProviderInSameClassLoader(ForkedBooter.java:286)
at org.apache.maven.surefire.booter.ForkedBooter.runSuitesInProcess(ForkedBooter.java:240)
at org.apache.maven.surefire.booter.ForkedBooter.main(ForkedBooter.java:121)
2016-03-08 08:54:11,937 INFO: org.mortbay.log (info(67)) - Shutdown hook executing
2016-03-08 08:54:11,938 INFO: org.mortbay.log (info(67)) - Shutdown hook complete
2016-03-08 08:54:11,938 INFO: org.apache.tajo.worker.TajoWorker (run(569)) - ============================================
2016-03-08 08:54:11,939 INFO: org.apache.tajo.worker.TajoWorker (run(570)) - TajoWorker received SIGINT Signal
2016-03-08 08:54:11,939 INFO: org.apache.tajo.worker.TajoWorker (run(571)) - ============================================
2016-03-08 08:54:11,944 INFO: org.apache.tajo.util.history.HistoryWriter (run(275)) - HistoryWriter_asf905.gq1.ygridcore.net_32167 stopped.
2016-03-08 08:54:11,945 INFO: org.apache.tajo.util.history.HistoryCleaner (run(136)) - History cleaner stopped
2016-03-08 08:54:11,948 INFO: BlockStateChange (logAddStoredBlock(2621)) - BLOCK* addStoredBlock: blockMap updated: 127.0.0.1:33435 is added to blk_1073741849_1025{UCState=UNDER_CONSTRUCTION, truncateBlock=null, primaryNodeIndex=-1, replicas=[ReplicaUC[[DISK]DS-8399326e-6b17-40ac-b489-ead212471b06:NORMAL:127.0.0.1:33435|RBW]]} size 800
2016-03-08 08:54:11,955 INFO: org.apache.tajo.worker.NodeStatusUpdater (serviceStop(113)) - NodeStatusUpdater stopped.
2016-03-08 08:54:11,955 INFO: org.apache.tajo.worker.NodeStatusUpdater (run(261)) - Heartbeat Thread stopped.
2016-03-08 08:54:11,961 INFO: org.apache.tajo.rpc.NettyServerBase (shutdown(172)) - Rpc (QueryMasterProtocol) listened on 0:0:0:0:0:0:0:0:32169) shutdown
2016-03-08 08:54:11,961 INFO: org.apache.tajo.querymaster.QueryMasterManagerService (serviceStop(106)) - QueryMasterManagerService stopped
2016-03-08 08:54:11,962 INFO: org.apache.tajo.querymaster.QueryMaster (run(432)) - QueryMaster heartbeat thread stopped
2016-03-08 08:54:11,963 INFO: org.apache.tajo.querymaster.QueryMaster (serviceStop(164)) - QueryMaster stopped
2016-03-08 08:54:11,964 INFO: org.apache.tajo.worker.TajoWorkerClientService (stop(98)) - TajoWorkerClientService stopping
2016-03-08 08:54:11,964 INFO: org.apache.tajo.rpc.NettyServerBase (shutdown(172)) - Rpc (QueryMasterClientProtocol) listened on 0:0:0:0:0:0:0:0:32168) shutdown
2016-03-08 08:54:11,964 INFO: org.apache.tajo.worker.TajoWorkerClientService (stop(102)) - TajoWorkerClientService stopped
2016-03-08 08:54:11,966 INFO: org.apache.tajo.rpc.NettyServerBase (shutdown(172)) - Rpc (TajoWorkerProtocol) listened on 0:0:0:0:0:0:0:0:32167) shutdown
2016-03-08 08:54:11,966 INFO: org.apache.tajo.worker.TajoWorkerManagerService (serviceStop(93)) - TajoWorkerManagerService stopped
2016-03-08 08:54:11,967 INFO: org.apache.tajo.worker.TajoWorker (serviceStop(379)) - TajoWorker main thread exiting
2016-03-08 08:54:14,178 INFO: org.apache.tajo.master.TajoMaster (run(580)) - ============================================
2016-03-08 08:54:14,178 INFO: org.apache.tajo.master.TajoMaster (run(581)) - TajoMaster received SIGINT Signal
2016-03-08 08:54:14,178 INFO: org.apache.tajo.master.TajoMaster (run(582)) - ============================================
2016-03-08 08:54:14,182 INFO: org.apache.tajo.rpc.NettyServerBase (shutdown(172)) - Rpc (Tajo-REST) listened on 127.0.0.1:32166) shutdown
2016-03-08 08:54:14,182 INFO: org.apache.tajo.ws.rs.TajoRestService (serviceStop(129)) - Tajo Rest Service stopped.
2016-03-08 08:54:14,184 INFO: org.apache.tajo.util.history.HistoryWriter (run(275)) - HistoryWriter_127.0.0.1_32165 stopped.
2016-03-08 08:54:14,185 INFO: org.apache.tajo.rpc.NettyServerBase (shutdown(172)) - Rpc (QueryCoordinatorProtocol) listened on 127.0.0.1:32165) shutdown
2016-03-08 08:54:14,185 INFO: org.apache.tajo.util.history.HistoryCleaner (run(136)) - History cleaner stopped
2016-03-08 08:54:16,389 INFO: org.apache.tajo.rpc.NettyServerBase (shutdown(172)) - Rpc (TajoMasterClientProtocol) listened on 127.0.0.1:32164) shutdown
2016-03-08 08:54:16,390 INFO: org.apache.tajo.catalog.CatalogServer (serviceStop(188)) - Catalog Server (127.0.0.1:32163) shutdown
2016-03-08 08:54:16,390 INFO: org.apache.tajo.rpc.NettyServerBase (shutdown(172)) - Rpc (CatalogProtocol) listened on 127.0.0.1:32163) shutdown
2016-03-08 08:54:16,392 INFO: org.apache.tajo.catalog.store.DerbyStore (close(2901)) - Close database (jdbc:derby:memory:<https://builds.apache.org/job/Tajo-0.11.2-build/ws/tajo-core-tests/target/test-data/79372288-be9d-447d-a6ee-135a29cb57bf/db;create=true)>
2016-03-08 08:54:16,393 INFO: org.apache.tajo.rpc.NettyServerBase (shutdown(172)) - Rpc (TajoResourceTrackerProtocol) listened on 127.0.0.1:32162) shutdown
2016-03-08 08:54:16,393 INFO: org.apache.tajo.master.TajoMaster (serviceStop(440)) - Tajo Master main thread exiting
2016-03-08 08:54:16,431 INFO: org.apache.tajo.catalog.store.DerbyStore (shutdown(68)) - Derby shutdown complete normally.
2016-03-08 08:54:16,432 INFO: org.apache.tajo.catalog.store.DerbyStore (shutdown(75)) - Shutdown database
Results :
Tests in error:
TestHBaseTable.testCTAS:1290 » DuplicateTable table 'TestHBaseTable.base_table...
TestHBaseTable.testCompositeRowIndexPredication:512->QueryTestCaseBase.executeString:393 » DuplicateTable
TestHBaseTable.testCreateHBaseTable:127->QueryTestCaseBase.executeString:393 » TajoInternal
TestHBaseTable.testIndexPredication:467->QueryTestCaseBase.executeString:393 » DuplicateTable
TestHBaseTable.testInsertInto:742->QueryTestCaseBase.executeString:393 » DuplicateTable
TestHBaseTable.testInsertIntoBinaryMultiRegion:1053->QueryTestCaseBase.executeString:393 » DuplicateTable
TestHBaseTable.testInsertIntoColumnKeyValue:1135->QueryTestCaseBase.executeString:393 » TajoInternal
TestHBaseTable.testInsertIntoDifferentType:1198->QueryTestCaseBase.executeString:393 » DuplicateTable
TestHBaseTable.testInsertIntoLocation:1390->QueryTestCaseBase.executeString:393 » DuplicateTable
TestHBaseTable.testInsertIntoMultiRegion:824->QueryTestCaseBase.executeString:393 » DuplicateTable
TestHBaseTable.testInsertIntoMultiRegion2:880->QueryTestCaseBase.executeString:393 » DuplicateTable
TestHBaseTable.testInsertIntoMultiRegionMultiRowFields:994->QueryTestCaseBase.executeString:393 » DuplicateTable
TestHBaseTable.testInsertIntoMultiRegionWithSplitFile:937->QueryTestCaseBase.executeString:393 » DuplicateTable
TestHBaseTable.testInsertIntoRowField:1234->QueryTestCaseBase.executeString:393 » DuplicateTable
TestHBaseTable.testInsertIntoUsingPut:1340->QueryTestCaseBase.executeString:393 » DuplicateTable
TestHBaseTable.testInsertValues1:782->QueryTestCaseBase.executeString:393 » DuplicateTable
TestHBaseTable.testJoin:702->QueryTestCaseBase.executeString:393 » DuplicateTable
Tests run: 28, Failures: 0, Errors: 17, Skipped: 0
[INFO] ------------------------------------------------------------------------
[INFO] BUILD FAILURE
[INFO] ------------------------------------------------------------------------
[INFO] Total time: 02:29 min
[INFO] Finished at: 2016-03-08T08:54:16+00:00
[INFO] Final Memory: 69M/1298M
[INFO] ------------------------------------------------------------------------
[ERROR] Failed to execute goal org.apache.maven.plugins:maven-surefire-plugin:2.19:test (default-test) on project tajo-core-tests: There are test failures.
[ERROR]
[ERROR] Please refer to <https://builds.apache.org/job/Tajo-0.11.2-build/ws/tajo-core-tests/target/surefire-reports> for the individual test results.
[ERROR] -> [Help 1]
[ERROR]
[ERROR] To see the full stack trace of the errors, re-run Maven with the -e switch.
[ERROR] Re-run Maven using the -X switch to enable full debug logging.
[ERROR]
[ERROR] For more information about the errors and possible solutions, please read the following articles:
[ERROR] [Help 1] http://cwiki.apache.org/confluence/display/MAVEN/MojoFailureException
Build step 'Execute shell' marked build as failure
Archiving artifacts
Updating TAJO-1793
Jenkins build is back to normal : Tajo-0.11.2-build #180
Posted by Apache Jenkins Server <je...@builds.apache.org>.
See <https://builds.apache.org/job/Tajo-0.11.2-build/180/changes>