You are viewing a plain text version of this content. The canonical link for it is here.
Posted to commits@phoenix.apache.org by Apache Jenkins Server <je...@builds.apache.org> on 2014/03/03 02:34:50 UTC
Build failed in Jenkins: Apache Phoenix - Branch:master #94
See <https://builds.apache.org/job/Phoenix/94/changes>
Changes:
[jamestaylor] PHOENIX-97 Sort columns by COLUMN_NAME for metaData.getPrimaryKey() as dictated by spec (JamesTaylor)
------------------------------------------
[...truncated 293 lines...]
Tests run: 61, Failures: 0, Errors: 0, Skipped: 0, Time elapsed: 51.174 sec - in org.apache.phoenix.end2end.ProductMetricsTest
Running org.apache.phoenix.end2end.DynamicUpsertTest
Tests run: 7, Failures: 0, Errors: 0, Skipped: 0, Time elapsed: 30.399 sec - in org.apache.phoenix.end2end.DynamicUpsertTest
Running org.apache.phoenix.end2end.UpsertSelectAutoCommitTest
Tests run: 1, Failures: 0, Errors: 0, Skipped: 0, Time elapsed: 30.193 sec - in org.apache.phoenix.end2end.UpsertSelectAutoCommitTest
Running org.apache.phoenix.end2end.TenantSpecificViewIndexTest
Tests run: 1, Failures: 0, Errors: 0, Skipped: 0, Time elapsed: 30.636 sec - in org.apache.phoenix.end2end.TenantSpecificViewIndexTest
Running org.apache.phoenix.end2end.SpooledOrderByTest
Tests run: 3, Failures: 0, Errors: 0, Skipped: 1, Time elapsed: 30.681 sec - in org.apache.phoenix.end2end.SpooledOrderByTest
Running org.apache.phoenix.end2end.DeleteTest
Tests run: 13, Failures: 0, Errors: 0, Skipped: 0, Time elapsed: 39.61 sec - in org.apache.phoenix.end2end.DeleteTest
Running org.apache.phoenix.end2end.ViewTest
Tests run: 6, Failures: 0, Errors: 0, Skipped: 0, Time elapsed: 29.584 sec - in org.apache.phoenix.end2end.ViewTest
Running org.apache.phoenix.end2end.ArrayTest
Tests run: 29, Failures: 0, Errors: 0, Skipped: 0, Time elapsed: 39.369 sec - in org.apache.phoenix.end2end.ArrayTest
Running org.apache.phoenix.end2end.PercentileTest
Tests run: 17, Failures: 0, Errors: 0, Skipped: 0, Time elapsed: 32.728 sec - in org.apache.phoenix.end2end.PercentileTest
Running org.apache.phoenix.end2end.UpsertBigValuesTest
Tests run: 4, Failures: 0, Errors: 0, Skipped: 0, Time elapsed: 34.18 sec - in org.apache.phoenix.end2end.UpsertBigValuesTest
Running org.apache.phoenix.end2end.QueryTest
Tests run: 432, Failures: 0, Errors: 0, Skipped: 0, Time elapsed: 241.554 sec - in org.apache.phoenix.end2end.QueryTest
Running org.apache.phoenix.end2end.CoalesceFunctionTest
Tests run: 1, Failures: 0, Errors: 0, Skipped: 0, Time elapsed: 32.293 sec - in org.apache.phoenix.end2end.CoalesceFunctionTest
Running org.apache.phoenix.end2end.UpsertValuesTest
Tests run: 10, Failures: 0, Errors: 0, Skipped: 0, Time elapsed: 44.469 sec - in org.apache.phoenix.end2end.UpsertValuesTest
Running org.apache.phoenix.end2end.RoundFloorCeilFunctionsEnd2EndTest
Tests run: 21, Failures: 0, Errors: 0, Skipped: 0, Time elapsed: 31.687 sec - in org.apache.phoenix.end2end.RoundFloorCeilFunctionsEnd2EndTest
Running org.apache.phoenix.end2end.UpsertSelectTest
Tests run: 11, Failures: 0, Errors: 0, Skipped: 0, Time elapsed: 57.728 sec - in org.apache.phoenix.end2end.UpsertSelectTest
Running org.apache.phoenix.end2end.ReverseFunctionTest
Tests run: 5, Failures: 0, Errors: 0, Skipped: 0, Time elapsed: 28.915 sec - in org.apache.phoenix.end2end.ReverseFunctionTest
Running org.apache.phoenix.end2end.RowValueConstructorTest
Tests run: 24, Failures: 0, Errors: 0, Skipped: 0, Time elapsed: 40.154 sec - in org.apache.phoenix.end2end.RowValueConstructorTest
Running org.apache.phoenix.end2end.NativeHBaseTypesTest
Tests run: 7, Failures: 0, Errors: 0, Skipped: 0, Time elapsed: 30.224 sec - in org.apache.phoenix.end2end.NativeHBaseTypesTest
Running org.apache.phoenix.end2end.DynamicFamilyTest
Tests run: 4, Failures: 0, Errors: 0, Skipped: 0, Time elapsed: 31.173 sec - in org.apache.phoenix.end2end.DynamicFamilyTest
Running org.apache.phoenix.end2end.AutoCommitTest
Tests run: 1, Failures: 0, Errors: 0, Skipped: 0, Time elapsed: 28.978 sec - in org.apache.phoenix.end2end.AutoCommitTest
Running org.apache.phoenix.end2end.SpillableGroupByTest
Tests run: 1, Failures: 0, Errors: 0, Skipped: 0, Time elapsed: 30.261 sec - in org.apache.phoenix.end2end.SpillableGroupByTest
Running org.apache.phoenix.end2end.ExecuteStatementsTest
Tests run: 2, Failures: 0, Errors: 0, Skipped: 0, Time elapsed: 36.033 sec - in org.apache.phoenix.end2end.ExecuteStatementsTest
Running org.apache.phoenix.end2end.index.ImmutableIndexTest
Tests run: 7, Failures: 0, Errors: 0, Skipped: 0, Time elapsed: 41.154 sec - in org.apache.phoenix.end2end.index.ImmutableIndexTest
Running org.apache.phoenix.end2end.index.DropViewTest
Tests run: 1, Failures: 0, Errors: 0, Skipped: 0, Time elapsed: 29.834 sec - in org.apache.phoenix.end2end.index.DropViewTest
Running org.apache.phoenix.end2end.index.SaltedIndexTest
Tests run: 3, Failures: 0, Errors: 0, Skipped: 0, Time elapsed: 51.228 sec - in org.apache.phoenix.end2end.index.SaltedIndexTest
Running org.apache.phoenix.end2end.index.MutableIndexFailureTest
Tests run: 1, Failures: 0, Errors: 0, Skipped: 0, Time elapsed: 61.162 sec - in org.apache.phoenix.end2end.index.MutableIndexFailureTest
Running org.apache.phoenix.end2end.index.MutableIndexTest
Tests run: 11, Failures: 0, Errors: 0, Skipped: 0, Time elapsed: 74.99 sec - in org.apache.phoenix.end2end.index.MutableIndexTest
Running org.apache.phoenix.end2end.index.IndexMetadataTest
Tests run: 4, Failures: 0, Errors: 0, Skipped: 0, Time elapsed: 39.826 sec - in org.apache.phoenix.end2end.index.IndexMetadataTest
Running org.apache.phoenix.end2end.ToCharFunctionTest
Tests run: 10, Failures: 0, Errors: 0, Skipped: 0, Time elapsed: 30.816 sec - in org.apache.phoenix.end2end.ToCharFunctionTest
Running org.apache.phoenix.filter.SkipScanFilterTest
Tests run: 13, Failures: 0, Errors: 0, Skipped: 0, Time elapsed: 0.02 sec - in org.apache.phoenix.filter.SkipScanFilterTest
Running org.apache.phoenix.filter.SkipScanFilterIntersectTest
Tests run: 17, Failures: 0, Errors: 0, Skipped: 0, Time elapsed: 0.007 sec - in org.apache.phoenix.filter.SkipScanFilterIntersectTest
Running org.apache.phoenix.jdbc.PhoenixEmbeddedDriverTest
Tests run: 3, Failures: 0, Errors: 0, Skipped: 0, Time elapsed: 0.001 sec - in org.apache.phoenix.jdbc.PhoenixEmbeddedDriverTest
Running org.apache.phoenix.expression.CoerceExpressionTest
Tests run: 5, Failures: 0, Errors: 0, Skipped: 0, Time elapsed: 0.001 sec - in org.apache.phoenix.expression.CoerceExpressionTest
Running org.apache.phoenix.expression.ColumnExpressionTest
Tests run: 4, Failures: 0, Errors: 0, Skipped: 0, Time elapsed: 0 sec - in org.apache.phoenix.expression.ColumnExpressionTest
Running org.apache.phoenix.expression.LikeExpressionTest
Tests run: 1, Failures: 0, Errors: 0, Skipped: 0, Time elapsed: 0 sec - in org.apache.phoenix.expression.LikeExpressionTest
Running org.apache.phoenix.expression.SortOrderExpressionTest
Tests run: 23, Failures: 0, Errors: 0, Skipped: 0, Time elapsed: 0.006 sec - in org.apache.phoenix.expression.SortOrderExpressionTest
Running org.apache.phoenix.schema.SchemaUtilTest
Tests run: 3, Failures: 0, Errors: 0, Skipped: 0, Time elapsed: 0 sec - in org.apache.phoenix.schema.SchemaUtilTest
Running org.apache.phoenix.schema.SortOrderTest
Tests run: 7, Failures: 0, Errors: 0, Skipped: 0, Time elapsed: 0 sec - in org.apache.phoenix.schema.SortOrderTest
Running org.apache.phoenix.schema.PDataTypeForArraysTest
Tests run: 60, Failures: 0, Errors: 0, Skipped: 0, Time elapsed: 0.009 sec - in org.apache.phoenix.schema.PDataTypeForArraysTest
Running org.apache.phoenix.schema.RowKeySchemaTest
Tests run: 6, Failures: 0, Errors: 0, Skipped: 0, Time elapsed: 0.025 sec - in org.apache.phoenix.schema.RowKeySchemaTest
Running org.apache.phoenix.schema.PMetaDataImplTest
Tests run: 1, Failures: 0, Errors: 0, Skipped: 0, Time elapsed: 0.001 sec - in org.apache.phoenix.schema.PMetaDataImplTest
Running org.apache.phoenix.schema.RowKeyValueAccessorTest
Tests run: 1, Failures: 0, Errors: 0, Skipped: 0, Time elapsed: 0.021 sec - in org.apache.phoenix.schema.RowKeyValueAccessorTest
Running org.apache.phoenix.schema.ValueBitSetTest
Tests run: 2, Failures: 0, Errors: 0, Skipped: 0, Time elapsed: 0 sec - in org.apache.phoenix.schema.ValueBitSetTest
Running org.apache.phoenix.schema.PDataTypeTest
Tests run: 22, Failures: 0, Errors: 0, Skipped: 0, Time elapsed: 0.007 sec - in org.apache.phoenix.schema.PDataTypeTest
Running org.apache.phoenix.util.LikeExpressionTest
Tests run: 1, Failures: 0, Errors: 0, Skipped: 0, Time elapsed: 0 sec - in org.apache.phoenix.util.LikeExpressionTest
Running org.apache.phoenix.util.DateUtilTest
Tests run: 1, Failures: 0, Errors: 0, Skipped: 0, Time elapsed: 0 sec - in org.apache.phoenix.util.DateUtilTest
Running org.apache.phoenix.util.PhoenixRuntimeTest
Tests run: 1, Failures: 0, Errors: 0, Skipped: 0, Time elapsed: 0.019 sec - in org.apache.phoenix.util.PhoenixRuntimeTest
Running org.apache.phoenix.util.MetaDataUtilTest
Tests run: 3, Failures: 0, Errors: 0, Skipped: 0, Time elapsed: 0.002 sec - in org.apache.phoenix.util.MetaDataUtilTest
Running org.apache.phoenix.util.ScanUtilTest
Tests run: 20, Failures: 0, Errors: 0, Skipped: 0, Time elapsed: 0.006 sec - in org.apache.phoenix.util.ScanUtilTest
Running org.apache.phoenix.util.ByteUtilTest
Tests run: 3, Failures: 0, Errors: 0, Skipped: 0, Time elapsed: 0.024 sec - in org.apache.phoenix.util.ByteUtilTest
Running org.apache.phoenix.query.HBaseFactoryProviderTest
Tests run: 3, Failures: 0, Errors: 0, Skipped: 0, Time elapsed: 0 sec - in org.apache.phoenix.query.HBaseFactoryProviderTest
Running org.apache.phoenix.query.ConnectionlessUpsertTest
Tests run: 3, Failures: 0, Errors: 0, Skipped: 0, Time elapsed: 0.016 sec - in org.apache.phoenix.query.ConnectionlessUpsertTest
Running org.apache.phoenix.index.IndexMaintainerTest
Tests run: 17, Failures: 0, Errors: 0, Skipped: 0, Time elapsed: 0.105 sec - in org.apache.phoenix.index.IndexMaintainerTest
Running org.apache.phoenix.arithmetic.ArithmeticOperationTest
Tests run: 4, Failures: 0, Errors: 0, Skipped: 0, Time elapsed: 0.001 sec - in org.apache.phoenix.arithmetic.ArithmeticOperationTest
Running org.apache.hadoop.hbase.regionserver.wal.TestWALReplayWithIndexWritesAndCompressedWAL
Tests run: 1, Failures: 0, Errors: 0, Skipped: 0, Time elapsed: 36.556 sec - in org.apache.hadoop.hbase.regionserver.wal.TestWALReplayWithIndexWritesAndCompressedWAL
Running org.apache.hadoop.hbase.regionserver.wal.TestWALReplayWithIndexWritesAndUncompressedWALInHBase_094_9
Tests run: 1, Failures: 0, Errors: 0, Skipped: 0, Time elapsed: 35.171 sec - in org.apache.hadoop.hbase.regionserver.wal.TestWALReplayWithIndexWritesAndUncompressedWALInHBase_094_9
Running org.apache.hadoop.hbase.regionserver.wal.TestReadWriteKeyValuesWithCodec
Tests run: 2, Failures: 0, Errors: 0, Skipped: 0, Time elapsed: 0.025 sec - in org.apache.hadoop.hbase.regionserver.wal.TestReadWriteKeyValuesWithCodec
Results :
Tests run: 1739, Failures: 0, Errors: 0, Skipped: 8
[INFO]
[INFO] --- maven-source-plugin:2.2.1:jar-no-fork (attach-sources) @ phoenix-core ---
[INFO] Building jar: <https://builds.apache.org/job/Phoenix/94/artifact/phoenix-core/target/phoenix-core-3.0.0-SNAPSHOT-sources.jar>
[INFO]
[INFO] --- maven-jar-plugin:2.4:test-jar (default) @ phoenix-core ---
[INFO] Building jar: <https://builds.apache.org/job/Phoenix/94/artifact/phoenix-core/target/phoenix-core-3.0.0-SNAPSHOT-tests.jar>
[INFO]
[INFO] --- maven-jar-plugin:2.4:jar (default-jar) @ phoenix-core ---
[INFO] Building jar: <https://builds.apache.org/job/Phoenix/94/artifact/phoenix-core/target/phoenix-core-3.0.0-SNAPSHOT.jar>
[INFO]
[INFO] ------------------------------------------------------------------------
[INFO] Building Phoenix - Flume 3.0.0-SNAPSHOT
[INFO] ------------------------------------------------------------------------
[INFO]
[INFO] --- maven-clean-plugin:2.4.1:clean (default-clean) @ phoenix-flume ---
[INFO] Deleting <https://builds.apache.org/job/Phoenix/ws/phoenix-flume/target>
[INFO]
[INFO] --- maven-resources-plugin:2.5:resources (default-resources) @ phoenix-flume ---
[debug] execute contextualize
[INFO] Using 'UTF-8' encoding to copy filtered resources.
[INFO] skip non existing resourceDirectory <https://builds.apache.org/job/Phoenix/ws/phoenix-flume/src/main/resources>
[INFO]
[INFO] --- maven-compiler-plugin:3.0:compile (default-compile) @ phoenix-flume ---
[INFO] Changes detected - recompiling the module!
[INFO] Compiling 9 source files to <https://builds.apache.org/job/Phoenix/ws/phoenix-flume/target/classes>
[INFO]
[INFO] --- maven-resources-plugin:2.5:testResources (default-testResources) @ phoenix-flume ---
[debug] execute contextualize
[INFO] Using 'UTF-8' encoding to copy filtered resources.
[INFO] skip non existing resourceDirectory <https://builds.apache.org/job/Phoenix/ws/phoenix-flume/src/test/resources>
[INFO]
[INFO] --- maven-compiler-plugin:3.0:testCompile (default-testCompile) @ phoenix-flume ---
[INFO] Changes detected - recompiling the module!
[INFO] Compiling 2 source files to <https://builds.apache.org/job/Phoenix/ws/phoenix-flume/target/test-classes>
[INFO]
[INFO] --- maven-surefire-plugin:2.16:test (default-test) @ phoenix-flume ---
[INFO] Surefire report directory: <https://builds.apache.org/job/Phoenix/ws/phoenix-flume/target/surefire-reports>
-------------------------------------------------------
T E S T S
-------------------------------------------------------
Running org.apache.phoenix.flume.TestRegexEventSerializer
Tests run: 6, Failures: 1, Errors: 3, Skipped: 0, Time elapsed: 54.754 sec <<< FAILURE! - in org.apache.phoenix.flume.TestRegexEventSerializer
testMismatchKeyGenerator(org.apache.phoenix.flume.TestRegexEventSerializer) Time elapsed: 28.871 sec <<< FAILURE!
java.lang.AssertionError: null
at org.junit.Assert.fail(Assert.java:86)
at org.junit.Assert.assertTrue(Assert.java:41)
at org.junit.Assert.assertTrue(Assert.java:52)
at org.apache.phoenix.flume.TestRegexEventSerializer.testMismatchKeyGenerator(TestRegexEventSerializer.java:122)
testEventsWithHeaders(org.apache.phoenix.flume.TestRegexEventSerializer) Time elapsed: 3.551 sec <<< ERROR!
java.lang.RuntimeException: org.apache.phoenix.schema.ColumnNotFoundException: ERROR 504 (42703): Undefined column. columnName=FLUME_TEST.CF1.COL2
at org.apache.phoenix.exception.SQLExceptionCode$5.newException(SQLExceptionCode.java:117)
at org.apache.phoenix.exception.SQLExceptionInfo.buildException(SQLExceptionInfo.java:133)
at org.apache.phoenix.flume.serializer.BaseEventSerializer.addToColumnMetadataInfo(BaseEventSerializer.java:216)
at org.apache.phoenix.flume.serializer.BaseEventSerializer.initialize(BaseEventSerializer.java:179)
at org.apache.phoenix.flume.sink.PhoenixSink.start(PhoenixSink.java:114)
at org.apache.phoenix.flume.TestRegexEventSerializer.testEventsWithHeaders(TestRegexEventSerializer.java:303)
testKeyGenerator(org.apache.phoenix.flume.TestRegexEventSerializer) Time elapsed: 3.149 sec <<< ERROR!
org.apache.flume.EventDeliveryException: Failed to persist message to Hbase
at org.apache.phoenix.flume.serializer.RegexEventSerializer.upsertEvents(RegexEventSerializer.java:138)
at org.apache.phoenix.flume.sink.PhoenixSink.process(PhoenixSink.java:171)
at org.apache.phoenix.flume.TestRegexEventSerializer.testKeyGenerator(TestRegexEventSerializer.java:82)
testApacheLogRegex(org.apache.phoenix.flume.TestRegexEventSerializer) Time elapsed: 2.303 sec <<< ERROR!
java.lang.RuntimeException: org.apache.phoenix.schema.TableNotFoundException: ERROR 1012 (42M03): Table undefined. tableName=apachelogs
at org.apache.phoenix.exception.SQLExceptionCode$9.newException(SQLExceptionCode.java:175)
at org.apache.phoenix.exception.SQLExceptionInfo.buildException(SQLExceptionInfo.java:133)
at org.apache.phoenix.flume.serializer.BaseEventSerializer.initialize(BaseEventSerializer.java:169)
at org.apache.phoenix.flume.sink.PhoenixSink.start(PhoenixSink.java:114)
at org.apache.phoenix.flume.TestRegexEventSerializer.testApacheLogRegex(TestRegexEventSerializer.java:244)
Running org.apache.phoenix.flume.TestPhoenixSink
Tests run: 7, Failures: 0, Errors: 1, Skipped: 0, Time elapsed: 31.017 sec <<< FAILURE! - in org.apache.phoenix.flume.TestPhoenixSink
testSinkLifecycle(org.apache.phoenix.flume.TestPhoenixSink) Time elapsed: 0.082 sec <<< ERROR!
java.lang.RuntimeException: org.apache.phoenix.schema.TableNotFoundException: ERROR 1012 (42M03): Table undefined. tableName=flume_test
at org.apache.phoenix.exception.SQLExceptionCode$9.newException(SQLExceptionCode.java:175)
at org.apache.phoenix.exception.SQLExceptionInfo.buildException(SQLExceptionInfo.java:133)
at org.apache.phoenix.flume.serializer.BaseEventSerializer.initialize(BaseEventSerializer.java:169)
at org.apache.phoenix.flume.sink.PhoenixSink.start(PhoenixSink.java:114)
at org.apache.phoenix.flume.TestPhoenixSink.testSinkLifecycle(TestPhoenixSink.java:142)
Results :
Failed tests:
TestRegexEventSerializer.testMismatchKeyGenerator:122 null
Tests in error:
TestRegexEventSerializer.testEventsWithHeaders:303 ? Runtime org.apache.phoeni...
TestRegexEventSerializer.testKeyGenerator:82 ? EventDelivery Failed to persist...
TestRegexEventSerializer.testApacheLogRegex:244 ? Runtime org.apache.phoenix.s...
TestPhoenixSink.testSinkLifecycle:142 ? Runtime org.apache.phoenix.schema.Tabl...
Tests run: 13, Failures: 1, Errors: 4, Skipped: 0
[INFO] ------------------------------------------------------------------------
[INFO] Reactor Summary:
[INFO]
[INFO] Apache Phoenix .................................... SUCCESS [4.357s]
[INFO] Phoenix Hadoop Compatibility ...................... SUCCESS [4.048s]
[INFO] Phoenix Core ...................................... SUCCESS [58:15.707s]
[INFO] Phoenix - Flume ................................... FAILURE [1:28.884s]
[INFO] Phoenix - Pig ..................................... SKIPPED
[INFO] Phoenix Hadoop1 Compatibility ..................... SKIPPED
[INFO] Phoenix Assebmly .................................. SKIPPED
[INFO] ------------------------------------------------------------------------
[INFO] BUILD FAILURE
[INFO] ------------------------------------------------------------------------
[INFO] Total time: 59:53.350s
[INFO] Finished at: Mon Mar 03 01:34:31 UTC 2014
[INFO] Final Memory: 26M/254M
[INFO] ------------------------------------------------------------------------
[ERROR] Failed to execute goal org.apache.maven.plugins:maven-surefire-plugin:2.16:test (default-test) on project phoenix-flume: There are test failures.
[ERROR]
[ERROR] Please refer to <https://builds.apache.org/job/Phoenix/ws/phoenix-flume/target/surefire-reports> for the individual test results.
[ERROR] -> [Help 1]
[ERROR]
[ERROR] To see the full stack trace of the errors, re-run Maven with the -e switch.
[ERROR] Re-run Maven using the -X switch to enable full debug logging.
[ERROR]
[ERROR] For more information about the errors and possible solutions, please read the following articles:
[ERROR] [Help 1] http://cwiki.apache.org/confluence/display/MAVEN/MojoFailureException
[ERROR]
[ERROR] After correcting the problems, you can resume the build with the command
[ERROR] mvn <goals> -rf :phoenix-flume
Build step 'Invoke top-level Maven targets' marked build as failure
Archiving artifacts
Updating PHOENIX-97
Recording test results
Jenkins build is back to normal : Apache Phoenix - Branch:master
#98
Posted by Apache Jenkins Server <je...@builds.apache.org>.
See <https://builds.apache.org/job/Phoenix/98/changes>
Build failed in Jenkins: Apache Phoenix - Branch:master #97
Posted by Apache Jenkins Server <je...@builds.apache.org>.
See <https://builds.apache.org/job/Phoenix/97/changes>
Changes:
[jamestaylor] PHOENIX-99 Automatic white list based upgrade from 2.2 to 3.0 (JamesTaylor)
[jamestaylor] PHOENIX-102 IndexMaintainer constructor doesn't set isMultiTenant correctly (JamesTaylor)
------------------------------------------
[...truncated 208 lines...]
Tests run: 3, Failures: 0, Errors: 0, Skipped: 1, Time elapsed: 28.884 sec - in org.apache.phoenix.end2end.OrderByTest
Running org.apache.phoenix.end2end.ArithmeticQueryTest
Tests run: 8, Failures: 0, Errors: 0, Skipped: 0, Time elapsed: 28.094 sec - in org.apache.phoenix.end2end.ArithmeticQueryTest
Running org.apache.phoenix.end2end.ReadIsolationLevelTest
Tests run: 2, Failures: 0, Errors: 0, Skipped: 0, Time elapsed: 25.483 sec - in org.apache.phoenix.end2end.ReadIsolationLevelTest
Running org.apache.phoenix.end2end.ColumnProjectionOptimizationTest
Tests run: 2, Failures: 0, Errors: 0, Skipped: 0, Time elapsed: 28.346 sec - in org.apache.phoenix.end2end.ColumnProjectionOptimizationTest
Running org.apache.phoenix.end2end.AutoCommitTest
Tests run: 1, Failures: 0, Errors: 0, Skipped: 0, Time elapsed: 19.174 sec - in org.apache.phoenix.end2end.AutoCommitTest
Running org.apache.phoenix.end2end.ReverseFunctionTest
Tests run: 5, Failures: 0, Errors: 0, Skipped: 0, Time elapsed: 27.202 sec - in org.apache.phoenix.end2end.ReverseFunctionTest
Running org.apache.phoenix.end2end.QueryTest
Tests run: 432, Failures: 0, Errors: 0, Skipped: 0, Time elapsed: 357.172 sec - in org.apache.phoenix.end2end.QueryTest
Running org.apache.phoenix.end2end.ViewTest
Tests run: 6, Failures: 0, Errors: 0, Skipped: 0, Time elapsed: 26.689 sec - in org.apache.phoenix.end2end.ViewTest
Running org.apache.phoenix.end2end.AlterTableTest
Tests run: 13, Failures: 0, Errors: 0, Skipped: 0, Time elapsed: 56.016 sec - in org.apache.phoenix.end2end.AlterTableTest
Running org.apache.phoenix.end2end.UpsertValuesTest
Tests run: 10, Failures: 0, Errors: 0, Skipped: 0, Time elapsed: 37.018 sec - in org.apache.phoenix.end2end.UpsertValuesTest
Running org.apache.phoenix.end2end.ServerExceptionTest
Tests run: 1, Failures: 0, Errors: 0, Skipped: 0, Time elapsed: 17.118 sec - in org.apache.phoenix.end2end.ServerExceptionTest
Running org.apache.phoenix.end2end.QueryPlanTest
Tests run: 1, Failures: 0, Errors: 0, Skipped: 0, Time elapsed: 26.425 sec - in org.apache.phoenix.end2end.QueryPlanTest
Running org.apache.phoenix.end2end.PercentileTest
Tests run: 17, Failures: 0, Errors: 0, Skipped: 0, Time elapsed: 27.51 sec - in org.apache.phoenix.end2end.PercentileTest
Running org.apache.phoenix.end2end.SequenceTest
Tests run: 21, Failures: 0, Errors: 0, Skipped: 0, Time elapsed: 29.062 sec - in org.apache.phoenix.end2end.SequenceTest
Running org.apache.phoenix.end2end.QueryExecWithoutSCNTest
Tests run: 1, Failures: 0, Errors: 0, Skipped: 0, Time elapsed: 19.044 sec - in org.apache.phoenix.end2end.QueryExecWithoutSCNTest
Running org.apache.phoenix.end2end.HashJoinTest
Tests run: 48, Failures: 0, Errors: 0, Skipped: 0, Time elapsed: 67.154 sec - in org.apache.phoenix.end2end.HashJoinTest
Running org.apache.phoenix.end2end.MD5FunctionTest
Tests run: 2, Failures: 0, Errors: 0, Skipped: 0, Time elapsed: 17.977 sec - in org.apache.phoenix.end2end.MD5FunctionTest
Running org.apache.phoenix.end2end.StatementHintsTest
Tests run: 2, Failures: 0, Errors: 0, Skipped: 0, Time elapsed: 26.497 sec - in org.apache.phoenix.end2end.StatementHintsTest
Running org.apache.phoenix.end2end.StddevTest
Tests run: 4, Failures: 0, Errors: 0, Skipped: 0, Time elapsed: 20.15 sec - in org.apache.phoenix.end2end.StddevTest
Running org.apache.phoenix.end2end.DistinctCountTest
Tests run: 9, Failures: 0, Errors: 0, Skipped: 0, Time elapsed: 26.899 sec - in org.apache.phoenix.end2end.DistinctCountTest
Running org.apache.phoenix.end2end.UpsertSelectAutoCommitTest
Tests run: 1, Failures: 0, Errors: 0, Skipped: 0, Time elapsed: 26.396 sec - in org.apache.phoenix.end2end.UpsertSelectAutoCommitTest
Running org.apache.phoenix.end2end.FunkyNamesTest
Tests run: 3, Failures: 0, Errors: 0, Skipped: 0, Time elapsed: 26.645 sec - in org.apache.phoenix.end2end.FunkyNamesTest
Running org.apache.phoenix.end2end.KeyOnlyTest
Tests run: 2, Failures: 0, Errors: 0, Skipped: 0, Time elapsed: 25.462 sec - in org.apache.phoenix.end2end.KeyOnlyTest
Running org.apache.phoenix.end2end.CustomEntityDataTest
Tests run: 3, Failures: 0, Errors: 0, Skipped: 0, Time elapsed: 27.119 sec - in org.apache.phoenix.end2end.CustomEntityDataTest
Running org.apache.phoenix.end2end.QueryDatabaseMetaDataTest
Tests run: 15, Failures: 0, Errors: 0, Skipped: 0, Time elapsed: 58.31 sec - in org.apache.phoenix.end2end.QueryDatabaseMetaDataTest
Running org.apache.phoenix.end2end.ArrayTest
Tests run: 29, Failures: 0, Errors: 0, Skipped: 0, Time elapsed: 37.132 sec - in org.apache.phoenix.end2end.ArrayTest
Running org.apache.phoenix.end2end.TenantSpecificTablesDMLTest
Tests run: 12, Failures: 0, Errors: 0, Skipped: 0, Time elapsed: 28.592 sec - in org.apache.phoenix.end2end.TenantSpecificTablesDMLTest
Running org.apache.phoenix.end2end.SkipRangeParallelIteratorRegionSplitterTest
Tests run: 8, Failures: 0, Errors: 0, Skipped: 0, Time elapsed: 26.993 sec - in org.apache.phoenix.end2end.SkipRangeParallelIteratorRegionSplitterTest
Running org.apache.phoenix.end2end.CompareDecimalToLongTest
Tests run: 8, Failures: 0, Errors: 0, Skipped: 0, Time elapsed: 27.171 sec - in org.apache.phoenix.end2end.CompareDecimalToLongTest
Running org.apache.phoenix.end2end.SpooledOrderByTest
Tests run: 3, Failures: 0, Errors: 0, Skipped: 1, Time elapsed: 26.522 sec - in org.apache.phoenix.end2end.SpooledOrderByTest
Running org.apache.phoenix.end2end.TenantSpecificViewIndexSaltedTest
Tests run: 1, Failures: 0, Errors: 0, Skipped: 0, Time elapsed: 26.44 sec - in org.apache.phoenix.end2end.TenantSpecificViewIndexSaltedTest
Running org.apache.phoenix.end2end.ExecuteStatementsTest
Tests run: 2, Failures: 0, Errors: 0, Skipped: 0, Time elapsed: 28.174 sec - in org.apache.phoenix.end2end.ExecuteStatementsTest
Running org.apache.phoenix.end2end.DynamicUpsertTest
Tests run: 7, Failures: 0, Errors: 0, Skipped: 0, Time elapsed: 18.146 sec - in org.apache.phoenix.end2end.DynamicUpsertTest
Running org.apache.phoenix.end2end.SortOrderFTest
Tests run: 29, Failures: 0, Errors: 0, Skipped: 0, Time elapsed: 27.118 sec - in org.apache.phoenix.end2end.SortOrderFTest
Running org.apache.phoenix.end2end.salted.SaltedTableVarLengthRowKeyTest
Tests run: 1, Failures: 0, Errors: 0, Skipped: 0, Time elapsed: 26.166 sec - in org.apache.phoenix.end2end.salted.SaltedTableVarLengthRowKeyTest
Running org.apache.phoenix.end2end.salted.SaltedTableTest
Tests run: 8, Failures: 0, Errors: 0, Skipped: 0, Time elapsed: 26.16 sec - in org.apache.phoenix.end2end.salted.SaltedTableTest
Running org.apache.phoenix.end2end.salted.SaltedTableUpsertSelectTest
Tests run: 5, Failures: 0, Errors: 0, Skipped: 0, Time elapsed: 26.924 sec - in org.apache.phoenix.end2end.salted.SaltedTableUpsertSelectTest
Running org.apache.phoenix.end2end.DynamicColumnTest
Tests run: 5, Failures: 0, Errors: 0, Skipped: 0, Time elapsed: 28.885 sec - in org.apache.phoenix.end2end.DynamicColumnTest
Running org.apache.phoenix.end2end.TenantSpecificViewIndexTest
Tests run: 1, Failures: 0, Errors: 0, Skipped: 0, Time elapsed: 28.286 sec - in org.apache.phoenix.end2end.TenantSpecificViewIndexTest
Running org.apache.phoenix.end2end.BinaryRowKeyTest
Tests run: 3, Failures: 0, Errors: 0, Skipped: 0, Time elapsed: 26.913 sec - in org.apache.phoenix.end2end.BinaryRowKeyTest
Running org.apache.phoenix.end2end.DynamicFamilyTest
Tests run: 4, Failures: 0, Errors: 0, Skipped: 0, Time elapsed: 28.321 sec - in org.apache.phoenix.end2end.DynamicFamilyTest
Running org.apache.phoenix.end2end.DefaultParallelIteratorsRegionSplitterTest
Tests run: 3, Failures: 1, Errors: 0, Skipped: 0, Time elapsed: 27.486 sec <<< FAILURE! - in org.apache.phoenix.end2end.DefaultParallelIteratorsRegionSplitterTest
testStatsManagerImpl(org.apache.phoenix.end2end.DefaultParallelIteratorsRegionSplitterTest) Time elapsed: 0.761 sec <<< FAILURE!
java.lang.AssertionError: null
at org.junit.Assert.fail(Assert.java:86)
at org.junit.Assert.assertTrue(Assert.java:41)
at org.junit.Assert.assertTrue(Assert.java:52)
at org.apache.phoenix.end2end.DefaultParallelIteratorsRegionSplitterTest.testStatsManagerImpl(DefaultParallelIteratorsRegionSplitterTest.java:292)
Running org.apache.phoenix.end2end.CSVLoaderTest
Tests run: 10, Failures: 0, Errors: 0, Skipped: 0, Time elapsed: 25.867 sec - in org.apache.phoenix.end2end.CSVLoaderTest
Running org.apache.phoenix.end2end.TenantSpecificTablesDDLTest
Tests run: 16, Failures: 0, Errors: 0, Skipped: 0, Time elapsed: 47.853 sec - in org.apache.phoenix.end2end.TenantSpecificTablesDDLTest
Running org.apache.phoenix.end2end.CoalesceFunctionTest
Tests run: 1, Failures: 0, Errors: 0, Skipped: 0, Time elapsed: 28.711 sec - in org.apache.phoenix.end2end.CoalesceFunctionTest
Running org.apache.phoenix.end2end.MultiCfQueryExecTest
Tests run: 7, Failures: 0, Errors: 0, Skipped: 0, Time elapsed: 31.467 sec - in org.apache.phoenix.end2end.MultiCfQueryExecTest
Running org.apache.phoenix.end2end.UpsertBigValuesTest
Tests run: 4, Failures: 0, Errors: 0, Skipped: 0, Time elapsed: 27.379 sec - in org.apache.phoenix.end2end.UpsertBigValuesTest
Running org.apache.phoenix.end2end.GroupByCaseTest
Tests run: 3, Failures: 0, Errors: 0, Skipped: 0, Time elapsed: 18.021 sec - in org.apache.phoenix.end2end.GroupByCaseTest
Running org.apache.phoenix.end2end.ProductMetricsTest
Tests run: 61, Failures: 0, Errors: 0, Skipped: 0, Time elapsed: 57.282 sec - in org.apache.phoenix.end2end.ProductMetricsTest
Running org.apache.phoenix.end2end.UpsertSelectTest
Tests run: 11, Failures: 0, Errors: 0, Skipped: 0, Time elapsed: 41.456 sec - in org.apache.phoenix.end2end.UpsertSelectTest
Running org.apache.phoenix.end2end.TopNTest
Tests run: 4, Failures: 0, Errors: 0, Skipped: 0, Time elapsed: 26.166 sec - in org.apache.phoenix.end2end.TopNTest
Running org.apache.phoenix.end2end.InMemoryOrderByTest
Tests run: 3, Failures: 0, Errors: 0, Skipped: 1, Time elapsed: 26.162 sec - in org.apache.phoenix.end2end.InMemoryOrderByTest
Running org.apache.phoenix.end2end.IsNullTest
Tests run: 1, Failures: 0, Errors: 0, Skipped: 0, Time elapsed: 18.017 sec - in org.apache.phoenix.end2end.IsNullTest
Running org.apache.phoenix.end2end.ToCharFunctionTest
Tests run: 10, Failures: 0, Errors: 0, Skipped: 0, Time elapsed: 26.014 sec - in org.apache.phoenix.end2end.ToCharFunctionTest
Running org.apache.phoenix.end2end.NativeHBaseTypesTest
Tests run: 7, Failures: 0, Errors: 0, Skipped: 0, Time elapsed: 26.499 sec - in org.apache.phoenix.end2end.NativeHBaseTypesTest
Running org.apache.phoenix.end2end.RoundFloorCeilFunctionsEnd2EndTest
Tests run: 21, Failures: 0, Errors: 0, Skipped: 0, Time elapsed: 25.68 sec - in org.apache.phoenix.end2end.RoundFloorCeilFunctionsEnd2EndTest
Running org.apache.phoenix.end2end.index.SaltedIndexTest
Tests run: 3, Failures: 0, Errors: 0, Skipped: 0, Time elapsed: 46.873 sec - in org.apache.phoenix.end2end.index.SaltedIndexTest
Running org.apache.phoenix.end2end.index.MutableIndexFailureTest
Tests run: 1, Failures: 0, Errors: 0, Skipped: 0, Time elapsed: 56.505 sec - in org.apache.phoenix.end2end.index.MutableIndexFailureTest
Running org.apache.phoenix.end2end.index.ImmutableIndexTest
Tests run: 7, Failures: 0, Errors: 0, Skipped: 0, Time elapsed: 37.122 sec - in org.apache.phoenix.end2end.index.ImmutableIndexTest
Running org.apache.phoenix.end2end.index.MutableIndexTest
Tests run: 11, Failures: 0, Errors: 0, Skipped: 0, Time elapsed: 59.797 sec - in org.apache.phoenix.end2end.index.MutableIndexTest
Running org.apache.phoenix.end2end.index.DropViewTest
Tests run: 1, Failures: 0, Errors: 0, Skipped: 0, Time elapsed: 26.193 sec - in org.apache.phoenix.end2end.index.DropViewTest
Running org.apache.phoenix.end2end.index.IndexMetadataTest
Tests run: 4, Failures: 0, Errors: 0, Skipped: 0, Time elapsed: 35.612 sec - in org.apache.phoenix.end2end.index.IndexMetadataTest
Running org.apache.phoenix.end2end.ToNumberFunctionTest
Tests run: 18, Failures: 0, Errors: 0, Skipped: 0, Time elapsed: 26.65 sec - in org.apache.phoenix.end2end.ToNumberFunctionTest
Running org.apache.phoenix.end2end.SpillableGroupByTest
Tests run: 1, Failures: 0, Errors: 0, Skipped: 0, Time elapsed: 25.857 sec - in org.apache.phoenix.end2end.SpillableGroupByTest
Running org.apache.phoenix.end2end.SkipScanQueryTest
Tests run: 7, Failures: 0, Errors: 0, Skipped: 0, Time elapsed: 28.431 sec - in org.apache.phoenix.end2end.SkipScanQueryTest
Running org.apache.phoenix.end2end.ExtendedQueryExecTest
Tests run: 4, Failures: 0, Errors: 0, Skipped: 0, Time elapsed: 28.686 sec - in org.apache.phoenix.end2end.ExtendedQueryExecTest
Running org.apache.phoenix.end2end.SaltedViewTest
Tests run: 1, Failures: 0, Errors: 0, Skipped: 0, Time elapsed: 27.529 sec - in org.apache.phoenix.end2end.SaltedViewTest
Running org.apache.phoenix.end2end.VariableLengthPKTest
Tests run: 49, Failures: 0, Errors: 0, Skipped: 0, Time elapsed: 50.743 sec - in org.apache.phoenix.end2end.VariableLengthPKTest
Running org.apache.phoenix.end2end.DeleteTest
Tests run: 13, Failures: 0, Errors: 0, Skipped: 0, Time elapsed: 39.751 sec - in org.apache.phoenix.end2end.DeleteTest
Running org.apache.phoenix.end2end.RowValueConstructorTest
Tests run: 24, Failures: 0, Errors: 0, Skipped: 0, Time elapsed: 38.762 sec - in org.apache.phoenix.end2end.RowValueConstructorTest
Running org.apache.phoenix.end2end.CreateTableTest
Tests run: 2, Failures: 0, Errors: 0, Skipped: 0, Time elapsed: 28.382 sec - in org.apache.phoenix.end2end.CreateTableTest
Running org.apache.phoenix.compile.ViewCompilerTest
Tests run: 3, Failures: 0, Errors: 0, Skipped: 0, Time elapsed: 0.08 sec - in org.apache.phoenix.compile.ViewCompilerTest
Running org.apache.phoenix.compile.QueryMetaDataTest
Tests run: 32, Failures: 0, Errors: 0, Skipped: 0, Time elapsed: 0.077 sec - in org.apache.phoenix.compile.QueryMetaDataTest
Running org.apache.phoenix.compile.HavingCompilerTest
Tests run: 10, Failures: 0, Errors: 0, Skipped: 0, Time elapsed: 0.045 sec - in org.apache.phoenix.compile.HavingCompilerTest
Running org.apache.phoenix.compile.WhereCompilerTest
Tests run: 41, Failures: 0, Errors: 0, Skipped: 1, Time elapsed: 0.119 sec - in org.apache.phoenix.compile.WhereCompilerTest
Running org.apache.phoenix.compile.SelectStatementRewriterTest
Tests run: 5, Failures: 0, Errors: 0, Skipped: 0, Time elapsed: 0.028 sec - in org.apache.phoenix.compile.SelectStatementRewriterTest
Running org.apache.phoenix.compile.LimitCompilerTest
Tests run: 6, Failures: 0, Errors: 0, Skipped: 0, Time elapsed: 0.034 sec - in org.apache.phoenix.compile.LimitCompilerTest
Running org.apache.phoenix.compile.WhereOptimizerTest
Tests run: 89, Failures: 0, Errors: 0, Skipped: 0, Time elapsed: 0.203 sec - in org.apache.phoenix.compile.WhereOptimizerTest
Running org.apache.phoenix.compile.JoinQueryCompilerTest
Tests run: 2, Failures: 0, Errors: 0, Skipped: 0, Time elapsed: 0.158 sec - in org.apache.phoenix.compile.JoinQueryCompilerTest
Running org.apache.phoenix.compile.QueryOptimizerTest
Tests run: 25, Failures: 0, Errors: 0, Skipped: 0, Time elapsed: 0.191 sec - in org.apache.phoenix.compile.QueryOptimizerTest
Running org.apache.phoenix.compile.QueryCompilerTest
Tests run: 77, Failures: 0, Errors: 0, Skipped: 0, Time elapsed: 0.287 sec - in org.apache.phoenix.compile.QueryCompilerTest
Running org.apache.phoenix.compile.ScanRangesTest
Tests run: 34, Failures: 0, Errors: 0, Skipped: 0, Time elapsed: 0.04 sec - in org.apache.phoenix.compile.ScanRangesTest
Running org.apache.phoenix.compile.StatementHintsCompilationTest
Tests run: 3, Failures: 0, Errors: 0, Skipped: 0, Time elapsed: 0.037 sec - in org.apache.phoenix.compile.StatementHintsCompilationTest
Running org.apache.phoenix.parse.QueryParserTest
Tests run: 46, Failures: 0, Errors: 0, Skipped: 0, Time elapsed: 0.015 sec - in org.apache.phoenix.parse.QueryParserTest
Running org.apache.phoenix.schema.PDataTypeTest
Tests run: 22, Failures: 0, Errors: 0, Skipped: 0, Time elapsed: 0.01 sec - in org.apache.phoenix.schema.PDataTypeTest
Running org.apache.phoenix.schema.SchemaUtilTest
Tests run: 3, Failures: 0, Errors: 0, Skipped: 0, Time elapsed: 0 sec - in org.apache.phoenix.schema.SchemaUtilTest
Running org.apache.phoenix.schema.PMetaDataImplTest
Tests run: 1, Failures: 0, Errors: 0, Skipped: 0, Time elapsed: 0.018 sec - in org.apache.phoenix.schema.PMetaDataImplTest
Running org.apache.phoenix.schema.SortOrderTest
Tests run: 7, Failures: 0, Errors: 0, Skipped: 0, Time elapsed: 0.007 sec - in org.apache.phoenix.schema.SortOrderTest
Running org.apache.phoenix.schema.PDataTypeForArraysTest
Tests run: 60, Failures: 0, Errors: 0, Skipped: 0, Time elapsed: 0.023 sec - in org.apache.phoenix.schema.PDataTypeForArraysTest
Running org.apache.phoenix.schema.RowKeyValueAccessorTest
Tests run: 1, Failures: 0, Errors: 0, Skipped: 0, Time elapsed: 0.058 sec - in org.apache.phoenix.schema.RowKeyValueAccessorTest
Running org.apache.phoenix.schema.RowKeySchemaTest
Tests run: 6, Failures: 0, Errors: 0, Skipped: 0, Time elapsed: 0.058 sec - in org.apache.phoenix.schema.RowKeySchemaTest
Running org.apache.phoenix.schema.ValueBitSetTest
Tests run: 2, Failures: 0, Errors: 0, Skipped: 0, Time elapsed: 0.016 sec - in org.apache.phoenix.schema.ValueBitSetTest
Running org.apache.phoenix.index.IndexMaintainerTest
Tests run: 17, Failures: 0, Errors: 0, Skipped: 0, Time elapsed: 0.221 sec - in org.apache.phoenix.index.IndexMaintainerTest
Running org.apache.phoenix.expression.SortOrderExpressionTest
Tests run: 23, Failures: 0, Errors: 0, Skipped: 0, Time elapsed: 0.011 sec - in org.apache.phoenix.expression.SortOrderExpressionTest
Running org.apache.phoenix.expression.ColumnExpressionTest
Tests run: 4, Failures: 0, Errors: 0, Skipped: 0, Time elapsed: 0.001 sec - in org.apache.phoenix.expression.ColumnExpressionTest
Running org.apache.phoenix.expression.LikeExpressionTest
Tests run: 1, Failures: 0, Errors: 0, Skipped: 0, Time elapsed: 0.001 sec - in org.apache.phoenix.expression.LikeExpressionTest
Running org.apache.phoenix.expression.CoerceExpressionTest
Tests run: 5, Failures: 0, Errors: 0, Skipped: 0, Time elapsed: 0.002 sec - in org.apache.phoenix.expression.CoerceExpressionTest
Running org.apache.hadoop.hbase.regionserver.wal.TestReadWriteKeyValuesWithCodec
Tests run: 2, Failures: 0, Errors: 0, Skipped: 0, Time elapsed: 0.129 sec - in org.apache.hadoop.hbase.regionserver.wal.TestReadWriteKeyValuesWithCodec
Running org.apache.hadoop.hbase.regionserver.wal.TestWALReplayWithIndexWritesAndCompressedWAL
Tests run: 1, Failures: 0, Errors: 0, Skipped: 0, Time elapsed: 22.429 sec - in org.apache.hadoop.hbase.regionserver.wal.TestWALReplayWithIndexWritesAndCompressedWAL
Running org.apache.hadoop.hbase.regionserver.wal.TestWALReplayWithIndexWritesAndUncompressedWALInHBase_094_9
Tests run: 1, Failures: 0, Errors: 0, Skipped: 0, Time elapsed: 21.711 sec - in org.apache.hadoop.hbase.regionserver.wal.TestWALReplayWithIndexWritesAndUncompressedWALInHBase_094_9
Results :
Failed tests:
DefaultParallelIteratorsRegionSplitterTest.testStatsManagerImpl:292 null
Tests run: 1739, Failures: 1, Errors: 0, Skipped: 8
[INFO] ------------------------------------------------------------------------
[INFO] Reactor Summary:
[INFO]
[INFO] Apache Phoenix .................................... SUCCESS [2.097s]
[INFO] Phoenix Hadoop Compatibility ...................... SUCCESS [1.988s]
[INFO] Phoenix Core ...................................... FAILURE [48:37.053s]
[INFO] Phoenix - Flume ................................... SKIPPED
[INFO] Phoenix - Pig ..................................... SKIPPED
[INFO] Phoenix Hadoop1 Compatibility ..................... SKIPPED
[INFO] Phoenix Assebmly .................................. SKIPPED
[INFO] ------------------------------------------------------------------------
[INFO] BUILD FAILURE
[INFO] ------------------------------------------------------------------------
[INFO] Total time: 48:41.908s
[INFO] Finished at: Mon Mar 03 20:38:48 UTC 2014
[INFO] Final Memory: 28M/346M
[INFO] ------------------------------------------------------------------------
[ERROR] Failed to execute goal org.apache.maven.plugins:maven-surefire-plugin:2.16:test (default-test) on project phoenix-core: There are test failures.
[ERROR]
[ERROR] Please refer to <https://builds.apache.org/job/Phoenix/ws/phoenix-core/target/surefire-reports> for the individual test results.
[ERROR] -> [Help 1]
[ERROR]
[ERROR] To see the full stack trace of the errors, re-run Maven with the -e switch.
[ERROR] Re-run Maven using the -X switch to enable full debug logging.
[ERROR]
[ERROR] For more information about the errors and possible solutions, please read the following articles:
[ERROR] [Help 1] http://cwiki.apache.org/confluence/display/MAVEN/MojoFailureException
[ERROR]
[ERROR] After correcting the problems, you can resume the build with the command
[ERROR] mvn <goals> -rf :phoenix-core
Build step 'Invoke top-level Maven targets' marked build as failure
Archiving artifacts
Updating PHOENIX-99
Updating PHOENIX-102
Recording test results
Build failed in Jenkins: Apache Phoenix - Branch:master #96
Posted by Apache Jenkins Server <je...@builds.apache.org>.
See <https://builds.apache.org/job/Phoenix/96/changes>
Changes:
[jamestaylor] PHOENIX-99 Automatic white list based upgrade from 2.2 to 3.0 (JamesTaylor)
------------------------------------------
[...truncated 3109 lines...]
Tests run: 9, Failures: 0, Errors: 0, Skipped: 0, Time elapsed: 29.591 sec - in org.apache.phoenix.end2end.DistinctCountTest
Running org.apache.phoenix.end2end.FunkyNamesTest
Tests run: 3, Failures: 0, Errors: 0, Skipped: 0, Time elapsed: 30.957 sec - in org.apache.phoenix.end2end.FunkyNamesTest
Running org.apache.phoenix.end2end.SkipRangeParallelIteratorRegionSplitterTest
Tests run: 8, Failures: 0, Errors: 0, Skipped: 0, Time elapsed: 28.77 sec - in org.apache.phoenix.end2end.SkipRangeParallelIteratorRegionSplitterTest
Running org.apache.phoenix.end2end.RowValueConstructorTest
Tests run: 24, Failures: 0, Errors: 0, Skipped: 0, Time elapsed: 33.266 sec - in org.apache.phoenix.end2end.RowValueConstructorTest
Running org.apache.phoenix.end2end.StddevTest
Tests run: 4, Failures: 0, Errors: 0, Skipped: 0, Time elapsed: 28.27 sec - in org.apache.phoenix.end2end.StddevTest
Running org.apache.phoenix.end2end.TenantSpecificViewIndexSaltedTest
Tests run: 1, Failures: 0, Errors: 1, Skipped: 0, Time elapsed: 29.717 sec <<< FAILURE! - in org.apache.phoenix.end2end.TenantSpecificViewIndexSaltedTest
testUpdatableSaltedView(org.apache.phoenix.end2end.TenantSpecificViewIndexSaltedTest) Time elapsed: 20.271 sec <<< ERROR!
java.sql.SQLException: ERROR 2009 (INT11): Unknown error code 1
at org.apache.phoenix.exception.SQLExceptionCode$Factory$1.newException(SQLExceptionCode.java:308)
at org.apache.phoenix.exception.SQLExceptionInfo.buildException(SQLExceptionInfo.java:133)
at org.apache.phoenix.exception.SQLExceptionCode.fromErrorCode(SQLExceptionCode.java:336)
at org.apache.phoenix.schema.Sequence.createSequence(Sequence.java:373)
at org.apache.phoenix.query.ConnectionQueryServicesImpl.createSequence(ConnectionQueryServicesImpl.java:1394)
at org.apache.phoenix.query.DelegateConnectionQueryServices.createSequence(DelegateConnectionQueryServices.java:176)
at org.apache.phoenix.query.DelegateConnectionQueryServices.createSequence(DelegateConnectionQueryServices.java:176)
at org.apache.phoenix.schema.MetaDataClient.createSequence(MetaDataClient.java:698)
at org.apache.phoenix.schema.MetaDataClient.createIndex(MetaDataClient.java:629)
at org.apache.phoenix.compile.CreateIndexCompiler$1.execute(CreateIndexCompiler.java:76)
at org.apache.phoenix.jdbc.PhoenixStatement.executeMutation(PhoenixStatement.java:226)
at org.apache.phoenix.jdbc.PhoenixStatement.execute(PhoenixStatement.java:923)
at org.apache.phoenix.end2end.BaseTenantSpecificViewIndexTest.testUpdatableView(BaseTenantSpecificViewIndexTest.java:54)
at org.apache.phoenix.end2end.TenantSpecificViewIndexSaltedTest.testUpdatableSaltedView(TenantSpecificViewIndexSaltedTest.java:10)
Running org.apache.phoenix.end2end.TenantSpecificTablesDMLTest
Tests run: 12, Failures: 0, Errors: 0, Skipped: 0, Time elapsed: 30.801 sec - in org.apache.phoenix.end2end.TenantSpecificTablesDMLTest
Running org.apache.phoenix.end2end.DynamicColumnTest
Tests run: 5, Failures: 0, Errors: 0, Skipped: 0, Time elapsed: 29.367 sec - in org.apache.phoenix.end2end.DynamicColumnTest
Running org.apache.phoenix.end2end.ServerExceptionTest
Tests run: 1, Failures: 0, Errors: 0, Skipped: 0, Time elapsed: 29.194 sec - in org.apache.phoenix.end2end.ServerExceptionTest
Running org.apache.phoenix.end2end.AlterTableTest
Tests run: 13, Failures: 0, Errors: 0, Skipped: 0, Time elapsed: 55.035 sec - in org.apache.phoenix.end2end.AlterTableTest
Running org.apache.phoenix.end2end.DynamicUpsertTest
Tests run: 7, Failures: 0, Errors: 0, Skipped: 0, Time elapsed: 29.871 sec - in org.apache.phoenix.end2end.DynamicUpsertTest
Running org.apache.phoenix.end2end.CustomEntityDataTest
Tests run: 3, Failures: 0, Errors: 0, Skipped: 0, Time elapsed: 27.93 sec - in org.apache.phoenix.end2end.CustomEntityDataTest
Running org.apache.phoenix.end2end.SortOrderFTest
Tests run: 29, Failures: 0, Errors: 0, Skipped: 0, Time elapsed: 28.611 sec - in org.apache.phoenix.end2end.SortOrderFTest
Running org.apache.phoenix.end2end.GroupByCaseTest
Tests run: 3, Failures: 0, Errors: 0, Skipped: 0, Time elapsed: 28.984 sec - in org.apache.phoenix.end2end.GroupByCaseTest
Running org.apache.phoenix.end2end.UpsertSelectTest
Tests run: 11, Failures: 0, Errors: 1, Skipped: 0, Time elapsed: 38.869 sec <<< FAILURE! - in org.apache.phoenix.end2end.UpsertSelectTest
testUpsertSelectWithSequence(org.apache.phoenix.end2end.UpsertSelectTest) Time elapsed: 3.282 sec <<< ERROR!
java.sql.SQLException: ERROR 2009 (INT11): Unknown error code 100
at org.apache.phoenix.exception.SQLExceptionCode$Factory$1.newException(SQLExceptionCode.java:308)
at org.apache.phoenix.exception.SQLExceptionInfo.buildException(SQLExceptionInfo.java:133)
at org.apache.phoenix.exception.SQLExceptionCode.fromErrorCode(SQLExceptionCode.java:336)
at org.apache.phoenix.schema.Sequence.createSequence(Sequence.java:373)
at org.apache.phoenix.query.ConnectionQueryServicesImpl.createSequence(ConnectionQueryServicesImpl.java:1394)
at org.apache.phoenix.schema.MetaDataClient.createSequence(MetaDataClient.java:698)
at org.apache.phoenix.schema.MetaDataClient.createSequence(MetaDataClient.java:693)
at org.apache.phoenix.compile.CreateSequenceCompiler$1.execute(CreateSequenceCompiler.java:188)
at org.apache.phoenix.jdbc.PhoenixStatement.executeMutation(PhoenixStatement.java:226)
at org.apache.phoenix.jdbc.PhoenixStatement.execute(PhoenixStatement.java:923)
at org.apache.phoenix.end2end.UpsertSelectTest.testUpsertSelectWithSequence(UpsertSelectTest.java:695)
Running org.apache.phoenix.end2end.QueryTest
Tests run: 432, Failures: 0, Errors: 4, Skipped: 0, Time elapsed: 252.744 sec <<< FAILURE! - in org.apache.phoenix.end2end.QueryTest
testPointInTimeSequence[CREATE INDEX ATABLE_IDX ON aTable (a_integer DESC) INCLUDE ( A_STRING, B_STRING, A_DATE)](org.apache.phoenix.end2end.QueryTest) Time elapsed: 0.264 sec <<< ERROR!
java.sql.SQLException: ERROR 2009 (INT11): Unknown error code 3
at org.apache.phoenix.exception.SQLExceptionCode$Factory$1.newException(SQLExceptionCode.java:308)
at org.apache.phoenix.exception.SQLExceptionInfo.buildException(SQLExceptionInfo.java:133)
at org.apache.phoenix.exception.SQLExceptionCode.fromErrorCode(SQLExceptionCode.java:336)
at org.apache.phoenix.schema.Sequence.createSequence(Sequence.java:373)
at org.apache.phoenix.query.ConnectionQueryServicesImpl.createSequence(ConnectionQueryServicesImpl.java:1394)
at org.apache.phoenix.schema.MetaDataClient.createSequence(MetaDataClient.java:698)
at org.apache.phoenix.schema.MetaDataClient.createSequence(MetaDataClient.java:693)
at org.apache.phoenix.compile.CreateSequenceCompiler$1.execute(CreateSequenceCompiler.java:188)
at org.apache.phoenix.jdbc.PhoenixStatement.executeMutation(PhoenixStatement.java:226)
at org.apache.phoenix.jdbc.PhoenixStatement.execute(PhoenixStatement.java:923)
at org.apache.phoenix.end2end.QueryTest.testPointInTimeSequence(QueryTest.java:879)
testPointInTimeSequence[CREATE INDEX ATABLE_IDX ON aTable (a_integer, a_string) INCLUDE ( B_STRING, A_DATE)](org.apache.phoenix.end2end.QueryTest) Time elapsed: 0.294 sec <<< ERROR!
java.sql.SQLException: ERROR 2009 (INT11): Unknown error code 3
at org.apache.phoenix.exception.SQLExceptionCode$Factory$1.newException(SQLExceptionCode.java:308)
at org.apache.phoenix.exception.SQLExceptionInfo.buildException(SQLExceptionInfo.java:133)
at org.apache.phoenix.exception.SQLExceptionCode.fromErrorCode(SQLExceptionCode.java:336)
at org.apache.phoenix.schema.Sequence.createSequence(Sequence.java:373)
at org.apache.phoenix.query.ConnectionQueryServicesImpl.createSequence(ConnectionQueryServicesImpl.java:1394)
at org.apache.phoenix.schema.MetaDataClient.createSequence(MetaDataClient.java:698)
at org.apache.phoenix.schema.MetaDataClient.createSequence(MetaDataClient.java:693)
at org.apache.phoenix.compile.CreateSequenceCompiler$1.execute(CreateSequenceCompiler.java:188)
at org.apache.phoenix.jdbc.PhoenixStatement.executeMutation(PhoenixStatement.java:226)
at org.apache.phoenix.jdbc.PhoenixStatement.execute(PhoenixStatement.java:923)
at org.apache.phoenix.end2end.QueryTest.testPointInTimeSequence(QueryTest.java:879)
testPointInTimeSequence[CREATE INDEX ATABLE_IDX ON aTable (a_integer) INCLUDE ( A_STRING, B_STRING, A_DATE)](org.apache.phoenix.end2end.QueryTest) Time elapsed: 0.397 sec <<< ERROR!
java.sql.SQLException: ERROR 2009 (INT11): Unknown error code 3
at org.apache.phoenix.exception.SQLExceptionCode$Factory$1.newException(SQLExceptionCode.java:308)
at org.apache.phoenix.exception.SQLExceptionInfo.buildException(SQLExceptionInfo.java:133)
at org.apache.phoenix.exception.SQLExceptionCode.fromErrorCode(SQLExceptionCode.java:336)
at org.apache.phoenix.schema.Sequence.createSequence(Sequence.java:373)
at org.apache.phoenix.query.ConnectionQueryServicesImpl.createSequence(ConnectionQueryServicesImpl.java:1394)
at org.apache.phoenix.schema.MetaDataClient.createSequence(MetaDataClient.java:698)
at org.apache.phoenix.schema.MetaDataClient.createSequence(MetaDataClient.java:693)
at org.apache.phoenix.compile.CreateSequenceCompiler$1.execute(CreateSequenceCompiler.java:188)
at org.apache.phoenix.jdbc.PhoenixStatement.executeMutation(PhoenixStatement.java:226)
at org.apache.phoenix.jdbc.PhoenixStatement.execute(PhoenixStatement.java:923)
at org.apache.phoenix.end2end.QueryTest.testPointInTimeSequence(QueryTest.java:879)
testPointInTimeSequence[](org.apache.phoenix.end2end.QueryTest) Time elapsed: 0.363 sec <<< ERROR!
java.sql.SQLException: ERROR 2009 (INT11): Unknown error code 3
at org.apache.phoenix.exception.SQLExceptionCode$Factory$1.newException(SQLExceptionCode.java:308)
at org.apache.phoenix.exception.SQLExceptionInfo.buildException(SQLExceptionInfo.java:133)
at org.apache.phoenix.exception.SQLExceptionCode.fromErrorCode(SQLExceptionCode.java:336)
at org.apache.phoenix.schema.Sequence.createSequence(Sequence.java:373)
at org.apache.phoenix.query.ConnectionQueryServicesImpl.createSequence(ConnectionQueryServicesImpl.java:1394)
at org.apache.phoenix.schema.MetaDataClient.createSequence(MetaDataClient.java:698)
at org.apache.phoenix.schema.MetaDataClient.createSequence(MetaDataClient.java:693)
at org.apache.phoenix.compile.CreateSequenceCompiler$1.execute(CreateSequenceCompiler.java:188)
at org.apache.phoenix.jdbc.PhoenixStatement.executeMutation(PhoenixStatement.java:226)
at org.apache.phoenix.jdbc.PhoenixStatement.execute(PhoenixStatement.java:923)
at org.apache.phoenix.end2end.QueryTest.testPointInTimeSequence(QueryTest.java:879)
Running org.apache.phoenix.end2end.SkipScanQueryTest
Tests run: 7, Failures: 0, Errors: 0, Skipped: 0, Time elapsed: 30.226 sec - in org.apache.phoenix.end2end.SkipScanQueryTest
Running org.apache.phoenix.end2end.TopNTest
Tests run: 4, Failures: 0, Errors: 0, Skipped: 0, Time elapsed: 28.041 sec - in org.apache.phoenix.end2end.TopNTest
Running org.apache.phoenix.end2end.IsNullTest
Tests run: 1, Failures: 0, Errors: 0, Skipped: 0, Time elapsed: 21.044 sec - in org.apache.phoenix.end2end.IsNullTest
Running org.apache.phoenix.end2end.ArrayTest
Tests run: 29, Failures: 0, Errors: 0, Skipped: 0, Time elapsed: 39.456 sec - in org.apache.phoenix.end2end.ArrayTest
Results :
Failed tests:
SequenceTest.testSequenceNotFound:93 Sequence not found
Tests in error:
SequenceTest.testSelectNextValueForMultipleConn:371 ? SQL ERROR 2009 (INT11): ...
SequenceTest.testSelectNextValueForMultipleConnWithStmtClose:409 ? SQL ERROR 2...
SequenceTest.testExplainPlanValidatesSequences:559 ? SQL ERROR 2009 (INT11): U...
SequenceTest.testSequenceCreation:203 ? SQL ERROR 2009 (INT11): Unknown error ...
SequenceTest.testDropSequence:139 ? SQL ERROR 2009 (INT11): Unknown error code...
SequenceTest.testDuplicateSequences:76 ? SQL ERROR 2009 (INT11): Unknown error...
SequenceTest.testSelectNextValueForOverMultipleBatches:300 ? SQL ERROR 2009 (I...
SequenceTest.testInsertNextValueFor:185 ? SQL ERROR 2009 (INT11): Unknown erro...
SequenceTest.testSelectRowAndSequence:283 ? SQL ERROR 2009 (INT11): Unknown er...
SequenceTest.testCompilerOptimization:271 ? SQL ERROR 2009 (INT11): Unknown er...
SequenceTest.testMultipleSequenceValues:242 ? SQL ERROR 2009 (INT11): Unknown ...
SequenceTest.testDropCachedSeq1:483->testDropCachedSeq:493 ? SQL ERROR 2009 (I...
SequenceTest.testDropCachedSeq2:488->testDropCachedSeq:493 ? SQL ERROR 2009 (I...
SequenceTest.testCurrentValueFor:118 ? SQL ERROR 2009 (INT11): Unknown error c...
SequenceTest.testSameMultipleSequenceValues:228 ? SQL ERROR 2009 (INT11): Unkn...
SequenceTest.testSelectNextValueFor:166 ? SQL ERROR 2009 (INT11): Unknown erro...
SequenceTest.testCreateSequence:102 ? SQL ERROR 2009 (INT11): Unknown error co...
SequenceTest.testSelectNextValueForMultipleConnWithConnClose:447 ? SQL ERROR 2...
SequenceTest.testSelectNextValueForGroupBy:319 ? SQL ERROR 2009 (INT11): Unkno...
ViewTest.testNonSaltedUpdatableViewWithIndex:96->BaseViewTest.testUpdatableViewWithIndex:50->BaseViewTest.testUpdatableViewIndex:102 ? SQL
ViewTest>BaseHBaseManagedTimeTest.doTestSetup:39->BaseConnectedQueryTest.deletePriorTables:134->BaseConnectedQueryTest.deletePriorTables:146->BaseConnectedQueryTest.deletePriorSequences:193 ? PhoenixParser
ViewTest>BaseHBaseManagedTimeTest.doTestSetup:39->BaseConnectedQueryTest.deletePriorTables:134->BaseConnectedQueryTest.deletePriorTables:146->BaseConnectedQueryTest.deletePriorSequences:193 ? PhoenixParser
ViewTest>BaseHBaseManagedTimeTest.doTestSetup:39->BaseConnectedQueryTest.deletePriorTables:134->BaseConnectedQueryTest.deletePriorTables:146->BaseConnectedQueryTest.deletePriorSequences:193 ? PhoenixParser
TenantSpecificViewIndexTest.testUpdatableView:25->BaseTenantSpecificViewIndexTest.testUpdatableView:54 ? SQL
SaltedViewTest.testSaltedUpdatableViewWithIndex:33->BaseViewTest.testUpdatableViewWithIndex:50->BaseViewTest.testUpdatableViewIndex:102 ? SQL
HashJoinTest.initTable:91->initTableValues:478 ? SQL ERROR 2009 (INT11): Unkno...
HashJoinTest>BaseHBaseManagedTimeTest.doTestSetup:39->BaseConnectedQueryTest.deletePriorTables:134->BaseConnectedQueryTest.deletePriorTables:146->BaseConnectedQueryTest.deletePriorSequences:193 ? ArrayIndexOutOfBounds
HashJoinTest>BaseHBaseManagedTimeTest.doTestSetup:39->BaseConnectedQueryTest.deletePriorTables:134->BaseConnectedQueryTest.deletePriorTables:146->BaseConnectedQueryTest.deletePriorSequences:193 ? ArrayIndexOutOfBounds
HashJoinTest>BaseHBaseManagedTimeTest.doTestSetup:39->BaseConnectedQueryTest.deletePriorTables:134->BaseConnectedQueryTest.deletePriorTables:146->BaseConnectedQueryTest.deletePriorSequences:193 ? ArrayIndexOutOfBounds
HashJoinTest>BaseHBaseManagedTimeTest.doTestSetup:39->BaseConnectedQueryTest.deletePriorTables:134->BaseConnectedQueryTest.deletePriorTables:146->BaseConnectedQueryTest.deletePriorSequences:193 ? ArrayIndexOutOfBounds
HashJoinTest>BaseHBaseManagedTimeTest.doTestSetup:39->BaseConnectedQueryTest.deletePriorTables:134->BaseConnectedQueryTest.deletePriorTables:146->BaseConnectedQueryTest.deletePriorSequences:193 ? ArrayIndexOutOfBounds
HashJoinTest>BaseHBaseManagedTimeTest.doTestSetup:39->BaseConnectedQueryTest.deletePriorTables:134->BaseConnectedQueryTest.deletePriorTables:146->BaseConnectedQueryTest.deletePriorSequences:193 ? ArrayIndexOutOfBounds
HashJoinTest>BaseHBaseManagedTimeTest.doTestSetup:39->BaseConnectedQueryTest.deletePriorTables:134->BaseConnectedQueryTest.deletePriorTables:146->BaseConnectedQueryTest.deletePriorSequences:193 ? ArrayIndexOutOfBounds
HashJoinTest>BaseHBaseManagedTimeTest.doTestSetup:39->BaseConnectedQueryTest.deletePriorTables:134->BaseConnectedQueryTest.deletePriorTables:146->BaseConnectedQueryTest.deletePriorSequences:193 ? ArrayIndexOutOfBounds
HashJoinTest>BaseHBaseManagedTimeTest.doTestSetup:39->BaseConnectedQueryTest.deletePriorTables:134->BaseConnectedQueryTest.deletePriorTables:146->BaseConnectedQueryTest.deletePriorSequences:193 ? ArrayIndexOutOfBounds
HashJoinTest>BaseHBaseManagedTimeTest.doTestSetup:39->BaseConnectedQueryTest.deletePriorTables:134->BaseConnectedQueryTest.deletePriorTables:146->BaseConnectedQueryTest.deletePriorSequences:193 ? ArrayIndexOutOfBounds
HashJoinTest>BaseHBaseManagedTimeTest.doTestSetup:39->BaseConnectedQueryTest.deletePriorTables:134->BaseConnectedQueryTest.deletePriorTables:146->BaseConnectedQueryTest.deletePriorSequences:193 ? ArrayIndexOutOfBounds
HashJoinTest>BaseHBaseManagedTimeTest.doTestSetup:39->BaseConnectedQueryTest.deletePriorTables:134->BaseConnectedQueryTest.deletePriorTables:146->BaseConnectedQueryTest.deletePriorSequences:193 ? ArrayIndexOutOfBounds
HashJoinTest>BaseHBaseManagedTimeTest.doTestSetup:39->BaseConnectedQueryTest.deletePriorTables:134->BaseConnectedQueryTest.deletePriorTables:146->BaseConnectedQueryTest.deletePriorSequences:193 ? ArrayIndexOutOfBounds
HashJoinTest>BaseHBaseManagedTimeTest.doTestSetup:39->BaseConnectedQueryTest.deletePriorTables:134->BaseConnectedQueryTest.deletePriorTables:146->BaseConnectedQueryTest.deletePriorSequences:193 ? ArrayIndexOutOfBounds
HashJoinTest>BaseHBaseManagedTimeTest.doTestSetup:39->BaseConnectedQueryTest.deletePriorTables:134->BaseConnectedQueryTest.deletePriorTables:146->BaseConnectedQueryTest.deletePriorSequences:193 ? ArrayIndexOutOfBounds
HashJoinTest>BaseHBaseManagedTimeTest.doTestSetup:39->BaseConnectedQueryTest.deletePriorTables:134->BaseConnectedQueryTest.deletePriorTables:146->BaseConnectedQueryTest.deletePriorSequences:193 ? ArrayIndexOutOfBounds
HashJoinTest>BaseHBaseManagedTimeTest.doTestSetup:39->BaseConnectedQueryTest.deletePriorTables:134->BaseConnectedQueryTest.deletePriorTables:146->BaseConnectedQueryTest.deletePriorSequences:193 ? ArrayIndexOutOfBounds
HashJoinTest>BaseHBaseManagedTimeTest.doTestSetup:39->BaseConnectedQueryTest.deletePriorTables:134->BaseConnectedQueryTest.deletePriorTables:146->BaseConnectedQueryTest.deletePriorSequences:193 ? ArrayIndexOutOfBounds
HashJoinTest>BaseHBaseManagedTimeTest.doTestSetup:39->BaseConnectedQueryTest.deletePriorTables:134->BaseConnectedQueryTest.deletePriorTables:146->BaseConnectedQueryTest.deletePriorSequences:193 ? ArrayIndexOutOfBounds
HashJoinTest>BaseHBaseManagedTimeTest.doTestSetup:39->BaseConnectedQueryTest.deletePriorTables:134->BaseConnectedQueryTest.deletePriorTables:146->BaseConnectedQueryTest.deletePriorSequences:193 ? ArrayIndexOutOfBounds
HashJoinTest>BaseHBaseManagedTimeTest.doTestSetup:39->BaseConnectedQueryTest.deletePriorTables:134->BaseConnectedQueryTest.deletePriorTables:146->BaseConnectedQueryTest.deletePriorSequences:193 ? ArrayIndexOutOfBounds
HashJoinTest>BaseHBaseManagedTimeTest.doTestSetup:39->BaseConnectedQueryTest.deletePriorTables:134->BaseConnectedQueryTest.deletePriorTables:146->BaseConnectedQueryTest.deletePriorSequences:193 ? ArrayIndexOutOfBounds
HashJoinTest>BaseHBaseManagedTimeTest.doTestSetup:39->BaseConnectedQueryTest.deletePriorTables:134->BaseConnectedQueryTest.deletePriorTables:146->BaseConnectedQueryTest.deletePriorSequences:193 ? ArrayIndexOutOfBounds
HashJoinTest>BaseHBaseManagedTimeTest.doTestSetup:39->BaseConnectedQueryTest.deletePriorTables:134->BaseConnectedQueryTest.deletePriorTables:146->BaseConnectedQueryTest.deletePriorSequences:193 ? ArrayIndexOutOfBounds
HashJoinTest>BaseHBaseManagedTimeTest.doTestSetup:39->BaseConnectedQueryTest.deletePriorTables:134->BaseConnectedQueryTest.deletePriorTables:146->BaseConnectedQueryTest.deletePriorSequences:193 ? ArrayIndexOutOfBounds
HashJoinTest>BaseHBaseManagedTimeTest.doTestSetup:39->BaseConnectedQueryTest.deletePriorTables:134->BaseConnectedQueryTest.deletePriorTables:146->BaseConnectedQueryTest.deletePriorSequences:193 ? ArrayIndexOutOfBounds
HashJoinTest>BaseHBaseManagedTimeTest.doTestSetup:39->BaseConnectedQueryTest.deletePriorTables:134->BaseConnectedQueryTest.deletePriorTables:146->BaseConnectedQueryTest.deletePriorSequences:193 ? ArrayIndexOutOfBounds
HashJoinTest>BaseHBaseManagedTimeTest.doTestSetup:39->BaseConnectedQueryTest.deletePriorTables:134->BaseConnectedQueryTest.deletePriorTables:146->BaseConnectedQueryTest.deletePriorSequences:193 ? ArrayIndexOutOfBounds
HashJoinTest>BaseHBaseManagedTimeTest.doTestSetup:39->BaseConnectedQueryTest.deletePriorTables:134->BaseConnectedQueryTest.deletePriorTables:146->BaseConnectedQueryTest.deletePriorSequences:193 ? ArrayIndexOutOfBounds
HashJoinTest>BaseHBaseManagedTimeTest.doTestSetup:39->BaseConnectedQueryTest.deletePriorTables:134->BaseConnectedQueryTest.deletePriorTables:146->BaseConnectedQueryTest.deletePriorSequences:193 ? ArrayIndexOutOfBounds
HashJoinTest>BaseHBaseManagedTimeTest.doTestSetup:39->BaseConnectedQueryTest.deletePriorTables:134->BaseConnectedQueryTest.deletePriorTables:146->BaseConnectedQueryTest.deletePriorSequences:193 ? ArrayIndexOutOfBounds
HashJoinTest>BaseHBaseManagedTimeTest.doTestSetup:39->BaseConnectedQueryTest.deletePriorTables:134->BaseConnectedQueryTest.deletePriorTables:146->BaseConnectedQueryTest.deletePriorSequences:193 ? ArrayIndexOutOfBounds
HashJoinTest>BaseHBaseManagedTimeTest.doTestSetup:39->BaseConnectedQueryTest.deletePriorTables:134->BaseConnectedQueryTest.deletePriorTables:146->BaseConnectedQueryTest.deletePriorSequences:193 ? ArrayIndexOutOfBounds
HashJoinTest>BaseHBaseManagedTimeTest.doTestSetup:39->BaseConnectedQueryTest.deletePriorTables:134->BaseConnectedQueryTest.deletePriorTables:146->BaseConnectedQueryTest.deletePriorSequences:193 ? ArrayIndexOutOfBounds
HashJoinTest>BaseHBaseManagedTimeTest.doTestSetup:39->BaseConnectedQueryTest.deletePriorTables:134->BaseConnectedQueryTest.deletePriorTables:146->BaseConnectedQueryTest.deletePriorSequences:193 ? ArrayIndexOutOfBounds
HashJoinTest>BaseHBaseManagedTimeTest.doTestSetup:39->BaseConnectedQueryTest.deletePriorTables:134->BaseConnectedQueryTest.deletePriorTables:146->BaseConnectedQueryTest.deletePriorSequences:193 ? ArrayIndexOutOfBounds
HashJoinTest>BaseHBaseManagedTimeTest.doTestSetup:39->BaseConnectedQueryTest.deletePriorTables:134->BaseConnectedQueryTest.deletePriorTables:146->BaseConnectedQueryTest.deletePriorSequences:193 ? ArrayIndexOutOfBounds
HashJoinTest>BaseHBaseManagedTimeTest.doTestSetup:39->BaseConnectedQueryTest.deletePriorTables:134->BaseConnectedQueryTest.deletePriorTables:146->BaseConnectedQueryTest.deletePriorSequences:193 ? ArrayIndexOutOfBounds
HashJoinTest>BaseHBaseManagedTimeTest.doTestSetup:39->BaseConnectedQueryTest.deletePriorTables:134->BaseConnectedQueryTest.deletePriorTables:146->BaseConnectedQueryTest.deletePriorSequences:193 ? ArrayIndexOutOfBounds
HashJoinTest>BaseHBaseManagedTimeTest.doTestSetup:39->BaseConnectedQueryTest.deletePriorTables:134->BaseConnectedQueryTest.deletePriorTables:146->BaseConnectedQueryTest.deletePriorSequences:193 ? ArrayIndexOutOfBounds
HashJoinTest>BaseHBaseManagedTimeTest.doTestSetup:39->BaseConnectedQueryTest.deletePriorTables:134->BaseConnectedQueryTest.deletePriorTables:146->BaseConnectedQueryTest.deletePriorSequences:193 ? ArrayIndexOutOfBounds
HashJoinTest>BaseHBaseManagedTimeTest.doTestSetup:39->BaseConnectedQueryTest.deletePriorTables:134->BaseConnectedQueryTest.deletePriorTables:146->BaseConnectedQueryTest.deletePriorSequences:193 ? ArrayIndexOutOfBounds
HashJoinTest>BaseHBaseManagedTimeTest.doTestSetup:39->BaseConnectedQueryTest.deletePriorTables:134->BaseConnectedQueryTest.deletePriorTables:146->BaseConnectedQueryTest.deletePriorSequences:193 ? ArrayIndexOutOfBounds
HashJoinTest>BaseHBaseManagedTimeTest.doTestSetup:39->BaseConnectedQueryTest.deletePriorTables:134->BaseConnectedQueryTest.deletePriorTables:146->BaseConnectedQueryTest.deletePriorSequences:193 ? ArrayIndexOutOfBounds
HashJoinTest>BaseHBaseManagedTimeTest.doTestSetup:39->BaseConnectedQueryTest.deletePriorTables:134->BaseConnectedQueryTest.deletePriorTables:146->BaseConnectedQueryTest.deletePriorSequences:193 ? ArrayIndexOutOfBounds
HashJoinTest>BaseHBaseManagedTimeTest.doTestSetup:39->BaseConnectedQueryTest.deletePriorTables:134->BaseConnectedQueryTest.deletePriorTables:146->BaseConnectedQueryTest.deletePriorSequences:193 ? ArrayIndexOutOfBounds
HashJoinTest>BaseHBaseManagedTimeTest.doTestSetup:39->BaseConnectedQueryTest.deletePriorTables:134->BaseConnectedQueryTest.deletePriorTables:146->BaseConnectedQueryTest.deletePriorSequences:193 ? ArrayIndexOutOfBounds
TenantSpecificViewIndexSaltedTest.testUpdatableSaltedView:10->BaseTenantSpecificViewIndexTest.testUpdatableView:54 ? SQL
UpsertSelectTest.testUpsertSelectWithSequence:695 ? SQL ERROR 2009 (INT11): Un...
QueryTest.testPointInTimeSequence:879 ? SQL ERROR 2009 (INT11): Unknown error ...
QueryTest.testPointInTimeSequence:879 ? SQL ERROR 2009 (INT11): Unknown error ...
QueryTest.testPointInTimeSequence:879 ? SQL ERROR 2009 (INT11): Unknown error ...
QueryTest.testPointInTimeSequence:879 ? SQL ERROR 2009 (INT11): Unknown error ...
Tests run: 1739, Failures: 1, Errors: 79, Skipped: 8
[INFO] ------------------------------------------------------------------------
[INFO] Reactor Summary:
[INFO]
[INFO] Apache Phoenix .................................... SUCCESS [4.716s]
[INFO] Phoenix Hadoop Compatibility ...................... SUCCESS [2.115s]
[INFO] Phoenix Core ...................................... FAILURE [48:17.196s]
[INFO] Phoenix - Flume ................................... SKIPPED
[INFO] Phoenix - Pig ..................................... SKIPPED
[INFO] Phoenix Hadoop1 Compatibility ..................... SKIPPED
[INFO] Phoenix Assebmly .................................. SKIPPED
[INFO] ------------------------------------------------------------------------
[INFO] BUILD FAILURE
[INFO] ------------------------------------------------------------------------
[INFO] Total time: 48:24.592s
[INFO] Finished at: Mon Mar 03 11:24:09 UTC 2014
[INFO] Final Memory: 25M/220M
[INFO] ------------------------------------------------------------------------
[ERROR] Failed to execute goal org.apache.maven.plugins:maven-surefire-plugin:2.16:test (default-test) on project phoenix-core: There are test failures.
[ERROR]
[ERROR] Please refer to /home/hudson/jenkins-slave/workspace/Phoenix/phoenix-core/target/surefire-reports for the individual test results.
[ERROR] -> [Help 1]
[ERROR]
[ERROR] To see the full stack trace of the errors, re-run Maven with the -e switch.
[ERROR] Re-run Maven using the -X switch to enable full debug logging.
[ERROR]
[ERROR] For more information about the errors and possible solutions, please read the following articles:
[ERROR] [Help 1] http://cwiki.apache.org/confluence/display/MAVEN/MojoFailureException
[ERROR]
[ERROR] After correcting the problems, you can resume the build with the command
[ERROR] mvn <goals> -rf :phoenix-core
Build step 'Invoke top-level Maven targets' marked build as failure
Archiving artifacts
Updating PHOENIX-99
Recording test results
Build failed in Jenkins: Apache Phoenix - Branch:master #95
Posted by Apache Jenkins Server <je...@builds.apache.org>.
See <https://builds.apache.org/job/Phoenix/95/changes>
Changes:
[jamestaylor] PHOENIX-98 Fix flume unit tests based on metadata api changes (JamesTaylor)
[jamestaylor] PHOENIX-100 Relax compatibility check to only check that the major version matches between the client and server jars (JamesTaylor)
------------------------------------------
[...truncated 207 lines...]
Tests run: 3, Failures: 0, Errors: 0, Skipped: 1, Time elapsed: 26.53 sec - in org.apache.phoenix.end2end.OrderByTest
Running org.apache.phoenix.end2end.ArithmeticQueryTest
Tests run: 8, Failures: 0, Errors: 0, Skipped: 0, Time elapsed: 24.999 sec - in org.apache.phoenix.end2end.ArithmeticQueryTest
Running org.apache.phoenix.end2end.ReadIsolationLevelTest
Tests run: 2, Failures: 0, Errors: 0, Skipped: 0, Time elapsed: 17.283 sec - in org.apache.phoenix.end2end.ReadIsolationLevelTest
Running org.apache.phoenix.end2end.ColumnProjectionOptimizationTest
Tests run: 2, Failures: 0, Errors: 0, Skipped: 0, Time elapsed: 26.054 sec - in org.apache.phoenix.end2end.ColumnProjectionOptimizationTest
Running org.apache.phoenix.end2end.AutoCommitTest
Tests run: 1, Failures: 0, Errors: 0, Skipped: 0, Time elapsed: 16.654 sec - in org.apache.phoenix.end2end.AutoCommitTest
Running org.apache.phoenix.end2end.ReverseFunctionTest
Tests run: 5, Failures: 0, Errors: 0, Skipped: 0, Time elapsed: 25.465 sec - in org.apache.phoenix.end2end.ReverseFunctionTest
Running org.apache.phoenix.end2end.QueryTest
Tests run: 432, Failures: 0, Errors: 0, Skipped: 0, Time elapsed: 327.45 sec - in org.apache.phoenix.end2end.QueryTest
Running org.apache.phoenix.end2end.ViewTest
Tests run: 6, Failures: 0, Errors: 0, Skipped: 0, Time elapsed: 27.519 sec - in org.apache.phoenix.end2end.ViewTest
Running org.apache.phoenix.end2end.AlterTableTest
Tests run: 13, Failures: 0, Errors: 0, Skipped: 0, Time elapsed: 57.439 sec - in org.apache.phoenix.end2end.AlterTableTest
Running org.apache.phoenix.end2end.UpsertValuesTest
Tests run: 10, Failures: 0, Errors: 0, Skipped: 0, Time elapsed: 27.863 sec - in org.apache.phoenix.end2end.UpsertValuesTest
Running org.apache.phoenix.end2end.ServerExceptionTest
Tests run: 1, Failures: 0, Errors: 0, Skipped: 0, Time elapsed: 25.513 sec - in org.apache.phoenix.end2end.ServerExceptionTest
Running org.apache.phoenix.end2end.QueryPlanTest
Tests run: 1, Failures: 0, Errors: 0, Skipped: 0, Time elapsed: 25.517 sec - in org.apache.phoenix.end2end.QueryPlanTest
Running org.apache.phoenix.end2end.PercentileTest
Tests run: 17, Failures: 0, Errors: 0, Skipped: 0, Time elapsed: 25.54 sec - in org.apache.phoenix.end2end.PercentileTest
Running org.apache.phoenix.end2end.SequenceTest
Tests run: 21, Failures: 0, Errors: 0, Skipped: 0, Time elapsed: 27.635 sec - in org.apache.phoenix.end2end.SequenceTest
Running org.apache.phoenix.end2end.QueryExecWithoutSCNTest
Tests run: 1, Failures: 0, Errors: 0, Skipped: 0, Time elapsed: 17.996 sec - in org.apache.phoenix.end2end.QueryExecWithoutSCNTest
Running org.apache.phoenix.end2end.HashJoinTest
Tests run: 48, Failures: 0, Errors: 0, Skipped: 0, Time elapsed: 66.067 sec - in org.apache.phoenix.end2end.HashJoinTest
Running org.apache.phoenix.end2end.MD5FunctionTest
Tests run: 2, Failures: 0, Errors: 0, Skipped: 0, Time elapsed: 29.479 sec - in org.apache.phoenix.end2end.MD5FunctionTest
Running org.apache.phoenix.end2end.StatementHintsTest
Tests run: 2, Failures: 0, Errors: 0, Skipped: 0, Time elapsed: 18.983 sec - in org.apache.phoenix.end2end.StatementHintsTest
Running org.apache.phoenix.end2end.StddevTest
Tests run: 4, Failures: 0, Errors: 0, Skipped: 0, Time elapsed: 26.819 sec - in org.apache.phoenix.end2end.StddevTest
Running org.apache.phoenix.end2end.DistinctCountTest
Tests run: 9, Failures: 0, Errors: 0, Skipped: 0, Time elapsed: 26.637 sec - in org.apache.phoenix.end2end.DistinctCountTest
Running org.apache.phoenix.end2end.UpsertSelectAutoCommitTest
Tests run: 1, Failures: 0, Errors: 0, Skipped: 0, Time elapsed: 26.773 sec - in org.apache.phoenix.end2end.UpsertSelectAutoCommitTest
Running org.apache.phoenix.end2end.FunkyNamesTest
Tests run: 3, Failures: 0, Errors: 0, Skipped: 0, Time elapsed: 18.306 sec - in org.apache.phoenix.end2end.FunkyNamesTest
Running org.apache.phoenix.end2end.KeyOnlyTest
Tests run: 2, Failures: 0, Errors: 0, Skipped: 0, Time elapsed: 18.364 sec - in org.apache.phoenix.end2end.KeyOnlyTest
Running org.apache.phoenix.end2end.CustomEntityDataTest
Tests run: 3, Failures: 0, Errors: 0, Skipped: 0, Time elapsed: 21.005 sec - in org.apache.phoenix.end2end.CustomEntityDataTest
Running org.apache.phoenix.end2end.QueryDatabaseMetaDataTest
Tests run: 15, Failures: 0, Errors: 0, Skipped: 0, Time elapsed: 55.025 sec - in org.apache.phoenix.end2end.QueryDatabaseMetaDataTest
Running org.apache.phoenix.end2end.ArrayTest
Tests run: 29, Failures: 0, Errors: 0, Skipped: 0, Time elapsed: 36.941 sec - in org.apache.phoenix.end2end.ArrayTest
Running org.apache.phoenix.end2end.TenantSpecificTablesDMLTest
Tests run: 12, Failures: 0, Errors: 0, Skipped: 0, Time elapsed: 27.953 sec - in org.apache.phoenix.end2end.TenantSpecificTablesDMLTest
Running org.apache.phoenix.end2end.SkipRangeParallelIteratorRegionSplitterTest
Tests run: 8, Failures: 0, Errors: 0, Skipped: 0, Time elapsed: 26.683 sec - in org.apache.phoenix.end2end.SkipRangeParallelIteratorRegionSplitterTest
Running org.apache.phoenix.end2end.CompareDecimalToLongTest
Tests run: 8, Failures: 0, Errors: 0, Skipped: 0, Time elapsed: 19.712 sec - in org.apache.phoenix.end2end.CompareDecimalToLongTest
Running org.apache.phoenix.end2end.SpooledOrderByTest
Tests run: 3, Failures: 0, Errors: 0, Skipped: 1, Time elapsed: 27.036 sec - in org.apache.phoenix.end2end.SpooledOrderByTest
Running org.apache.phoenix.end2end.TenantSpecificViewIndexSaltedTest
Tests run: 1, Failures: 0, Errors: 0, Skipped: 0, Time elapsed: 26.473 sec - in org.apache.phoenix.end2end.TenantSpecificViewIndexSaltedTest
Running org.apache.phoenix.end2end.ExecuteStatementsTest
Tests run: 2, Failures: 0, Errors: 0, Skipped: 0, Time elapsed: 25.782 sec - in org.apache.phoenix.end2end.ExecuteStatementsTest
Running org.apache.phoenix.end2end.DynamicUpsertTest
Tests run: 7, Failures: 0, Errors: 0, Skipped: 0, Time elapsed: 26.809 sec - in org.apache.phoenix.end2end.DynamicUpsertTest
Running org.apache.phoenix.end2end.SortOrderFTest
Tests run: 29, Failures: 0, Errors: 0, Skipped: 0, Time elapsed: 26.064 sec - in org.apache.phoenix.end2end.SortOrderFTest
Running org.apache.phoenix.end2end.salted.SaltedTableVarLengthRowKeyTest
Tests run: 1, Failures: 0, Errors: 0, Skipped: 0, Time elapsed: 18.729 sec - in org.apache.phoenix.end2end.salted.SaltedTableVarLengthRowKeyTest
Running org.apache.phoenix.end2end.salted.SaltedTableTest
Tests run: 8, Failures: 0, Errors: 0, Skipped: 0, Time elapsed: 24.61 sec - in org.apache.phoenix.end2end.salted.SaltedTableTest
Running org.apache.phoenix.end2end.salted.SaltedTableUpsertSelectTest
Tests run: 5, Failures: 0, Errors: 0, Skipped: 0, Time elapsed: 26.144 sec - in org.apache.phoenix.end2end.salted.SaltedTableUpsertSelectTest
Running org.apache.phoenix.end2end.DynamicColumnTest
Tests run: 5, Failures: 0, Errors: 0, Skipped: 0, Time elapsed: 18.702 sec - in org.apache.phoenix.end2end.DynamicColumnTest
Running org.apache.phoenix.end2end.TenantSpecificViewIndexTest
Tests run: 1, Failures: 0, Errors: 0, Skipped: 0, Time elapsed: 18.146 sec - in org.apache.phoenix.end2end.TenantSpecificViewIndexTest
Running org.apache.phoenix.end2end.BinaryRowKeyTest
Tests run: 3, Failures: 0, Errors: 0, Skipped: 0, Time elapsed: 25.192 sec - in org.apache.phoenix.end2end.BinaryRowKeyTest
Running org.apache.phoenix.end2end.DynamicFamilyTest
Tests run: 4, Failures: 0, Errors: 0, Skipped: 0, Time elapsed: 26.445 sec - in org.apache.phoenix.end2end.DynamicFamilyTest
Running org.apache.phoenix.end2end.DefaultParallelIteratorsRegionSplitterTest
Tests run: 3, Failures: 1, Errors: 0, Skipped: 0, Time elapsed: 27.431 sec <<< FAILURE! - in org.apache.phoenix.end2end.DefaultParallelIteratorsRegionSplitterTest
testStatsManagerImpl(org.apache.phoenix.end2end.DefaultParallelIteratorsRegionSplitterTest) Time elapsed: 0.679 sec <<< FAILURE!
java.lang.AssertionError: null
at org.junit.Assert.fail(Assert.java:86)
at org.junit.Assert.assertTrue(Assert.java:41)
at org.junit.Assert.assertTrue(Assert.java:52)
at org.apache.phoenix.end2end.DefaultParallelIteratorsRegionSplitterTest.testStatsManagerImpl(DefaultParallelIteratorsRegionSplitterTest.java:292)
Running org.apache.phoenix.end2end.CSVLoaderTest
Tests run: 10, Failures: 0, Errors: 0, Skipped: 0, Time elapsed: 25.954 sec - in org.apache.phoenix.end2end.CSVLoaderTest
Running org.apache.phoenix.end2end.TenantSpecificTablesDDLTest
Tests run: 16, Failures: 0, Errors: 0, Skipped: 0, Time elapsed: 36.558 sec - in org.apache.phoenix.end2end.TenantSpecificTablesDDLTest
Running org.apache.phoenix.end2end.CoalesceFunctionTest
Tests run: 1, Failures: 0, Errors: 0, Skipped: 0, Time elapsed: 18.519 sec - in org.apache.phoenix.end2end.CoalesceFunctionTest
Running org.apache.phoenix.end2end.MultiCfQueryExecTest
Tests run: 7, Failures: 0, Errors: 0, Skipped: 0, Time elapsed: 24.607 sec - in org.apache.phoenix.end2end.MultiCfQueryExecTest
Running org.apache.phoenix.end2end.UpsertBigValuesTest
Tests run: 4, Failures: 0, Errors: 0, Skipped: 0, Time elapsed: 26.274 sec - in org.apache.phoenix.end2end.UpsertBigValuesTest
Running org.apache.phoenix.end2end.GroupByCaseTest
Tests run: 3, Failures: 0, Errors: 0, Skipped: 0, Time elapsed: 17.754 sec - in org.apache.phoenix.end2end.GroupByCaseTest
Running org.apache.phoenix.end2end.ProductMetricsTest
Tests run: 61, Failures: 0, Errors: 0, Skipped: 0, Time elapsed: 44.901 sec - in org.apache.phoenix.end2end.ProductMetricsTest
Running org.apache.phoenix.end2end.UpsertSelectTest
Tests run: 11, Failures: 0, Errors: 0, Skipped: 0, Time elapsed: 37.778 sec - in org.apache.phoenix.end2end.UpsertSelectTest
Running org.apache.phoenix.end2end.TopNTest
Tests run: 4, Failures: 0, Errors: 0, Skipped: 0, Time elapsed: 26.64 sec - in org.apache.phoenix.end2end.TopNTest
Running org.apache.phoenix.end2end.InMemoryOrderByTest
Tests run: 3, Failures: 0, Errors: 0, Skipped: 1, Time elapsed: 18.714 sec - in org.apache.phoenix.end2end.InMemoryOrderByTest
Running org.apache.phoenix.end2end.IsNullTest
Tests run: 1, Failures: 0, Errors: 0, Skipped: 0, Time elapsed: 27.244 sec - in org.apache.phoenix.end2end.IsNullTest
Running org.apache.phoenix.end2end.ToCharFunctionTest
Tests run: 10, Failures: 0, Errors: 0, Skipped: 0, Time elapsed: 25.983 sec - in org.apache.phoenix.end2end.ToCharFunctionTest
Running org.apache.phoenix.end2end.NativeHBaseTypesTest
Tests run: 7, Failures: 0, Errors: 0, Skipped: 0, Time elapsed: 25.323 sec - in org.apache.phoenix.end2end.NativeHBaseTypesTest
Running org.apache.phoenix.end2end.RoundFloorCeilFunctionsEnd2EndTest
Tests run: 21, Failures: 0, Errors: 0, Skipped: 0, Time elapsed: 25.352 sec - in org.apache.phoenix.end2end.RoundFloorCeilFunctionsEnd2EndTest
Running org.apache.phoenix.end2end.index.SaltedIndexTest
Tests run: 3, Failures: 0, Errors: 0, Skipped: 0, Time elapsed: 44.884 sec - in org.apache.phoenix.end2end.index.SaltedIndexTest
Running org.apache.phoenix.end2end.index.MutableIndexFailureTest
Tests run: 1, Failures: 0, Errors: 0, Skipped: 0, Time elapsed: 56.911 sec - in org.apache.phoenix.end2end.index.MutableIndexFailureTest
Running org.apache.phoenix.end2end.index.ImmutableIndexTest
Tests run: 7, Failures: 0, Errors: 0, Skipped: 0, Time elapsed: 29.61 sec - in org.apache.phoenix.end2end.index.ImmutableIndexTest
Running org.apache.phoenix.end2end.index.MutableIndexTest
Tests run: 11, Failures: 0, Errors: 0, Skipped: 0, Time elapsed: 56.914 sec - in org.apache.phoenix.end2end.index.MutableIndexTest
Running org.apache.phoenix.end2end.index.DropViewTest
Tests run: 1, Failures: 0, Errors: 0, Skipped: 0, Time elapsed: 26.37 sec - in org.apache.phoenix.end2end.index.DropViewTest
Running org.apache.phoenix.end2end.index.IndexMetadataTest
Tests run: 4, Failures: 0, Errors: 0, Skipped: 0, Time elapsed: 28.225 sec - in org.apache.phoenix.end2end.index.IndexMetadataTest
Running org.apache.phoenix.end2end.ToNumberFunctionTest
Tests run: 18, Failures: 0, Errors: 0, Skipped: 0, Time elapsed: 26.153 sec - in org.apache.phoenix.end2end.ToNumberFunctionTest
Running org.apache.phoenix.end2end.SpillableGroupByTest
Tests run: 1, Failures: 0, Errors: 0, Skipped: 0, Time elapsed: 19.183 sec - in org.apache.phoenix.end2end.SpillableGroupByTest
Running org.apache.phoenix.end2end.SkipScanQueryTest
Tests run: 7, Failures: 0, Errors: 0, Skipped: 0, Time elapsed: 25.996 sec - in org.apache.phoenix.end2end.SkipScanQueryTest
Running org.apache.phoenix.end2end.ExtendedQueryExecTest
Tests run: 4, Failures: 0, Errors: 0, Skipped: 0, Time elapsed: 26.247 sec - in org.apache.phoenix.end2end.ExtendedQueryExecTest
Running org.apache.phoenix.end2end.SaltedViewTest
Tests run: 1, Failures: 0, Errors: 0, Skipped: 0, Time elapsed: 27.474 sec - in org.apache.phoenix.end2end.SaltedViewTest
Running org.apache.phoenix.end2end.VariableLengthPKTest
Tests run: 49, Failures: 0, Errors: 0, Skipped: 0, Time elapsed: 40.985 sec - in org.apache.phoenix.end2end.VariableLengthPKTest
Running org.apache.phoenix.end2end.DeleteTest
Tests run: 13, Failures: 0, Errors: 0, Skipped: 0, Time elapsed: 39.102 sec - in org.apache.phoenix.end2end.DeleteTest
Running org.apache.phoenix.end2end.RowValueConstructorTest
Tests run: 24, Failures: 0, Errors: 0, Skipped: 0, Time elapsed: 37.982 sec - in org.apache.phoenix.end2end.RowValueConstructorTest
Running org.apache.phoenix.end2end.CreateTableTest
Tests run: 2, Failures: 0, Errors: 0, Skipped: 0, Time elapsed: 28.523 sec - in org.apache.phoenix.end2end.CreateTableTest
Running org.apache.phoenix.compile.ViewCompilerTest
Tests run: 3, Failures: 0, Errors: 0, Skipped: 0, Time elapsed: 0.054 sec - in org.apache.phoenix.compile.ViewCompilerTest
Running org.apache.phoenix.compile.QueryMetaDataTest
Tests run: 32, Failures: 0, Errors: 0, Skipped: 0, Time elapsed: 0.072 sec - in org.apache.phoenix.compile.QueryMetaDataTest
Running org.apache.phoenix.compile.HavingCompilerTest
Tests run: 10, Failures: 0, Errors: 0, Skipped: 0, Time elapsed: 0.037 sec - in org.apache.phoenix.compile.HavingCompilerTest
Running org.apache.phoenix.compile.WhereCompilerTest
Tests run: 41, Failures: 0, Errors: 0, Skipped: 1, Time elapsed: 0.078 sec - in org.apache.phoenix.compile.WhereCompilerTest
Running org.apache.phoenix.compile.SelectStatementRewriterTest
Tests run: 5, Failures: 0, Errors: 0, Skipped: 0, Time elapsed: 0.03 sec - in org.apache.phoenix.compile.SelectStatementRewriterTest
Running org.apache.phoenix.compile.LimitCompilerTest
Tests run: 6, Failures: 0, Errors: 0, Skipped: 0, Time elapsed: 0.034 sec - in org.apache.phoenix.compile.LimitCompilerTest
Running org.apache.phoenix.compile.WhereOptimizerTest
Tests run: 89, Failures: 0, Errors: 0, Skipped: 0, Time elapsed: 0.13 sec - in org.apache.phoenix.compile.WhereOptimizerTest
Running org.apache.phoenix.compile.JoinQueryCompilerTest
Tests run: 2, Failures: 0, Errors: 0, Skipped: 0, Time elapsed: 0.067 sec - in org.apache.phoenix.compile.JoinQueryCompilerTest
Running org.apache.phoenix.compile.QueryOptimizerTest
Tests run: 25, Failures: 0, Errors: 0, Skipped: 0, Time elapsed: 0.139 sec - in org.apache.phoenix.compile.QueryOptimizerTest
Running org.apache.phoenix.compile.QueryCompilerTest
Tests run: 77, Failures: 0, Errors: 0, Skipped: 0, Time elapsed: 0.107 sec - in org.apache.phoenix.compile.QueryCompilerTest
Running org.apache.phoenix.compile.ScanRangesTest
Tests run: 34, Failures: 0, Errors: 0, Skipped: 0, Time elapsed: 0.025 sec - in org.apache.phoenix.compile.ScanRangesTest
Running org.apache.phoenix.compile.StatementHintsCompilationTest
Tests run: 3, Failures: 0, Errors: 0, Skipped: 0, Time elapsed: 0.038 sec - in org.apache.phoenix.compile.StatementHintsCompilationTest
Running org.apache.phoenix.parse.QueryParserTest
Tests run: 46, Failures: 0, Errors: 0, Skipped: 0, Time elapsed: 0.016 sec - in org.apache.phoenix.parse.QueryParserTest
Running org.apache.phoenix.schema.PDataTypeTest
Tests run: 22, Failures: 0, Errors: 0, Skipped: 0, Time elapsed: 0.01 sec - in org.apache.phoenix.schema.PDataTypeTest
Running org.apache.phoenix.schema.SchemaUtilTest
Tests run: 3, Failures: 0, Errors: 0, Skipped: 0, Time elapsed: 0.001 sec - in org.apache.phoenix.schema.SchemaUtilTest
Running org.apache.phoenix.schema.PMetaDataImplTest
Tests run: 1, Failures: 0, Errors: 0, Skipped: 0, Time elapsed: 0.012 sec - in org.apache.phoenix.schema.PMetaDataImplTest
Running org.apache.phoenix.schema.SortOrderTest
Tests run: 7, Failures: 0, Errors: 0, Skipped: 0, Time elapsed: 0.048 sec - in org.apache.phoenix.schema.SortOrderTest
Running org.apache.phoenix.schema.PDataTypeForArraysTest
Tests run: 60, Failures: 0, Errors: 0, Skipped: 0, Time elapsed: 0.023 sec - in org.apache.phoenix.schema.PDataTypeForArraysTest
Running org.apache.phoenix.schema.RowKeyValueAccessorTest
Tests run: 1, Failures: 0, Errors: 0, Skipped: 0, Time elapsed: 0.039 sec - in org.apache.phoenix.schema.RowKeyValueAccessorTest
Running org.apache.phoenix.schema.RowKeySchemaTest
Tests run: 6, Failures: 0, Errors: 0, Skipped: 0, Time elapsed: 0.036 sec - in org.apache.phoenix.schema.RowKeySchemaTest
Running org.apache.phoenix.schema.ValueBitSetTest
Tests run: 2, Failures: 0, Errors: 0, Skipped: 0, Time elapsed: 0.005 sec - in org.apache.phoenix.schema.ValueBitSetTest
Running org.apache.phoenix.index.IndexMaintainerTest
Tests run: 17, Failures: 0, Errors: 0, Skipped: 0, Time elapsed: 2.59 sec - in org.apache.phoenix.index.IndexMaintainerTest
Running org.apache.phoenix.expression.SortOrderExpressionTest
Tests run: 23, Failures: 0, Errors: 0, Skipped: 0, Time elapsed: 0.016 sec - in org.apache.phoenix.expression.SortOrderExpressionTest
Running org.apache.phoenix.expression.ColumnExpressionTest
Tests run: 4, Failures: 0, Errors: 0, Skipped: 0, Time elapsed: 0 sec - in org.apache.phoenix.expression.ColumnExpressionTest
Running org.apache.phoenix.expression.LikeExpressionTest
Tests run: 1, Failures: 0, Errors: 0, Skipped: 0, Time elapsed: 0 sec - in org.apache.phoenix.expression.LikeExpressionTest
Running org.apache.phoenix.expression.CoerceExpressionTest
Tests run: 5, Failures: 0, Errors: 0, Skipped: 0, Time elapsed: 0.001 sec - in org.apache.phoenix.expression.CoerceExpressionTest
Running org.apache.hadoop.hbase.regionserver.wal.TestReadWriteKeyValuesWithCodec
Tests run: 2, Failures: 0, Errors: 0, Skipped: 0, Time elapsed: 0.087 sec - in org.apache.hadoop.hbase.regionserver.wal.TestReadWriteKeyValuesWithCodec
Running org.apache.hadoop.hbase.regionserver.wal.TestWALReplayWithIndexWritesAndCompressedWAL
Tests run: 1, Failures: 0, Errors: 0, Skipped: 0, Time elapsed: 21.586 sec - in org.apache.hadoop.hbase.regionserver.wal.TestWALReplayWithIndexWritesAndCompressedWAL
Running org.apache.hadoop.hbase.regionserver.wal.TestWALReplayWithIndexWritesAndUncompressedWALInHBase_094_9
Tests run: 1, Failures: 0, Errors: 0, Skipped: 0, Time elapsed: 23.998 sec - in org.apache.hadoop.hbase.regionserver.wal.TestWALReplayWithIndexWritesAndUncompressedWALInHBase_094_9
Results :
Failed tests:
DefaultParallelIteratorsRegionSplitterTest.testStatsManagerImpl:292 null
Tests run: 1739, Failures: 1, Errors: 0, Skipped: 8
[INFO] ------------------------------------------------------------------------
[INFO] Reactor Summary:
[INFO]
[INFO] Apache Phoenix .................................... SUCCESS [2.653s]
[INFO] Phoenix Hadoop Compatibility ...................... SUCCESS [2.553s]
[INFO] Phoenix Core ...................................... FAILURE [44:56.745s]
[INFO] Phoenix - Flume ................................... SKIPPED
[INFO] Phoenix - Pig ..................................... SKIPPED
[INFO] Phoenix Hadoop1 Compatibility ..................... SKIPPED
[INFO] Phoenix Assebmly .................................. SKIPPED
[INFO] ------------------------------------------------------------------------
[INFO] BUILD FAILURE
[INFO] ------------------------------------------------------------------------
[INFO] Total time: 45:02.600s
[INFO] Finished at: Mon Mar 03 10:19:04 UTC 2014
[INFO] Final Memory: 28M/411M
[INFO] ------------------------------------------------------------------------
[ERROR] Failed to execute goal org.apache.maven.plugins:maven-surefire-plugin:2.16:test (default-test) on project phoenix-core: There are test failures.
[ERROR]
[ERROR] Please refer to <https://builds.apache.org/job/Phoenix/ws/phoenix-core/target/surefire-reports> for the individual test results.
[ERROR] -> [Help 1]
[ERROR]
[ERROR] To see the full stack trace of the errors, re-run Maven with the -e switch.
[ERROR] Re-run Maven using the -X switch to enable full debug logging.
[ERROR]
[ERROR] For more information about the errors and possible solutions, please read the following articles:
[ERROR] [Help 1] http://cwiki.apache.org/confluence/display/MAVEN/MojoFailureException
[ERROR]
[ERROR] After correcting the problems, you can resume the build with the command
[ERROR] mvn <goals> -rf :phoenix-core
Build step 'Invoke top-level Maven targets' marked build as failure
Archiving artifacts
Updating PHOENIX-100
Updating PHOENIX-98
Recording test results