You are viewing a plain text version of this content. The canonical link for it is here.
Posted to dev@kafka.apache.org by Apache Jenkins Server <je...@builds.apache.org> on 2019/01/14 23:41:29 UTC
Build failed in Jenkins: kafka-2.1-jdk8 #106
See <https://builds.apache.org/job/kafka-2.1-jdk8/106/display/redirect?page=changes>
Changes:
[me] KAFKA-7503: Connect integration test harness
------------------------------------------
[...truncated 586.82 KB...]
kafka.server.KafkaConfigTest > testInvalidInterBrokerSecurityProtocol STARTED
kafka.server.KafkaConfigTest > testInvalidInterBrokerSecurityProtocol PASSED
kafka.server.KafkaConfigTest > testAdvertiseDefaults STARTED
kafka.server.KafkaConfigTest > testAdvertiseDefaults PASSED
kafka.server.KafkaConfigTest > testBadListenerProtocol STARTED
kafka.server.KafkaConfigTest > testBadListenerProtocol PASSED
kafka.server.KafkaConfigTest > testListenerDefaults STARTED
kafka.server.KafkaConfigTest > testListenerDefaults PASSED
kafka.server.KafkaConfigTest > testLogRetentionTimeBothMinutesAndHoursProvided STARTED
kafka.server.KafkaConfigTest > testLogRetentionTimeBothMinutesAndHoursProvided PASSED
kafka.server.KafkaConfigTest > testUncleanElectionDisabled STARTED
kafka.server.KafkaConfigTest > testUncleanElectionDisabled PASSED
kafka.server.KafkaConfigTest > testListenerNameMissingFromListenerSecurityProtocolMap STARTED
kafka.server.KafkaConfigTest > testListenerNameMissingFromListenerSecurityProtocolMap PASSED
kafka.server.KafkaConfigTest > testLogRetentionTimeNoConfigProvided STARTED
kafka.server.KafkaConfigTest > testLogRetentionTimeNoConfigProvided PASSED
kafka.server.KafkaConfigTest > testCaseInsensitiveListenerProtocol STARTED
kafka.server.KafkaConfigTest > testCaseInsensitiveListenerProtocol PASSED
kafka.server.KafkaConfigTest > testListenerAndAdvertisedListenerNames STARTED
kafka.server.KafkaConfigTest > testListenerAndAdvertisedListenerNames PASSED
kafka.server.KafkaConfigTest > testNonroutableAdvertisedListeners STARTED
kafka.server.KafkaConfigTest > testNonroutableAdvertisedListeners PASSED
kafka.server.KafkaConfigTest > testInterBrokerListenerNameAndSecurityProtocolSet STARTED
kafka.server.KafkaConfigTest > testInterBrokerListenerNameAndSecurityProtocolSet PASSED
kafka.server.KafkaConfigTest > testFromPropsInvalid STARTED
kafka.server.KafkaConfigTest > testFromPropsInvalid PASSED
kafka.server.KafkaConfigTest > testInvalidCompressionType STARTED
kafka.server.KafkaConfigTest > testInvalidCompressionType PASSED
kafka.server.KafkaConfigTest > testAdvertiseHostNameDefault STARTED
kafka.server.KafkaConfigTest > testAdvertiseHostNameDefault PASSED
kafka.server.KafkaConfigTest > testLogRetentionTimeMinutesProvided STARTED
kafka.server.KafkaConfigTest > testLogRetentionTimeMinutesProvided PASSED
kafka.server.KafkaConfigTest > testValidCompressionType STARTED
kafka.server.KafkaConfigTest > testValidCompressionType PASSED
kafka.server.KafkaConfigTest > testUncleanElectionInvalid STARTED
kafka.server.KafkaConfigTest > testUncleanElectionInvalid PASSED
kafka.server.KafkaConfigTest > testListenerNamesWithAdvertisedListenerUnset STARTED
kafka.server.KafkaConfigTest > testListenerNamesWithAdvertisedListenerUnset PASSED
kafka.server.KafkaConfigTest > testLogRetentionTimeBothMinutesAndMsProvided STARTED
kafka.server.KafkaConfigTest > testLogRetentionTimeBothMinutesAndMsProvided PASSED
kafka.server.KafkaConfigTest > testLogRollTimeMsProvided STARTED
kafka.server.KafkaConfigTest > testLogRollTimeMsProvided PASSED
kafka.server.KafkaConfigTest > testUncleanLeaderElectionDefault STARTED
kafka.server.KafkaConfigTest > testUncleanLeaderElectionDefault PASSED
kafka.server.KafkaConfigTest > testInvalidAdvertisedListenersProtocol STARTED
kafka.server.KafkaConfigTest > testInvalidAdvertisedListenersProtocol PASSED
kafka.server.KafkaConfigTest > testUncleanElectionEnabled STARTED
kafka.server.KafkaConfigTest > testUncleanElectionEnabled PASSED
kafka.server.KafkaConfigTest > testInterBrokerVersionMessageFormatCompatibility STARTED
kafka.server.KafkaConfigTest > testInterBrokerVersionMessageFormatCompatibility PASSED
kafka.server.KafkaConfigTest > testAdvertisePortDefault STARTED
kafka.server.KafkaConfigTest > testAdvertisePortDefault PASSED
kafka.server.KafkaConfigTest > testVersionConfiguration STARTED
kafka.server.KafkaConfigTest > testVersionConfiguration PASSED
kafka.server.KafkaConfigTest > testEqualAdvertisedListenersProtocol STARTED
kafka.server.KafkaConfigTest > testEqualAdvertisedListenersProtocol PASSED
kafka.server.ListOffsetsRequestTest > classMethod STARTED
kafka.server.ListOffsetsRequestTest > classMethod FAILED
java.lang.AssertionError: Found unexpected threads during @BeforeClass, allThreads=Set(d5be7754-8426-4bf4-9c54-6c7d79628f64, SessionTracker, Reference Handler, ExpirationReaper-0-Produce, ForkJoinPool-1-worker-57, ForkJoinPool-1-worker-21, ThrottledChannelReaper-Request, Test worker, SyncThread:0, ForkJoinPool-1-worker-53, NIOServerCxn.Factory:/127.0.0.1:0, SensorExpiryThread, group%0043ache.data, ForkJoinPool-1-worker-7, Time-limited test-SendThread(localhost:36628), metrics-meter-tick-thread-1, metrics-meter-tick-thread-2, Signal Dispatcher, main, NioProcessor-89, Time-limited test, controller-event-thread, NioProcessor-90, ExpirationReaper-0-DeleteRecords, NioSocketAcceptor-30, kdc%0052eplay%0043ache.data, Controller-0-to-broker-2-send-thread, ThrottledChannelReaper-Produce, Time-limited test-EventThread, ForkJoinPool-1-worker-35, ForkJoinPool-1-worker-3, Statistics Thread-d5be7754-8426-4bf4-9c54-6c7d79628f64-1, Controller-0-to-broker-0-send-thread, kafka-scheduler-0, ProcessThread(sid:0 cport:36628):, change%0050wd%0052eplay%0043ache.data, Controller-0-to-broker-1-send-thread, ExpirationReaper-0-Fetch, Finalizer, /0:0:0:0:0:0:0:1:46872 to /0:0:0:0:0:0:0:1:35588 workers Thread 2, ThrottledChannelReaper-Fetch, /0:0:0:0:0:0:0:1:46872 to /0:0:0:0:0:0:0:1:35588 workers Thread 3, ou=system.data), unexpected=Set(controller-event-thread)
kafka.server.ListOffsetsRequestTest > classMethod STARTED
kafka.server.ListOffsetsRequestTest > classMethod FAILED
java.lang.AssertionError: Found unexpected threads during @AfterClass, allThreads=Set(d5be7754-8426-4bf4-9c54-6c7d79628f64, SessionTracker, Reference Handler, ExpirationReaper-0-Produce, ForkJoinPool-1-worker-57, ForkJoinPool-1-worker-21, ThrottledChannelReaper-Request, Test worker, SyncThread:0, ForkJoinPool-1-worker-53, NIOServerCxn.Factory:/127.0.0.1:0, SensorExpiryThread, group%0043ache.data, ForkJoinPool-1-worker-7, Time-limited test-SendThread(localhost:36628), metrics-meter-tick-thread-1, metrics-meter-tick-thread-2, Signal Dispatcher, main, NioProcessor-89, Time-limited test, controller-event-thread, NioProcessor-90, ExpirationReaper-0-DeleteRecords, NioSocketAcceptor-30, kdc%0052eplay%0043ache.data, Controller-0-to-broker-2-send-thread, ThrottledChannelReaper-Produce, Time-limited test-EventThread, ForkJoinPool-1-worker-35, ForkJoinPool-1-worker-3, Statistics Thread-d5be7754-8426-4bf4-9c54-6c7d79628f64-1, Controller-0-to-broker-0-send-thread, kafka-scheduler-0, ProcessThread(sid:0 cport:36628):, change%0050wd%0052eplay%0043ache.data, Controller-0-to-broker-1-send-thread, ExpirationReaper-0-Fetch, Finalizer, /0:0:0:0:0:0:0:1:46872 to /0:0:0:0:0:0:0:1:35588 workers Thread 2, ThrottledChannelReaper-Fetch, /0:0:0:0:0:0:0:1:46872 to /0:0:0:0:0:0:0:1:35588 workers Thread 3, ou=system.data), unexpected=Set(controller-event-thread)
kafka.server.CreateTopicsRequestTest > classMethod STARTED
kafka.server.CreateTopicsRequestTest > classMethod FAILED
java.lang.AssertionError: Found unexpected threads during @BeforeClass, allThreads=Set(d5be7754-8426-4bf4-9c54-6c7d79628f64, SessionTracker, Reference Handler, ExpirationReaper-0-Produce, ForkJoinPool-1-worker-57, ForkJoinPool-1-worker-21, ThrottledChannelReaper-Request, Test worker, SyncThread:0, ForkJoinPool-1-worker-53, NIOServerCxn.Factory:/127.0.0.1:0, SensorExpiryThread, group%0043ache.data, ForkJoinPool-1-worker-7, Time-limited test-SendThread(localhost:36628), metrics-meter-tick-thread-1, metrics-meter-tick-thread-2, Signal Dispatcher, main, NioProcessor-89, Time-limited test, controller-event-thread, NioProcessor-90, ExpirationReaper-0-DeleteRecords, NioSocketAcceptor-30, kdc%0052eplay%0043ache.data, Controller-0-to-broker-2-send-thread, ThrottledChannelReaper-Produce, Time-limited test-EventThread, ForkJoinPool-1-worker-35, ForkJoinPool-1-worker-3, Statistics Thread-d5be7754-8426-4bf4-9c54-6c7d79628f64-1, Controller-0-to-broker-0-send-thread, kafka-scheduler-0, ProcessThread(sid:0 cport:36628):, change%0050wd%0052eplay%0043ache.data, Controller-0-to-broker-1-send-thread, ExpirationReaper-0-Fetch, Finalizer, /0:0:0:0:0:0:0:1:46872 to /0:0:0:0:0:0:0:1:35588 workers Thread 2, ThrottledChannelReaper-Fetch, /0:0:0:0:0:0:0:1:46872 to /0:0:0:0:0:0:0:1:35588 workers Thread 3, ou=system.data), unexpected=Set(controller-event-thread)
kafka.server.CreateTopicsRequestTest > classMethod STARTED
kafka.server.CreateTopicsRequestTest > classMethod FAILED
java.lang.AssertionError: Found unexpected threads during @AfterClass, allThreads=Set(d5be7754-8426-4bf4-9c54-6c7d79628f64, SessionTracker, Reference Handler, ExpirationReaper-0-Produce, ForkJoinPool-1-worker-57, ForkJoinPool-1-worker-21, ThrottledChannelReaper-Request, Test worker, SyncThread:0, ForkJoinPool-1-worker-53, NIOServerCxn.Factory:/127.0.0.1:0, SensorExpiryThread, group%0043ache.data, ForkJoinPool-1-worker-7, Time-limited test-SendThread(localhost:36628), metrics-meter-tick-thread-1, metrics-meter-tick-thread-2, Signal Dispatcher, main, NioProcessor-89, Time-limited test, controller-event-thread, NioProcessor-90, ExpirationReaper-0-DeleteRecords, NioSocketAcceptor-30, kdc%0052eplay%0043ache.data, Controller-0-to-broker-2-send-thread, ThrottledChannelReaper-Produce, Time-limited test-EventThread, ForkJoinPool-1-worker-35, ForkJoinPool-1-worker-3, Statistics Thread-d5be7754-8426-4bf4-9c54-6c7d79628f64-1, Controller-0-to-broker-0-send-thread, kafka-scheduler-0, ProcessThread(sid:0 cport:36628):, change%0050wd%0052eplay%0043ache.data, Controller-0-to-broker-1-send-thread, ExpirationReaper-0-Fetch, Finalizer, /0:0:0:0:0:0:0:1:46872 to /0:0:0:0:0:0:0:1:35588 workers Thread 2, ThrottledChannelReaper-Fetch, /0:0:0:0:0:0:0:1:46872 to /0:0:0:0:0:0:0:1:35588 workers Thread 3, ou=system.data), unexpected=Set(controller-event-thread)
kafka.server.CreateTopicsRequestWithPolicyTest > classMethod STARTED
kafka.server.CreateTopicsRequestWithPolicyTest > classMethod FAILED
java.lang.AssertionError: Found unexpected threads during @BeforeClass, allThreads=Set(d5be7754-8426-4bf4-9c54-6c7d79628f64, SessionTracker, Reference Handler, ExpirationReaper-0-Produce, ForkJoinPool-1-worker-57, ForkJoinPool-1-worker-21, ThrottledChannelReaper-Request, Test worker, SyncThread:0, ForkJoinPool-1-worker-53, NIOServerCxn.Factory:/127.0.0.1:0, SensorExpiryThread, group%0043ache.data, ForkJoinPool-1-worker-7, Time-limited test-SendThread(localhost:36628), metrics-meter-tick-thread-1, metrics-meter-tick-thread-2, Signal Dispatcher, main, NioProcessor-89, Time-limited test, controller-event-thread, NioProcessor-90, ExpirationReaper-0-DeleteRecords, NioSocketAcceptor-30, kdc%0052eplay%0043ache.data, Controller-0-to-broker-2-send-thread, ThrottledChannelReaper-Produce, Time-limited test-EventThread, ForkJoinPool-1-worker-35, ForkJoinPool-1-worker-3, Statistics Thread-d5be7754-8426-4bf4-9c54-6c7d79628f64-1, Controller-0-to-broker-0-send-thread, kafka-scheduler-0, ProcessThread(sid:0 cport:36628):, change%0050wd%0052eplay%0043ache.data, Controller-0-to-broker-1-send-thread, ExpirationReaper-0-Fetch, Finalizer, /0:0:0:0:0:0:0:1:46872 to /0:0:0:0:0:0:0:1:35588 workers Thread 2, ThrottledChannelReaper-Fetch, /0:0:0:0:0:0:0:1:46872 to /0:0:0:0:0:0:0:1:35588 workers Thread 3, ou=system.data), unexpected=Set(controller-event-thread)
kafka.server.CreateTopicsRequestWithPolicyTest > classMethod STARTED
kafka.server.CreateTopicsRequestWithPolicyTest > classMethod FAILED
java.lang.AssertionError: Found unexpected threads during @AfterClass, allThreads=Set(d5be7754-8426-4bf4-9c54-6c7d79628f64, SessionTracker, Reference Handler, ExpirationReaper-0-Produce, ForkJoinPool-1-worker-57, ForkJoinPool-1-worker-21, ThrottledChannelReaper-Request, Test worker, SyncThread:0, ForkJoinPool-1-worker-53, NIOServerCxn.Factory:/127.0.0.1:0, SensorExpiryThread, group%0043ache.data, ForkJoinPool-1-worker-7, Time-limited test-SendThread(localhost:36628), metrics-meter-tick-thread-1, metrics-meter-tick-thread-2, Signal Dispatcher, main, NioProcessor-89, Time-limited test, controller-event-thread, NioProcessor-90, ExpirationReaper-0-DeleteRecords, NioSocketAcceptor-30, kdc%0052eplay%0043ache.data, Controller-0-to-broker-2-send-thread, ThrottledChannelReaper-Produce, Time-limited test-EventThread, ForkJoinPool-1-worker-35, ForkJoinPool-1-worker-3, Statistics Thread-d5be7754-8426-4bf4-9c54-6c7d79628f64-1, Controller-0-to-broker-0-send-thread, kafka-scheduler-0, ProcessThread(sid:0 cport:36628):, change%0050wd%0052eplay%0043ache.data, Controller-0-to-broker-1-send-thread, ExpirationReaper-0-Fetch, Finalizer, /0:0:0:0:0:0:0:1:46872 to /0:0:0:0:0:0:0:1:35588 workers Thread 2, ThrottledChannelReaper-Fetch, /0:0:0:0:0:0:0:1:46872 to /0:0:0:0:0:0:0:1:35588 workers Thread 3, ou=system.data), unexpected=Set(controller-event-thread)
kafka.server.FetchRequestDownConversionConfigTest > classMethod STARTED
kafka.server.FetchRequestDownConversionConfigTest > classMethod FAILED
java.lang.AssertionError: Found unexpected threads during @BeforeClass, allThreads=Set(d5be7754-8426-4bf4-9c54-6c7d79628f64, SessionTracker, Reference Handler, ExpirationReaper-0-Produce, ForkJoinPool-1-worker-57, ForkJoinPool-1-worker-21, ThrottledChannelReaper-Request, Test worker, SyncThread:0, ForkJoinPool-1-worker-53, NIOServerCxn.Factory:/127.0.0.1:0, SensorExpiryThread, group%0043ache.data, ForkJoinPool-1-worker-7, Time-limited test-SendThread(localhost:36628), metrics-meter-tick-thread-1, metrics-meter-tick-thread-2, Signal Dispatcher, main, NioProcessor-89, Time-limited test, controller-event-thread, NioProcessor-90, ExpirationReaper-0-DeleteRecords, NioSocketAcceptor-30, kdc%0052eplay%0043ache.data, Controller-0-to-broker-2-send-thread, ThrottledChannelReaper-Produce, Time-limited test-EventThread, ForkJoinPool-1-worker-35, ForkJoinPool-1-worker-3, Statistics Thread-d5be7754-8426-4bf4-9c54-6c7d79628f64-1, Controller-0-to-broker-0-send-thread, kafka-scheduler-0, ProcessThread(sid:0 cport:36628):, change%0050wd%0052eplay%0043ache.data, Controller-0-to-broker-1-send-thread, ExpirationReaper-0-Fetch, Finalizer, /0:0:0:0:0:0:0:1:46872 to /0:0:0:0:0:0:0:1:35588 workers Thread 2, ThrottledChannelReaper-Fetch, /0:0:0:0:0:0:0:1:46872 to /0:0:0:0:0:0:0:1:35588 workers Thread 3, ou=system.data), unexpected=Set(controller-event-thread)
kafka.server.FetchRequestDownConversionConfigTest > classMethod STARTED
kafka.server.FetchRequestDownConversionConfigTest > classMethod FAILED
java.lang.AssertionError: Found unexpected threads during @AfterClass, allThreads=Set(d5be7754-8426-4bf4-9c54-6c7d79628f64, SessionTracker, Reference Handler, ExpirationReaper-0-Produce, ForkJoinPool-1-worker-57, ForkJoinPool-1-worker-21, ThrottledChannelReaper-Request, Test worker, SyncThread:0, ForkJoinPool-1-worker-53, NIOServerCxn.Factory:/127.0.0.1:0, SensorExpiryThread, group%0043ache.data, ForkJoinPool-1-worker-7, Time-limited test-SendThread(localhost:36628), metrics-meter-tick-thread-1, metrics-meter-tick-thread-2, Signal Dispatcher, main, NioProcessor-89, Time-limited test, controller-event-thread, NioProcessor-90, ExpirationReaper-0-DeleteRecords, NioSocketAcceptor-30, kdc%0052eplay%0043ache.data, Controller-0-to-broker-2-send-thread, ThrottledChannelReaper-Produce, Time-limited test-EventThread, ForkJoinPool-1-worker-35, ForkJoinPool-1-worker-3, Statistics Thread-d5be7754-8426-4bf4-9c54-6c7d79628f64-1, Controller-0-to-broker-0-send-thread, kafka-scheduler-0, ProcessThread(sid:0 cport:36628):, change%0050wd%0052eplay%0043ache.data, Controller-0-to-broker-1-send-thread, ExpirationReaper-0-Fetch, Finalizer, /0:0:0:0:0:0:0:1:46872 to /0:0:0:0:0:0:0:1:35588 workers Thread 2, ThrottledChannelReaper-Fetch, /0:0:0:0:0:0:0:1:46872 to /0:0:0:0:0:0:0:1:35588 workers Thread 3, ou=system.data), unexpected=Set(controller-event-thread)
kafka.server.SaslApiVersionsRequestTest > classMethod STARTED
kafka.server.SaslApiVersionsRequestTest > classMethod FAILED
java.lang.AssertionError: Found unexpected threads during @BeforeClass, allThreads=Set(d5be7754-8426-4bf4-9c54-6c7d79628f64, SessionTracker, Reference Handler, ExpirationReaper-0-Produce, ForkJoinPool-1-worker-57, ForkJoinPool-1-worker-21, ThrottledChannelReaper-Request, Test worker, SyncThread:0, ForkJoinPool-1-worker-53, NIOServerCxn.Factory:/127.0.0.1:0, SensorExpiryThread, group%0043ache.data, ForkJoinPool-1-worker-7, Time-limited test-SendThread(localhost:36628), metrics-meter-tick-thread-1, metrics-meter-tick-thread-2, Signal Dispatcher, main, NioProcessor-89, Time-limited test, controller-event-thread, NioProcessor-90, ExpirationReaper-0-DeleteRecords, NioSocketAcceptor-30, kdc%0052eplay%0043ache.data, Controller-0-to-broker-2-send-thread, ThrottledChannelReaper-Produce, Time-limited test-EventThread, ForkJoinPool-1-worker-35, ForkJoinPool-1-worker-3, Statistics Thread-d5be7754-8426-4bf4-9c54-6c7d79628f64-1, Controller-0-to-broker-0-send-thread, kafka-scheduler-0, ProcessThread(sid:0 cport:36628):, change%0050wd%0052eplay%0043ache.data, Controller-0-to-broker-1-send-thread, ExpirationReaper-0-Fetch, Finalizer, /0:0:0:0:0:0:0:1:46872 to /0:0:0:0:0:0:0:1:35588 workers Thread 2, ThrottledChannelReaper-Fetch, /0:0:0:0:0:0:0:1:46872 to /0:0:0:0:0:0:0:1:35588 workers Thread 3, ou=system.data), unexpected=Set(controller-event-thread)
kafka.server.SaslApiVersionsRequestTest > classMethod STARTED
kafka.server.SaslApiVersionsRequestTest > classMethod FAILED
java.lang.AssertionError: Found unexpected threads during @AfterClass, allThreads=Set(d5be7754-8426-4bf4-9c54-6c7d79628f64, SessionTracker, Reference Handler, ExpirationReaper-0-Produce, ForkJoinPool-1-worker-57, ForkJoinPool-1-worker-21, ThrottledChannelReaper-Request, Test worker, SyncThread:0, ForkJoinPool-1-worker-53, NIOServerCxn.Factory:/127.0.0.1:0, SensorExpiryThread, group%0043ache.data, ForkJoinPool-1-worker-7, Time-limited test-SendThread(localhost:36628), metrics-meter-tick-thread-1, metrics-meter-tick-thread-2, Signal Dispatcher, main, NioProcessor-89, Time-limited test, controller-event-thread, NioProcessor-90, ExpirationReaper-0-DeleteRecords, NioSocketAcceptor-30, kdc%0052eplay%0043ache.data, Controller-0-to-broker-2-send-thread, ThrottledChannelReaper-Produce, Time-limited test-EventThread, ForkJoinPool-1-worker-35, ForkJoinPool-1-worker-3, Statistics Thread-d5be7754-8426-4bf4-9c54-6c7d79628f64-1, Controller-0-to-broker-0-send-thread, kafka-scheduler-0, ProcessThread(sid:0 cport:36628):, change%0050wd%0052eplay%0043ache.data, Controller-0-to-broker-1-send-thread, ExpirationReaper-0-Fetch, Finalizer, /0:0:0:0:0:0:0:1:46872 to /0:0:0:0:0:0:0:1:35588 workers Thread 2, ThrottledChannelReaper-Fetch, /0:0:0:0:0:0:0:1:46872 to /0:0:0:0:0:0:0:1:35588 workers Thread 3, ou=system.data), unexpected=Set(controller-event-thread)
kafka.server.LogDirFailureTest > classMethod STARTED
kafka.server.LogDirFailureTest > classMethod FAILED
java.lang.AssertionError: Found unexpected threads during @BeforeClass, allThreads=Set(d5be7754-8426-4bf4-9c54-6c7d79628f64, SessionTracker, Reference Handler, ExpirationReaper-0-Produce, ForkJoinPool-1-worker-57, ForkJoinPool-1-worker-21, ThrottledChannelReaper-Request, Test worker, SyncThread:0, ForkJoinPool-1-worker-53, NIOServerCxn.Factory:/127.0.0.1:0, SensorExpiryThread, group%0043ache.data, ForkJoinPool-1-worker-7, Time-limited test-SendThread(localhost:36628), metrics-meter-tick-thread-1, metrics-meter-tick-thread-2, Signal Dispatcher, main, NioProcessor-89, Time-limited test, controller-event-thread, NioProcessor-90, ExpirationReaper-0-DeleteRecords, NioSocketAcceptor-30, kdc%0052eplay%0043ache.data, Controller-0-to-broker-2-send-thread, ThrottledChannelReaper-Produce, Time-limited test-EventThread, ForkJoinPool-1-worker-35, ForkJoinPool-1-worker-3, Statistics Thread-d5be7754-8426-4bf4-9c54-6c7d79628f64-1, Controller-0-to-broker-0-send-thread, kafka-scheduler-0, ProcessThread(sid:0 cport:36628):, change%0050wd%0052eplay%0043ache.data, Controller-0-to-broker-1-send-thread, ExpirationReaper-0-Fetch, Finalizer, /0:0:0:0:0:0:0:1:46872 to /0:0:0:0:0:0:0:1:35588 workers Thread 2, ThrottledChannelReaper-Fetch, /0:0:0:0:0:0:0:1:46872 to /0:0:0:0:0:0:0:1:35588 workers Thread 3, ou=system.data), unexpected=Set(controller-event-thread)
kafka.server.LogDirFailureTest > classMethod STARTED
kafka.server.LogDirFailureTest > classMethod FAILED
java.lang.AssertionError: Found unexpected threads during @AfterClass, allThreads=Set(d5be7754-8426-4bf4-9c54-6c7d79628f64, SessionTracker, Reference Handler, ExpirationReaper-0-Produce, ForkJoinPool-1-worker-57, ForkJoinPool-1-worker-21, ThrottledChannelReaper-Request, Test worker, SyncThread:0, ForkJoinPool-1-worker-53, NIOServerCxn.Factory:/127.0.0.1:0, SensorExpiryThread, group%0043ache.data, ForkJoinPool-1-worker-7, Time-limited test-SendThread(localhost:36628), metrics-meter-tick-thread-1, metrics-meter-tick-thread-2, Signal Dispatcher, main, NioProcessor-89, Time-limited test, controller-event-thread, NioProcessor-90, ExpirationReaper-0-DeleteRecords, NioSocketAcceptor-30, kdc%0052eplay%0043ache.data, Controller-0-to-broker-2-send-thread, ThrottledChannelReaper-Produce, Time-limited test-EventThread, ForkJoinPool-1-worker-35, ForkJoinPool-1-worker-3, Statistics Thread-d5be7754-8426-4bf4-9c54-6c7d79628f64-1, Controller-0-to-broker-0-send-thread, kafka-scheduler-0, ProcessThread(sid:0 cport:36628):, change%0050wd%0052eplay%0043ache.data, Controller-0-to-broker-1-send-thread, ExpirationReaper-0-Fetch, Finalizer, /0:0:0:0:0:0:0:1:46872 to /0:0:0:0:0:0:0:1:35588 workers Thread 2, ThrottledChannelReaper-Fetch, /0:0:0:0:0:0:0:1:46872 to /0:0:0:0:0:0:0:1:35588 workers Thread 3, ou=system.data), unexpected=Set(controller-event-thread)
kafka.server.AlterReplicaLogDirsRequestTest > classMethod STARTED
kafka.server.AlterReplicaLogDirsRequestTest > classMethod FAILED
java.lang.AssertionError: Found unexpected threads during @BeforeClass, allThreads=Set(d5be7754-8426-4bf4-9c54-6c7d79628f64, SessionTracker, Reference Handler, ExpirationReaper-0-Produce, ForkJoinPool-1-worker-57, ForkJoinPool-1-worker-21, ThrottledChannelReaper-Request, Test worker, SyncThread:0, ForkJoinPool-1-worker-53, NIOServerCxn.Factory:/127.0.0.1:0, SensorExpiryThread, group%0043ache.data, ForkJoinPool-1-worker-7, Time-limited test-SendThread(localhost:36628), metrics-meter-tick-thread-1, metrics-meter-tick-thread-2, Signal Dispatcher, main, NioProcessor-89, Time-limited test, controller-event-thread, NioProcessor-90, ExpirationReaper-0-DeleteRecords, NioSocketAcceptor-30, kdc%0052eplay%0043ache.data, Controller-0-to-broker-2-send-thread, ThrottledChannelReaper-Produce, Time-limited test-EventThread, ForkJoinPool-1-worker-35, ForkJoinPool-1-worker-3, Statistics Thread-d5be7754-8426-4bf4-9c54-6c7d79628f64-1, Controller-0-to-broker-0-send-thread, kafka-scheduler-0, ProcessThread(sid:0 cport:36628):, change%0050wd%0052eplay%0043ache.data, Controller-0-to-broker-1-send-thread, ExpirationReaper-0-Fetch, Finalizer, /0:0:0:0:0:0:0:1:46872 to /0:0:0:0:0:0:0:1:35588 workers Thread 2, ThrottledChannelReaper-Fetch, /0:0:0:0:0:0:0:1:46872 to /0:0:0:0:0:0:0:1:35588 workers Thread 3, ou=system.data), unexpected=Set(controller-event-thread)
kafka.server.AlterReplicaLogDirsRequestTest > classMethod STARTED
kafka.server.AlterReplicaLogDirsRequestTest > classMethod FAILED
java.lang.AssertionError: Found unexpected threads during @AfterClass, allThreads=Set(d5be7754-8426-4bf4-9c54-6c7d79628f64, SessionTracker, Reference Handler, ExpirationReaper-0-Produce, ForkJoinPool-1-worker-57, ForkJoinPool-1-worker-21, ThrottledChannelReaper-Request, Test worker, SyncThread:0, ForkJoinPool-1-worker-53, NIOServerCxn.Factory:/127.0.0.1:0, SensorExpiryThread, group%0043ache.data, ForkJoinPool-1-worker-7, Time-limited test-SendThread(localhost:36628), metrics-meter-tick-thread-1, metrics-meter-tick-thread-2, Signal Dispatcher, main, NioProcessor-89, Time-limited test, controller-event-thread, NioProcessor-90, ExpirationReaper-0-DeleteRecords, NioSocketAcceptor-30, kdc%0052eplay%0043ache.data, Controller-0-to-broker-2-send-thread, ThrottledChannelReaper-Produce, Time-limited test-EventThread, ForkJoinPool-1-worker-35, ForkJoinPool-1-worker-3, Statistics Thread-d5be7754-8426-4bf4-9c54-6c7d79628f64-1, Controller-0-to-broker-0-send-thread, kafka-scheduler-0, ProcessThread(sid:0 cport:36628):, change%0050wd%0052eplay%0043ache.data, Controller-0-to-broker-1-send-thread, ExpirationReaper-0-Fetch, Finalizer, /0:0:0:0:0:0:0:1:46872 to /0:0:0:0:0:0:0:1:35588 workers Thread 2, ThrottledChannelReaper-Fetch, /0:0:0:0:0:0:0:1:46872 to /0:0:0:0:0:0:0:1:35588 workers Thread 3, ou=system.data), unexpected=Set(controller-event-thread)
kafka.server.ServerGenerateBrokerIdTest > classMethod STARTED
kafka.server.ServerGenerateBrokerIdTest > classMethod FAILED
java.lang.AssertionError: Found unexpected threads during @BeforeClass, allThreads=Set(d5be7754-8426-4bf4-9c54-6c7d79628f64, SessionTracker, Reference Handler, ExpirationReaper-0-Produce, ForkJoinPool-1-worker-57, ForkJoinPool-1-worker-21, ThrottledChannelReaper-Request, Test worker, SyncThread:0, ForkJoinPool-1-worker-53, NIOServerCxn.Factory:/127.0.0.1:0, SensorExpiryThread, group%0043ache.data, ForkJoinPool-1-worker-7, Time-limited test-SendThread(localhost:36628), metrics-meter-tick-thread-1, metrics-meter-tick-thread-2, Signal Dispatcher, main, NioProcessor-89, Time-limited test, controller-event-thread, NioProcessor-90, ExpirationReaper-0-DeleteRecords, NioSocketAcceptor-30, kdc%0052eplay%0043ache.data, Controller-0-to-broker-2-send-thread, ThrottledChannelReaper-Produce, Time-limited test-EventThread, ForkJoinPool-1-worker-35, ForkJoinPool-1-worker-3, Statistics Thread-d5be7754-8426-4bf4-9c54-6c7d79628f64-1, Controller-0-to-broker-0-send-thread, kafka-scheduler-0, ProcessThread(sid:0 cport:36628):, change%0050wd%0052eplay%0043ache.data, Controller-0-to-broker-1-send-thread, ExpirationReaper-0-Fetch, Finalizer, /0:0:0:0:0:0:0:1:46872 to /0:0:0:0:0:0:0:1:35588 workers Thread 2, ThrottledChannelReaper-Fetch, /0:0:0:0:0:0:0:1:46872 to /0:0:0:0:0:0:0:1:35588 workers Thread 3, ou=system.data), unexpected=Set(controller-event-thread)
kafka.server.ServerGenerateBrokerIdTest > classMethod STARTED
kafka.server.ServerGenerateBrokerIdTest > classMethod FAILED
java.lang.AssertionError: Found unexpected threads during @AfterClass, allThreads=Set(d5be7754-8426-4bf4-9c54-6c7d79628f64, SessionTracker, Reference Handler, ExpirationReaper-0-Produce, ForkJoinPool-1-worker-57, ForkJoinPool-1-worker-21, ThrottledChannelReaper-Request, Test worker, SyncThread:0, ForkJoinPool-1-worker-53, NIOServerCxn.Factory:/127.0.0.1:0, SensorExpiryThread, group%0043ache.data, ForkJoinPool-1-worker-7, Time-limited test-SendThread(localhost:36628), metrics-meter-tick-thread-1, metrics-meter-tick-thread-2, Signal Dispatcher, main, NioProcessor-89, Time-limited test, controller-event-thread, NioProcessor-90, ExpirationReaper-0-DeleteRecords, NioSocketAcceptor-30, kdc%0052eplay%0043ache.data, Controller-0-to-broker-2-send-thread, ThrottledChannelReaper-Produce, Time-limited test-EventThread, ForkJoinPool-1-worker-35, ForkJoinPool-1-worker-3, Statistics Thread-d5be7754-8426-4bf4-9c54-6c7d79628f64-1, Controller-0-to-broker-0-send-thread, kafka-scheduler-0, ProcessThread(sid:0 cport:36628):, change%0050wd%0052eplay%0043ache.data, Controller-0-to-broker-1-send-thread, ExpirationReaper-0-Fetch, Finalizer, /0:0:0:0:0:0:0:1:46872 to /0:0:0:0:0:0:0:1:35588 workers Thread 2, ThrottledChannelReaper-Fetch, /0:0:0:0:0:0:0:1:46872 to /0:0:0:0:0:0:0:1:35588 workers Thread 3, ou=system.data), unexpected=Set(controller-event-thread)
kafka.server.DeleteTopicsRequestWithDeletionDisabledTest > classMethod STARTED
kafka.server.DeleteTopicsRequestWithDeletionDisabledTest > classMethod FAILED
java.lang.AssertionError: Found unexpected threads during @BeforeClass, allThreads=Set(d5be7754-8426-4bf4-9c54-6c7d79628f64, SessionTracker, Reference Handler, ExpirationReaper-0-Produce, ForkJoinPool-1-worker-57, ForkJoinPool-1-worker-21, ThrottledChannelReaper-Request, Test worker, SyncThread:0, ForkJoinPool-1-worker-53, NIOServerCxn.Factory:/127.0.0.1:0, SensorExpiryThread, group%0043ache.data, ForkJoinPool-1-worker-7, Time-limited test-SendThread(localhost:36628), metrics-meter-tick-thread-1, metrics-meter-tick-thread-2, Signal Dispatcher, main, NioProcessor-89, Time-limited test, controller-event-thread, NioProcessor-90, ExpirationReaper-0-DeleteRecords, NioSocketAcceptor-30, kdc%0052eplay%0043ache.data, Controller-0-to-broker-2-send-thread, ThrottledChannelReaper-Produce, Time-limited test-EventThread, ForkJoinPool-1-worker-35, ForkJoinPool-1-worker-3, Statistics Thread-d5be7754-8426-4bf4-9c54-6c7d79628f64-1, Controller-0-to-broker-0-send-thread, kafka-scheduler-0, ProcessThread(sid:0 cport:36628):, change%0050wd%0052eplay%0043ache.data, Controller-0-to-broker-1-send-thread, ExpirationReaper-0-Fetch, Finalizer, /0:0:0:0:0:0:0:1:46872 to /0:0:0:0:0:0:0:1:35588 workers Thread 2, ThrottledChannelReaper-Fetch, /0:0:0:0:0:0:0:1:46872 to /0:0:0:0:0:0:0:1:35588 workers Thread 3, ou=system.data), unexpected=Set(controller-event-thread)
kafka.server.DeleteTopicsRequestWithDeletionDisabledTest > classMethod STARTED
kafka.server.DeleteTopicsRequestWithDeletionDisabledTest > classMethod FAILED
java.lang.AssertionError: Found unexpected threads during @AfterClass, allThreads=Set(d5be7754-8426-4bf4-9c54-6c7d79628f64, SessionTracker, Reference Handler, ExpirationReaper-0-Produce, ForkJoinPool-1-worker-57, ForkJoinPool-1-worker-21, ThrottledChannelReaper-Request, Test worker, SyncThread:0, ForkJoinPool-1-worker-53, NIOServerCxn.Factory:/127.0.0.1:0, SensorExpiryThread, group%0043ache.data, ForkJoinPool-1-worker-7, Time-limited test-SendThread(localhost:36628), metrics-meter-tick-thread-1, metrics-meter-tick-thread-2, Signal Dispatcher, main, NioProcessor-89, Time-limited test, controller-event-thread, NioProcessor-90, ExpirationReaper-0-DeleteRecords, NioSocketAcceptor-30, kdc%0052eplay%0043ache.data, Controller-0-to-broker-2-send-thread, ThrottledChannelReaper-Produce, Time-limited test-EventThread, ForkJoinPool-1-worker-35, ForkJoinPool-1-worker-3, Statistics Thread-d5be7754-8426-4bf4-9c54-6c7d79628f64-1, Controller-0-to-broker-0-send-thread, kafka-scheduler-0, ProcessThread(sid:0 cport:36628):, change%0050wd%0052eplay%0043ache.data, Controller-0-to-broker-1-send-thread, ExpirationReaper-0-Fetch, Finalizer, /0:0:0:0:0:0:0:1:46872 to /0:0:0:0:0:0:0:1:35588 workers Thread 2, ThrottledChannelReaper-Fetch, /0:0:0:0:0:0:0:1:46872 to /0:0:0:0:0:0:0:1:35588 workers Thread 3, ou=system.data), unexpected=Set(controller-event-thread)
kafka.server.ServerShutdownTest > classMethod STARTED
kafka.server.ServerShutdownTest > classMethod FAILED
java.lang.AssertionError: Found unexpected threads during @BeforeClass, allThreads=Set(d5be7754-8426-4bf4-9c54-6c7d79628f64, SessionTracker, Reference Handler, ExpirationReaper-0-Produce, ForkJoinPool-1-worker-57, ForkJoinPool-1-worker-21, ThrottledChannelReaper-Request, Test worker, SyncThread:0, ForkJoinPool-1-worker-53, NIOServerCxn.Factory:/127.0.0.1:0, SensorExpiryThread, group%0043ache.data, ForkJoinPool-1-worker-7, Time-limited test-SendThread(localhost:36628), metrics-meter-tick-thread-1, metrics-meter-tick-thread-2, Signal Dispatcher, main, NioProcessor-89, Time-limited test, controller-event-thread, NioProcessor-90, ExpirationReaper-0-DeleteRecords, NioSocketAcceptor-30, kdc%0052eplay%0043ache.data, Controller-0-to-broker-2-send-thread, ThrottledChannelReaper-Produce, Time-limited test-EventThread, ForkJoinPool-1-worker-35, ForkJoinPool-1-worker-3, Statistics Thread-d5be7754-8426-4bf4-9c54-6c7d79628f64-1, Controller-0-to-broker-0-send-thread, kafka-scheduler-0, ProcessThread(sid:0 cport:36628):, change%0050wd%0052eplay%0043ache.data, Controller-0-to-broker-1-send-thread, ExpirationReaper-0-Fetch, Finalizer, /0:0:0:0:0:0:0:1:46872 to /0:0:0:0:0:0:0:1:35588 workers Thread 2, ThrottledChannelReaper-Fetch, /0:0:0:0:0:0:0:1:46872 to /0:0:0:0:0:0:0:1:35588 workers Thread 3, ou=system.data), unexpected=Set(controller-event-thread)
kafka.server.ServerShutdownTest > classMethod STARTED
kafka.server.ServerShutdownTest > classMethod FAILED
java.lang.AssertionError: Found unexpected threads during @AfterClass, allThreads=Set(d5be7754-8426-4bf4-9c54-6c7d79628f64, SessionTracker, Reference Handler, ExpirationReaper-0-Produce, ForkJoinPool-1-worker-57, ForkJoinPool-1-worker-21, ThrottledChannelReaper-Request, Test worker, SyncThread:0, ForkJoinPool-1-worker-53, NIOServerCxn.Factory:/127.0.0.1:0, SensorExpiryThread, group%0043ache.data, ForkJoinPool-1-worker-7, Time-limited test-SendThread(localhost:36628), metrics-meter-tick-thread-1, metrics-meter-tick-thread-2, Signal Dispatcher, main, NioProcessor-89, Time-limited test, controller-event-thread, NioProcessor-90, ExpirationReaper-0-DeleteRecords, NioSocketAcceptor-30, kdc%0052eplay%0043ache.data, Controller-0-to-broker-2-send-thread, ThrottledChannelReaper-Produce, Time-limited test-EventThread, ForkJoinPool-1-worker-35, ForkJoinPool-1-worker-3, Statistics Thread-d5be7754-8426-4bf4-9c54-6c7d79628f64-1, Controller-0-to-broker-0-send-thread, kafka-scheduler-0, ProcessThread(sid:0 cport:36628):, change%0050wd%0052eplay%0043ache.data, Controller-0-to-broker-1-send-thread, ExpirationReaper-0-Fetch, Finalizer, /0:0:0:0:0:0:0:1:46872 to /0:0:0:0:0:0:0:1:35588 workers Thread 2, ThrottledChannelReaper-Fetch, /0:0:0:0:0:0:0:1:46872 to /0:0:0:0:0:0:0:1:35588 workers Thread 3, ou=system.data), unexpected=Set(controller-event-thread)
unit.kafka.utils.ThrottlerTest > testThrottleDesiredRate STARTED
unit.kafka.utils.ThrottlerTest > testThrottleDesiredRate PASSED
1550 tests completed, 200 failed, 2 skipped
> Task :kafka-2.1-jdk8:core:test FAILED
> Task :testScala_2_11 FAILED
FAILURE: Build failed with an exception.
* What went wrong:
Execution failed for task ':kafka-2.1-jdk8:core:test'.
> There were failing tests. See the report at: file://<https://builds.apache.org/job/kafka-2.1-jdk8/ws/core/build/reports/tests/test/index.html>
* Try:
Run with --stacktrace option to get the stack trace. Run with --info or --debug option to get more log output. Run with --scan to get full insights.
* Get more help at https://help.gradle.org
BUILD FAILED in 1h 26m 46s
26 actionable tasks: 9 executed, 17 up-to-date
Build step 'Execute shell' marked build as failure
[FINDBUGS] Collecting findbugs analysis files...
Setting GRADLE_4_8_1_HOME=/home/jenkins/tools/gradle/4.8.1
[FINDBUGS] Searching for all files in <https://builds.apache.org/job/kafka-2.1-jdk8/ws/> that match the pattern **/build/reports/findbugs/*.xml
[FINDBUGS] No files found. Configuration error?
Setting GRADLE_4_8_1_HOME=/home/jenkins/tools/gradle/4.8.1
Setting GRADLE_4_8_1_HOME=/home/jenkins/tools/gradle/4.8.1
<Git Blamer> Using GitBlamer to create author and commit information for all warnings.
<Git Blamer> GIT_COMMIT=672cc578ef0407ff0fe0ae3a8ed33a4d9683635e, workspace=<https://builds.apache.org/job/kafka-2.1-jdk8/ws/>
[FINDBUGS] Computing warning deltas based on reference build #96
Recording test results
Setting GRADLE_4_8_1_HOME=/home/jenkins/tools/gradle/4.8.1
Setting GRADLE_4_8_1_HOME=/home/jenkins/tools/gradle/4.8.1
Not sending mail to unregistered user wangguoz@gmail.com
Not sending mail to unregistered user manikumar.reddy@gmail.com
Jenkins build is back to normal : kafka-2.1-jdk8 #116
Posted by Apache Jenkins Server <je...@builds.apache.org>.
See <https://builds.apache.org/job/kafka-2.1-jdk8/116/display/redirect?page=changes>
Build failed in Jenkins: kafka-2.1-jdk8 #115
Posted by Apache Jenkins Server <je...@builds.apache.org>.
See <https://builds.apache.org/job/kafka-2.1-jdk8/115/display/redirect?page=changes>
Changes:
[jason] KAFKA-7692; Fix ProducerStateManager SequenceNumber overflow (#5990)
[jason] KAFKA-7693; Fix SequenceNumber overflow in producer (#5989)
------------------------------------------
[...truncated 1.63 MB...]
org.apache.kafka.connect.runtime.rest.resources.ConnectorsResourceTest > testPutConnectorConfigWithControlSequenceInName STARTED
org.apache.kafka.connect.runtime.rest.resources.ConnectorsResourceTest > testPutConnectorConfigWithControlSequenceInName PASSED
org.apache.kafka.connect.runtime.rest.resources.ConnectorsResourceTest > testPutConnectorConfigNameMismatch STARTED
org.apache.kafka.connect.runtime.rest.resources.ConnectorsResourceTest > testPutConnectorConfigNameMismatch PASSED
org.apache.kafka.connect.runtime.rest.resources.ConnectorsResourceTest > testCreateConnectorConfigNameMismatch STARTED
org.apache.kafka.connect.runtime.rest.resources.ConnectorsResourceTest > testCreateConnectorConfigNameMismatch PASSED
org.apache.kafka.connect.runtime.rest.resources.ConnectorsResourceTest > testGetConnectorTaskConfigs STARTED
org.apache.kafka.connect.runtime.rest.resources.ConnectorsResourceTest > testGetConnectorTaskConfigs PASSED
org.apache.kafka.connect.runtime.rest.resources.ConnectorsResourceTest > testRestartConnectorLeaderRedirect STARTED
org.apache.kafka.connect.runtime.rest.resources.ConnectorsResourceTest > testRestartConnectorLeaderRedirect PASSED
org.apache.kafka.connect.runtime.rest.resources.ConnectorsResourceTest > testRestartConnectorOwnerRedirect STARTED
org.apache.kafka.connect.runtime.rest.resources.ConnectorsResourceTest > testRestartConnectorOwnerRedirect PASSED
org.apache.kafka.connect.runtime.rest.resources.ConnectorsResourceTest > testRestartTaskNotFound STARTED
org.apache.kafka.connect.runtime.rest.resources.ConnectorsResourceTest > testRestartTaskNotFound PASSED
org.apache.kafka.connect.runtime.rest.resources.ConnectorsResourceTest > testRestartTaskLeaderRedirect STARTED
org.apache.kafka.connect.runtime.rest.resources.ConnectorsResourceTest > testRestartTaskLeaderRedirect PASSED
org.apache.kafka.connect.runtime.rest.resources.ConnectorsResourceTest > testRestartTaskOwnerRedirect STARTED
org.apache.kafka.connect.runtime.rest.resources.ConnectorsResourceTest > testRestartTaskOwnerRedirect PASSED
org.apache.kafka.connect.runtime.rest.resources.ConnectorsResourceTest > testListConnectorsNotLeader STARTED
org.apache.kafka.connect.runtime.rest.resources.ConnectorsResourceTest > testListConnectorsNotLeader PASSED
org.apache.kafka.connect.runtime.rest.resources.ConnectorsResourceTest > testCreateConnector STARTED
org.apache.kafka.connect.runtime.rest.resources.ConnectorsResourceTest > testCreateConnector PASSED
org.apache.kafka.connect.runtime.rest.resources.RootResourceTest > testRootGet STARTED
org.apache.kafka.connect.runtime.rest.resources.RootResourceTest > testRootGet PASSED
org.apache.kafka.connect.runtime.isolation.DelegatingClassLoaderTest > testWhiteListedManifestResources STARTED
org.apache.kafka.connect.runtime.isolation.DelegatingClassLoaderTest > testWhiteListedManifestResources PASSED
org.apache.kafka.connect.runtime.isolation.DelegatingClassLoaderTest > testOtherResources STARTED
org.apache.kafka.connect.runtime.isolation.DelegatingClassLoaderTest > testOtherResources PASSED
org.apache.kafka.connect.runtime.isolation.PluginDescTest > testPluginDescWithNullVersion STARTED
org.apache.kafka.connect.runtime.isolation.PluginDescTest > testPluginDescWithNullVersion PASSED
org.apache.kafka.connect.runtime.isolation.PluginDescTest > testPluginDescComparison STARTED
org.apache.kafka.connect.runtime.isolation.PluginDescTest > testPluginDescComparison PASSED
org.apache.kafka.connect.runtime.isolation.PluginDescTest > testRegularPluginDesc STARTED
org.apache.kafka.connect.runtime.isolation.PluginDescTest > testRegularPluginDesc PASSED
org.apache.kafka.connect.runtime.isolation.PluginDescTest > testPluginDescEquality STARTED
org.apache.kafka.connect.runtime.isolation.PluginDescTest > testPluginDescEquality PASSED
org.apache.kafka.connect.runtime.isolation.PluginDescTest > testPluginDescWithSystemClassLoader STARTED
org.apache.kafka.connect.runtime.isolation.PluginDescTest > testPluginDescWithSystemClassLoader PASSED
org.apache.kafka.connect.runtime.isolation.PluginsTest > shouldInstantiateAndConfigureConnectRestExtension STARTED
org.apache.kafka.connect.runtime.isolation.PluginsTest > shouldInstantiateAndConfigureConnectRestExtension PASSED
org.apache.kafka.connect.runtime.isolation.PluginsTest > shouldInstantiateAndConfigureConverters STARTED
org.apache.kafka.connect.runtime.isolation.PluginsTest > shouldInstantiateAndConfigureConverters PASSED
org.apache.kafka.connect.runtime.isolation.PluginsTest > shouldInstantiateAndConfigureInternalConverters STARTED
org.apache.kafka.connect.runtime.isolation.PluginsTest > shouldInstantiateAndConfigureInternalConverters PASSED
org.apache.kafka.connect.runtime.isolation.PluginsTest > shouldInstantiateAndConfigureDefaultHeaderConverter STARTED
org.apache.kafka.connect.runtime.isolation.PluginsTest > shouldInstantiateAndConfigureDefaultHeaderConverter PASSED
org.apache.kafka.connect.runtime.isolation.PluginsTest > shouldInstantiateAndConfigureExplicitlySetHeaderConverterWithCurrentClassLoader STARTED
org.apache.kafka.connect.runtime.isolation.PluginsTest > shouldInstantiateAndConfigureExplicitlySetHeaderConverterWithCurrentClassLoader PASSED
org.apache.kafka.connect.runtime.isolation.PluginUtilsTest > testPluginUrlsWithRelativeSymlinkForwards STARTED
org.apache.kafka.connect.runtime.isolation.PluginUtilsTest > testPluginUrlsWithRelativeSymlinkForwards PASSED
org.apache.kafka.connect.runtime.isolation.PluginUtilsTest > testOrderOfPluginUrlsWithJars STARTED
org.apache.kafka.connect.runtime.isolation.PluginUtilsTest > testOrderOfPluginUrlsWithJars PASSED
org.apache.kafka.connect.runtime.isolation.PluginUtilsTest > testPluginUrlsWithClasses STARTED
org.apache.kafka.connect.runtime.isolation.PluginUtilsTest > testPluginUrlsWithClasses PASSED
org.apache.kafka.connect.runtime.isolation.PluginUtilsTest > testConnectFrameworkClasses STARTED
org.apache.kafka.connect.runtime.isolation.PluginUtilsTest > testConnectFrameworkClasses PASSED
org.apache.kafka.connect.runtime.isolation.PluginUtilsTest > testThirdPartyClasses STARTED
org.apache.kafka.connect.runtime.isolation.PluginUtilsTest > testThirdPartyClasses PASSED
org.apache.kafka.connect.runtime.isolation.PluginUtilsTest > testClientConfigProvider STARTED
org.apache.kafka.connect.runtime.isolation.PluginUtilsTest > testClientConfigProvider PASSED
org.apache.kafka.connect.runtime.isolation.PluginUtilsTest > testAllowedConnectFrameworkClasses STARTED
org.apache.kafka.connect.runtime.isolation.PluginUtilsTest > testAllowedConnectFrameworkClasses PASSED
org.apache.kafka.connect.runtime.isolation.PluginUtilsTest > testJavaLibraryClasses STARTED
org.apache.kafka.connect.runtime.isolation.PluginUtilsTest > testJavaLibraryClasses PASSED
org.apache.kafka.connect.runtime.isolation.PluginUtilsTest > testEmptyPluginUrls STARTED
org.apache.kafka.connect.runtime.isolation.PluginUtilsTest > testEmptyPluginUrls PASSED
org.apache.kafka.connect.runtime.isolation.PluginUtilsTest > testPluginUrlsWithJars STARTED
org.apache.kafka.connect.runtime.isolation.PluginUtilsTest > testPluginUrlsWithJars PASSED
org.apache.kafka.connect.runtime.isolation.PluginUtilsTest > testPluginUrlsWithZips STARTED
org.apache.kafka.connect.runtime.isolation.PluginUtilsTest > testPluginUrlsWithZips PASSED
org.apache.kafka.connect.runtime.isolation.PluginUtilsTest > testPluginUrlsWithRelativeSymlinkBackwards STARTED
org.apache.kafka.connect.runtime.isolation.PluginUtilsTest > testPluginUrlsWithRelativeSymlinkBackwards PASSED
org.apache.kafka.connect.runtime.isolation.PluginUtilsTest > testPluginUrlsWithAbsoluteSymlink STARTED
org.apache.kafka.connect.runtime.isolation.PluginUtilsTest > testPluginUrlsWithAbsoluteSymlink PASSED
org.apache.kafka.connect.runtime.isolation.PluginUtilsTest > testEmptyStructurePluginUrls STARTED
org.apache.kafka.connect.runtime.isolation.PluginUtilsTest > testEmptyStructurePluginUrls PASSED
org.apache.kafka.connect.runtime.WorkerSinkTaskTest > testErrorInRebalancePartitionRevocation STARTED
org.apache.kafka.connect.runtime.WorkerSinkTaskTest > testErrorInRebalancePartitionRevocation PASSED
org.apache.kafka.connect.runtime.WorkerSinkTaskTest > testErrorInRebalancePartitionAssignment STARTED
org.apache.kafka.connect.runtime.WorkerSinkTaskTest > testErrorInRebalancePartitionAssignment PASSED
org.apache.kafka.connect.runtime.WorkerSinkTaskTest > testWakeupInCommitSyncCausesRetry STARTED
org.apache.kafka.connect.runtime.WorkerSinkTaskTest > testWakeupInCommitSyncCausesRetry PASSED
org.apache.kafka.connect.runtime.WorkerSinkTaskTest > testRequestCommit STARTED
org.apache.kafka.connect.runtime.WorkerSinkTaskTest > testRequestCommit PASSED
org.apache.kafka.connect.runtime.WorkerSinkTaskTest > testIgnoredCommit STARTED
org.apache.kafka.connect.runtime.WorkerSinkTaskTest > testIgnoredCommit PASSED
org.apache.kafka.connect.runtime.WorkerSinkTaskTest > testLongRunningCommitWithoutTimeout STARTED
org.apache.kafka.connect.runtime.WorkerSinkTaskTest > testLongRunningCommitWithoutTimeout PASSED
org.apache.kafka.connect.runtime.WorkerSinkTaskTest > testCommitWithOutOfOrderCallback STARTED
org.apache.kafka.connect.runtime.WorkerSinkTaskTest > testCommitWithOutOfOrderCallback PASSED
org.apache.kafka.connect.runtime.WorkerSinkTaskTest > testPreCommit STARTED
org.apache.kafka.connect.runtime.WorkerSinkTaskTest > testPreCommit PASSED
org.apache.kafka.connect.runtime.WorkerSinkTaskTest > testPollRedelivery STARTED
org.apache.kafka.connect.runtime.WorkerSinkTaskTest > testPollRedelivery PASSED
org.apache.kafka.connect.runtime.WorkerSinkTaskTest > testMetricsGroup STARTED
org.apache.kafka.connect.runtime.WorkerSinkTaskTest > testMetricsGroup PASSED
org.apache.kafka.connect.runtime.WorkerSinkTaskTest > testDeliveryWithMutatingTransform STARTED
org.apache.kafka.connect.runtime.WorkerSinkTaskTest > testDeliveryWithMutatingTransform PASSED
org.apache.kafka.connect.runtime.WorkerSinkTaskTest > testMissingTimestampPropagation STARTED
org.apache.kafka.connect.runtime.WorkerSinkTaskTest > testMissingTimestampPropagation PASSED
org.apache.kafka.connect.runtime.WorkerSinkTaskTest > testTimestampPropagation STARTED
org.apache.kafka.connect.runtime.WorkerSinkTaskTest > testTimestampPropagation PASSED
org.apache.kafka.connect.runtime.WorkerSinkTaskTest > testTopicsRegex STARTED
org.apache.kafka.connect.runtime.WorkerSinkTaskTest > testTopicsRegex PASSED
org.apache.kafka.connect.runtime.WorkerSinkTaskTest > testStartPaused STARTED
org.apache.kafka.connect.runtime.WorkerSinkTaskTest > testStartPaused PASSED
org.apache.kafka.connect.runtime.WorkerSinkTaskTest > testPause STARTED
org.apache.kafka.connect.runtime.WorkerSinkTaskTest > testPause PASSED
380 tests completed, 1 failed
> Task :connect:runtime:test FAILED
FAILURE: Build failed with an exception.
* What went wrong:
Execution failed for task ':connect:runtime:test'.
> There were failing tests. See the report at: file://<https://builds.apache.org/job/kafka-2.1-jdk8/ws/connect/runtime/build/reports/tests/test/index.html>
* Try:
Run with --stacktrace option to get the stack trace. Run with --info or --debug option to get more log output. Run with --scan to get full insights.
* Get more help at https://help.gradle.org
BUILD FAILED in 4h 32m 21s
133 actionable tasks: 97 executed, 36 up-to-date
Build step 'Execute shell' marked build as failure
[FINDBUGS] Collecting findbugs analysis files...
Setting GRADLE_4_8_1_HOME=/home/jenkins/tools/gradle/4.8.1
[FINDBUGS] Searching for all files in <https://builds.apache.org/job/kafka-2.1-jdk8/ws/> that match the pattern **/build/reports/findbugs/*.xml
[FINDBUGS] No files found. Configuration error?
Setting GRADLE_4_8_1_HOME=/home/jenkins/tools/gradle/4.8.1
Setting GRADLE_4_8_1_HOME=/home/jenkins/tools/gradle/4.8.1
<Git Blamer> Using GitBlamer to create author and commit information for all warnings.
<Git Blamer> GIT_COMMIT=85b7d0e6b1d20dff7dfdfd77432c287c929bfccf, workspace=<https://builds.apache.org/job/kafka-2.1-jdk8/ws/>
[FINDBUGS] Computing warning deltas based on reference build #96
Recording test results
Setting GRADLE_4_8_1_HOME=/home/jenkins/tools/gradle/4.8.1
Setting GRADLE_4_8_1_HOME=/home/jenkins/tools/gradle/4.8.1
Not sending mail to unregistered user ismael@juma.me.uk
Not sending mail to unregistered user manikumar.reddy@gmail.com
Not sending mail to unregistered user wangguoz@gmail.com
Build failed in Jenkins: kafka-2.1-jdk8 #114
Posted by Apache Jenkins Server <je...@builds.apache.org>.
See <https://builds.apache.org/job/kafka-2.1-jdk8/114/display/redirect?page=changes>
Changes:
[cmccabe] MINOR: update copyright year in the NOTICE file. (#6196)
------------------------------------------
[...truncated 693.88 KB...]
kafka.api.PlaintextProducerSendTest > testSendWithInvalidCreateTime PASSED
kafka.api.PlaintextProducerSendTest > testBatchSizeZero STARTED
kafka.api.PlaintextProducerSendTest > testBatchSizeZero PASSED
kafka.api.PlaintextProducerSendTest > testWrongSerializer STARTED
kafka.api.PlaintextProducerSendTest > testWrongSerializer PASSED
kafka.api.PlaintextProducerSendTest > testSendNonCompressedMessageWithLogAppendTime STARTED
kafka.api.PlaintextProducerSendTest > testSendNonCompressedMessageWithLogAppendTime PASSED
kafka.api.PlaintextProducerSendTest > testSendNonCompressedMessageWithCreateTime STARTED
kafka.api.PlaintextProducerSendTest > testSendNonCompressedMessageWithCreateTime PASSED
kafka.api.PlaintextProducerSendTest > testClose STARTED
kafka.api.PlaintextProducerSendTest > testClose PASSED
kafka.api.PlaintextProducerSendTest > testFlush STARTED
kafka.api.PlaintextProducerSendTest > testFlush PASSED
kafka.api.PlaintextProducerSendTest > testSendToPartition STARTED
kafka.api.PlaintextProducerSendTest > testSendToPartition PASSED
kafka.api.PlaintextProducerSendTest > testSendOffset STARTED
kafka.api.PlaintextProducerSendTest > testSendOffset PASSED
kafka.api.PlaintextProducerSendTest > testSendCompressedMessageWithCreateTime STARTED
kafka.api.PlaintextProducerSendTest > testSendCompressedMessageWithCreateTime PASSED
kafka.api.PlaintextProducerSendTest > testCloseWithZeroTimeoutFromCallerThread STARTED
kafka.api.PlaintextProducerSendTest > testCloseWithZeroTimeoutFromCallerThread PASSED
kafka.api.PlaintextProducerSendTest > testCloseWithZeroTimeoutFromSenderThread STARTED
kafka.api.PlaintextProducerSendTest > testCloseWithZeroTimeoutFromSenderThread PASSED
kafka.api.PlaintextProducerSendTest > testSendBeforeAndAfterPartitionExpansion STARTED
kafka.api.PlaintextProducerSendTest > testSendBeforeAndAfterPartitionExpansion PASSED
kafka.api.TransactionsBounceTest > testBrokerFailure STARTED
kafka.api.TransactionsBounceTest > testBrokerFailure PASSED
kafka.api.ApiUtilsTest > testShortStringNonASCII STARTED
kafka.api.ApiUtilsTest > testShortStringNonASCII PASSED
kafka.api.ApiUtilsTest > testShortStringASCII STARTED
kafka.api.ApiUtilsTest > testShortStringASCII PASSED
kafka.api.LegacyAdminClientTest > testDescribeConsumerGroup STARTED
kafka.api.LegacyAdminClientTest > testDescribeConsumerGroup PASSED
kafka.api.LegacyAdminClientTest > testListGroups STARTED
kafka.api.LegacyAdminClientTest > testListGroups PASSED
kafka.api.LegacyAdminClientTest > testListAllBrokerVersionInfo STARTED
kafka.api.LegacyAdminClientTest > testListAllBrokerVersionInfo PASSED
kafka.api.LegacyAdminClientTest > testOffsetsForTimesWhenOffsetNotFound STARTED
kafka.api.LegacyAdminClientTest > testOffsetsForTimesWhenOffsetNotFound PASSED
kafka.api.LegacyAdminClientTest > testDescribeConsumerGroupForNonExistentGroup STARTED
kafka.api.LegacyAdminClientTest > testDescribeConsumerGroupForNonExistentGroup PASSED
kafka.api.LegacyAdminClientTest > testGetConsumerGroupSummary STARTED
kafka.api.LegacyAdminClientTest > testGetConsumerGroupSummary PASSED
kafka.api.AdminClientIntegrationTest > testDescribeReplicaLogDirs STARTED
kafka.api.AdminClientIntegrationTest > testDescribeReplicaLogDirs PASSED
kafka.api.AdminClientIntegrationTest > testInvalidAlterConfigs STARTED
kafka.api.AdminClientIntegrationTest > testInvalidAlterConfigs PASSED
kafka.api.AdminClientIntegrationTest > testAlterLogDirsAfterDeleteRecords STARTED
kafka.api.AdminClientIntegrationTest > testAlterLogDirsAfterDeleteRecords PASSED
kafka.api.AdminClientIntegrationTest > testConsumeAfterDeleteRecords STARTED
kafka.api.AdminClientIntegrationTest > testConsumeAfterDeleteRecords PASSED
kafka.api.AdminClientIntegrationTest > testClose STARTED
kafka.api.AdminClientIntegrationTest > testClose PASSED
kafka.api.AdminClientIntegrationTest > testReplicaCanFetchFromLogStartOffsetAfterDeleteRecords STARTED
kafka.api.AdminClientIntegrationTest > testReplicaCanFetchFromLogStartOffsetAfterDeleteRecords PASSED
kafka.api.AdminClientIntegrationTest > testMinimumRequestTimeouts STARTED
kafka.api.AdminClientIntegrationTest > testMinimumRequestTimeouts PASSED
kafka.api.AdminClientIntegrationTest > testForceClose STARTED
kafka.api.AdminClientIntegrationTest > testForceClose PASSED
kafka.api.AdminClientIntegrationTest > testListNodes STARTED
kafka.api.AdminClientIntegrationTest > testListNodes PASSED
kafka.api.AdminClientIntegrationTest > testDelayedClose STARTED
kafka.api.AdminClientIntegrationTest > testDelayedClose PASSED
kafka.api.AdminClientIntegrationTest > testCreateDeleteTopics STARTED
kafka.api.AdminClientIntegrationTest > testCreateDeleteTopics PASSED
kafka.api.AdminClientIntegrationTest > testOffsetsForTimesAfterDeleteRecords STARTED
kafka.api.AdminClientIntegrationTest > testOffsetsForTimesAfterDeleteRecords PASSED
kafka.api.AdminClientIntegrationTest > testDeleteRecordsWithException STARTED
kafka.api.AdminClientIntegrationTest > testDeleteRecordsWithException PASSED
kafka.api.AdminClientIntegrationTest > testDescribeLogDirs STARTED
kafka.api.AdminClientIntegrationTest > testDescribeLogDirs PASSED
kafka.api.AdminClientIntegrationTest > testAlterReplicaLogDirs STARTED
kafka.api.AdminClientIntegrationTest > testAlterReplicaLogDirs PASSED
kafka.api.AdminClientIntegrationTest > testLogStartOffsetCheckpoint STARTED
kafka.api.AdminClientIntegrationTest > testLogStartOffsetCheckpoint PASSED
kafka.api.AdminClientIntegrationTest > testAclOperations STARTED
kafka.api.AdminClientIntegrationTest > testAclOperations PASSED
kafka.api.AdminClientIntegrationTest > testDescribeCluster STARTED
kafka.api.AdminClientIntegrationTest > testDescribeCluster PASSED
kafka.api.AdminClientIntegrationTest > testCreatePartitions STARTED
kafka.api.AdminClientIntegrationTest > testCreatePartitions PASSED
kafka.api.AdminClientIntegrationTest > testDescribeNonExistingTopic STARTED
kafka.api.AdminClientIntegrationTest > testDescribeNonExistingTopic PASSED
kafka.api.AdminClientIntegrationTest > testMetadataRefresh STARTED
kafka.api.AdminClientIntegrationTest > testMetadataRefresh PASSED
kafka.api.AdminClientIntegrationTest > testDescribeAndAlterConfigs STARTED
kafka.api.AdminClientIntegrationTest > testDescribeAndAlterConfigs PASSED
kafka.api.AdminClientIntegrationTest > testLogStartOffsetAfterDeleteRecords STARTED
kafka.api.AdminClientIntegrationTest > testLogStartOffsetAfterDeleteRecords PASSED
kafka.api.AdminClientIntegrationTest > testSeekAfterDeleteRecords STARTED
kafka.api.AdminClientIntegrationTest > testSeekAfterDeleteRecords PASSED
kafka.api.AdminClientIntegrationTest > testCallInFlightTimeouts STARTED
kafka.api.AdminClientIntegrationTest > testCallInFlightTimeouts PASSED
kafka.api.AdminClientIntegrationTest > testDescribeConfigsForTopic STARTED
kafka.api.AdminClientIntegrationTest > testDescribeConfigsForTopic PASSED
kafka.api.AdminClientIntegrationTest > testConsumerGroups STARTED
kafka.api.AdminClientIntegrationTest > testConsumerGroups PASSED
kafka.api.SaslPlaintextConsumerTest > testCoordinatorFailover STARTED
kafka.api.SaslPlaintextConsumerTest > testCoordinatorFailover PASSED
kafka.api.SaslPlaintextConsumerTest > testSimpleConsumption STARTED
kafka.api.SaslPlaintextConsumerTest > testSimpleConsumption PASSED
kafka.api.TransactionsTest > testBasicTransactions STARTED
ERROR: Could not install GRADLE_4_8_1_HOME
java.lang.NullPointerException
ERROR: Could not install GRADLE_4_8_1_HOME
java.lang.NullPointerException
ERROR: Could not install GRADLE_4_8_1_HOME
java.lang.NullPointerException
ERROR: Could not install GRADLE_4_8_1_HOME
java.lang.NullPointerException
Build timed out (after 360 minutes). Marking the build as failed.
Build was aborted
[FINDBUGS] Collecting findbugs analysis files...
Setting GRADLE_4_8_1_HOME=/home/jenkins/tools/gradle/4.8.1
[FINDBUGS] Searching for all files in <https://builds.apache.org/job/kafka-2.1-jdk8/ws/> that match the pattern **/build/reports/findbugs/*.xml
[FINDBUGS] No files found. Configuration error?
Setting GRADLE_4_8_1_HOME=/home/jenkins/tools/gradle/4.8.1
Setting GRADLE_4_8_1_HOME=/home/jenkins/tools/gradle/4.8.1
<Git Blamer> Using GitBlamer to create author and commit information for all warnings.
<Git Blamer> GIT_COMMIT=33cda6798e95f8ae59bf67e08f161af67f59e867, workspace=<https://builds.apache.org/job/kafka-2.1-jdk8/ws/>
[FINDBUGS] Computing warning deltas based on reference build #96
Recording test results
Setting GRADLE_4_8_1_HOME=/home/jenkins/tools/gradle/4.8.1
Setting GRADLE_4_8_1_HOME=/home/jenkins/tools/gradle/4.8.1
kafka.api.TransactionsTest > testBasicTransactions SKIPPED
> Task :kafka-2.1-jdk8:core:test FAILED
> Task :testScala_2_12 FAILED
FAILURE: Build failed with an exception.
* What went wrong:
Execution failed for task ':kafka-2.1-jdk8:core:test'.
> Process 'Gradle Test Executor 7' finished with non-zero exit value 143
This problem might be caused by incorrect test process configuration.
Please refer to the test execution section in the user guide at https://docs.gradle.org/4.10.3/userguide/java_plugin.html#sec:test_execution
* Try:
Run with --stacktrace option to get the stack trace. Run with --info or --debug option to get more log output. Run with --scan to get full insights.
* Get more help at https://help.gradle.org
BUILD FAILED in 5h 59m 45s
27 actionable tasks: 10 executed, 17 up-to-date
Not sending mail to unregistered user ismael@juma.me.uk
Not sending mail to unregistered user manikumar.reddy@gmail.com
Not sending mail to unregistered user wangguoz@gmail.com
Build failed in Jenkins: kafka-2.1-jdk8 #113
Posted by Apache Jenkins Server <je...@builds.apache.org>.
See <https://builds.apache.org/job/kafka-2.1-jdk8/113/display/redirect?page=changes>
Changes:
[me] KAFKA-5117: Stop resolving externalized configs in Connect REST API
------------------------------------------
[...truncated 2.84 MB...]
org.apache.kafka.connect.runtime.standalone.StandaloneHerderTest > testRestartTask STARTED
org.apache.kafka.connect.runtime.standalone.StandaloneHerderTest > testRestartTask PASSED
org.apache.kafka.connect.runtime.standalone.StandaloneHerderTest > testAccessors STARTED
org.apache.kafka.connect.runtime.standalone.StandaloneHerderTest > testAccessors PASSED
org.apache.kafka.connect.runtime.standalone.StandaloneHerderTest > testRestartConnectorFailureOnStart STARTED
org.apache.kafka.connect.runtime.standalone.StandaloneHerderTest > testRestartConnectorFailureOnStart PASSED
org.apache.kafka.connect.runtime.standalone.StandaloneHerderTest > testCreateAndStop STARTED
org.apache.kafka.connect.runtime.standalone.StandaloneHerderTest > testCreateAndStop PASSED
org.apache.kafka.connect.runtime.standalone.StandaloneHerderTest > testPutConnectorConfig STARTED
org.apache.kafka.connect.runtime.standalone.StandaloneHerderTest > testPutConnectorConfig PASSED
org.apache.kafka.connect.runtime.standalone.StandaloneHerderTest > testPutTaskConfigs STARTED
org.apache.kafka.connect.runtime.standalone.StandaloneHerderTest > testPutTaskConfigs PASSED
org.apache.kafka.connect.runtime.WorkerTest > testStartAndStopConnector STARTED
org.apache.kafka.connect.runtime.WorkerTest > testStartAndStopConnector PASSED
org.apache.kafka.connect.runtime.WorkerTest > testStartConnectorFailure STARTED
org.apache.kafka.connect.runtime.WorkerTest > testStartConnectorFailure PASSED
org.apache.kafka.connect.runtime.WorkerTest > testAddConnectorByAlias STARTED
org.apache.kafka.connect.runtime.WorkerTest > testAddConnectorByAlias PASSED
org.apache.kafka.connect.runtime.WorkerTest > testAddConnectorByShortAlias STARTED
org.apache.kafka.connect.runtime.WorkerTest > testAddConnectorByShortAlias PASSED
org.apache.kafka.connect.runtime.WorkerTest > testStopInvalidConnector STARTED
org.apache.kafka.connect.runtime.WorkerTest > testStopInvalidConnector PASSED
org.apache.kafka.connect.runtime.WorkerTest > testReconfigureConnectorTasks STARTED
org.apache.kafka.connect.runtime.WorkerTest > testReconfigureConnectorTasks PASSED
org.apache.kafka.connect.runtime.WorkerTest > testAddRemoveTask STARTED
org.apache.kafka.connect.runtime.WorkerTest > testAddRemoveTask PASSED
org.apache.kafka.connect.runtime.WorkerTest > testStartTaskFailure STARTED
org.apache.kafka.connect.runtime.WorkerTest > testStartTaskFailure PASSED
org.apache.kafka.connect.runtime.WorkerTest > testCleanupTasksOnStop STARTED
org.apache.kafka.connect.runtime.WorkerTest > testCleanupTasksOnStop PASSED
org.apache.kafka.connect.runtime.WorkerTest > testConverterOverrides STARTED
org.apache.kafka.connect.runtime.WorkerTest > testConverterOverrides PASSED
org.apache.kafka.connect.runtime.isolation.PluginDescTest > testPluginDescWithNullVersion STARTED
org.apache.kafka.connect.runtime.isolation.PluginDescTest > testPluginDescWithNullVersion PASSED
org.apache.kafka.connect.runtime.isolation.PluginDescTest > testPluginDescComparison STARTED
org.apache.kafka.connect.runtime.isolation.PluginDescTest > testPluginDescComparison PASSED
org.apache.kafka.connect.runtime.isolation.PluginDescTest > testRegularPluginDesc STARTED
org.apache.kafka.connect.runtime.isolation.PluginDescTest > testRegularPluginDesc PASSED
org.apache.kafka.connect.runtime.isolation.PluginDescTest > testPluginDescEquality STARTED
org.apache.kafka.connect.runtime.isolation.PluginDescTest > testPluginDescEquality PASSED
org.apache.kafka.connect.runtime.isolation.PluginDescTest > testPluginDescWithSystemClassLoader STARTED
org.apache.kafka.connect.runtime.isolation.PluginDescTest > testPluginDescWithSystemClassLoader PASSED
org.apache.kafka.connect.runtime.isolation.DelegatingClassLoaderTest > testWhiteListedManifestResources STARTED
org.apache.kafka.connect.runtime.isolation.DelegatingClassLoaderTest > testWhiteListedManifestResources PASSED
org.apache.kafka.connect.runtime.isolation.DelegatingClassLoaderTest > testOtherResources STARTED
org.apache.kafka.connect.runtime.isolation.DelegatingClassLoaderTest > testOtherResources PASSED
org.apache.kafka.connect.runtime.isolation.PluginsTest > shouldInstantiateAndConfigureConnectRestExtension STARTED
org.apache.kafka.connect.runtime.isolation.PluginsTest > shouldInstantiateAndConfigureConnectRestExtension PASSED
org.apache.kafka.connect.runtime.isolation.PluginsTest > shouldInstantiateAndConfigureConverters STARTED
org.apache.kafka.connect.runtime.isolation.PluginsTest > shouldInstantiateAndConfigureConverters PASSED
org.apache.kafka.connect.runtime.isolation.PluginsTest > shouldInstantiateAndConfigureInternalConverters STARTED
org.apache.kafka.connect.runtime.isolation.PluginsTest > shouldInstantiateAndConfigureInternalConverters PASSED
org.apache.kafka.connect.runtime.isolation.PluginsTest > shouldInstantiateAndConfigureDefaultHeaderConverter STARTED
org.apache.kafka.connect.runtime.isolation.PluginsTest > shouldInstantiateAndConfigureDefaultHeaderConverter PASSED
org.apache.kafka.connect.runtime.isolation.PluginsTest > shouldInstantiateAndConfigureExplicitlySetHeaderConverterWithCurrentClassLoader STARTED
org.apache.kafka.connect.runtime.isolation.PluginsTest > shouldInstantiateAndConfigureExplicitlySetHeaderConverterWithCurrentClassLoader PASSED
org.apache.kafka.connect.runtime.isolation.PluginUtilsTest > testPluginUrlsWithRelativeSymlinkForwards STARTED
org.apache.kafka.connect.runtime.isolation.PluginUtilsTest > testPluginUrlsWithRelativeSymlinkForwards PASSED
org.apache.kafka.connect.runtime.isolation.PluginUtilsTest > testOrderOfPluginUrlsWithJars STARTED
org.apache.kafka.connect.runtime.isolation.PluginUtilsTest > testOrderOfPluginUrlsWithJars PASSED
org.apache.kafka.connect.runtime.isolation.PluginUtilsTest > testPluginUrlsWithClasses STARTED
org.apache.kafka.connect.runtime.isolation.PluginUtilsTest > testPluginUrlsWithClasses PASSED
org.apache.kafka.connect.runtime.isolation.PluginUtilsTest > testConnectFrameworkClasses STARTED
org.apache.kafka.connect.runtime.isolation.PluginUtilsTest > testConnectFrameworkClasses PASSED
org.apache.kafka.connect.runtime.isolation.PluginUtilsTest > testThirdPartyClasses STARTED
org.apache.kafka.connect.runtime.isolation.PluginUtilsTest > testThirdPartyClasses PASSED
org.apache.kafka.connect.runtime.isolation.PluginUtilsTest > testClientConfigProvider STARTED
org.apache.kafka.connect.runtime.isolation.PluginUtilsTest > testClientConfigProvider PASSED
org.apache.kafka.connect.runtime.isolation.PluginUtilsTest > testAllowedConnectFrameworkClasses STARTED
org.apache.kafka.connect.runtime.isolation.PluginUtilsTest > testAllowedConnectFrameworkClasses PASSED
org.apache.kafka.connect.runtime.isolation.PluginUtilsTest > testJavaLibraryClasses STARTED
org.apache.kafka.connect.runtime.isolation.PluginUtilsTest > testJavaLibraryClasses PASSED
org.apache.kafka.connect.runtime.isolation.PluginUtilsTest > testEmptyPluginUrls STARTED
org.apache.kafka.connect.runtime.isolation.PluginUtilsTest > testEmptyPluginUrls PASSED
org.apache.kafka.connect.runtime.isolation.PluginUtilsTest > testPluginUrlsWithJars STARTED
org.apache.kafka.connect.runtime.isolation.PluginUtilsTest > testPluginUrlsWithJars PASSED
org.apache.kafka.connect.runtime.isolation.PluginUtilsTest > testPluginUrlsWithZips STARTED
org.apache.kafka.connect.runtime.isolation.PluginUtilsTest > testPluginUrlsWithZips PASSED
org.apache.kafka.connect.runtime.isolation.PluginUtilsTest > testPluginUrlsWithRelativeSymlinkBackwards STARTED
org.apache.kafka.connect.runtime.isolation.PluginUtilsTest > testPluginUrlsWithRelativeSymlinkBackwards PASSED
org.apache.kafka.connect.runtime.isolation.PluginUtilsTest > testPluginUrlsWithAbsoluteSymlink STARTED
org.apache.kafka.connect.runtime.isolation.PluginUtilsTest > testPluginUrlsWithAbsoluteSymlink PASSED
org.apache.kafka.connect.runtime.isolation.PluginUtilsTest > testEmptyStructurePluginUrls STARTED
org.apache.kafka.connect.runtime.isolation.PluginUtilsTest > testEmptyStructurePluginUrls PASSED
org.apache.kafka.connect.runtime.TransformationConfigTest > testEmbeddedConfigCast STARTED
org.apache.kafka.connect.runtime.TransformationConfigTest > testEmbeddedConfigCast PASSED
org.apache.kafka.connect.runtime.TransformationConfigTest > testEmbeddedConfigRegexRouter STARTED
org.apache.kafka.connect.runtime.TransformationConfigTest > testEmbeddedConfigRegexRouter PASSED
org.apache.kafka.connect.runtime.TransformationConfigTest > testEmbeddedConfigSetSchemaMetadata STARTED
org.apache.kafka.connect.runtime.TransformationConfigTest > testEmbeddedConfigSetSchemaMetadata PASSED
org.apache.kafka.connect.runtime.TransformationConfigTest > testEmbeddedConfigTimestampConverter STARTED
org.apache.kafka.connect.runtime.TransformationConfigTest > testEmbeddedConfigTimestampConverter PASSED
org.apache.kafka.connect.runtime.TransformationConfigTest > testEmbeddedConfigHoistField STARTED
org.apache.kafka.connect.runtime.TransformationConfigTest > testEmbeddedConfigHoistField PASSED
org.apache.kafka.connect.runtime.TransformationConfigTest > testEmbeddedConfigMaskField STARTED
org.apache.kafka.connect.runtime.TransformationConfigTest > testEmbeddedConfigMaskField PASSED
org.apache.kafka.connect.runtime.TransformationConfigTest > testEmbeddedConfigInsertField STARTED
org.apache.kafka.connect.runtime.TransformationConfigTest > testEmbeddedConfigInsertField PASSED
org.apache.kafka.connect.runtime.TransformationConfigTest > testEmbeddedConfigFlatten STARTED
org.apache.kafka.connect.runtime.TransformationConfigTest > testEmbeddedConfigFlatten PASSED
org.apache.kafka.connect.runtime.TransformationConfigTest > testEmbeddedConfigReplaceField STARTED
org.apache.kafka.connect.runtime.TransformationConfigTest > testEmbeddedConfigReplaceField PASSED
org.apache.kafka.connect.runtime.TransformationConfigTest > testEmbeddedConfigTimestampRouter STARTED
org.apache.kafka.connect.runtime.TransformationConfigTest > testEmbeddedConfigTimestampRouter PASSED
org.apache.kafka.connect.runtime.TransformationConfigTest > testEmbeddedConfigValueToKey STARTED
org.apache.kafka.connect.runtime.TransformationConfigTest > testEmbeddedConfigValueToKey PASSED
org.apache.kafka.connect.runtime.TransformationConfigTest > testEmbeddedConfigExtractField STARTED
org.apache.kafka.connect.runtime.TransformationConfigTest > testEmbeddedConfigExtractField PASSED
380 tests completed, 1 failed
> Task :connect:runtime:test FAILED
FAILURE: Build failed with an exception.
* What went wrong:
Execution failed for task ':connect:runtime:test'.
> There were failing tests. See the report at: file://<https://builds.apache.org/job/kafka-2.1-jdk8/ws/connect/runtime/build/reports/tests/test/index.html>
* Try:
Run with --stacktrace option to get the stack trace. Run with --info or --debug option to get more log output. Run with --scan to get full insights.
* Get more help at https://help.gradle.org
BUILD FAILED in 4h 20m 56s
135 actionable tasks: 99 executed, 36 up-to-date
Build step 'Execute shell' marked build as failure
[FINDBUGS] Collecting findbugs analysis files...
Setting GRADLE_4_8_1_HOME=/home/jenkins/tools/gradle/4.8.1
[FINDBUGS] Searching for all files in <https://builds.apache.org/job/kafka-2.1-jdk8/ws/> that match the pattern **/build/reports/findbugs/*.xml
[FINDBUGS] No files found. Configuration error?
Setting GRADLE_4_8_1_HOME=/home/jenkins/tools/gradle/4.8.1
Setting GRADLE_4_8_1_HOME=/home/jenkins/tools/gradle/4.8.1
<Git Blamer> Using GitBlamer to create author and commit information for all warnings.
<Git Blamer> GIT_COMMIT=265b58bd11dfbd8014ccabe320589f7163a82925, workspace=<https://builds.apache.org/job/kafka-2.1-jdk8/ws/>
[FINDBUGS] Computing warning deltas based on reference build #96
Recording test results
Setting GRADLE_4_8_1_HOME=/home/jenkins/tools/gradle/4.8.1
Setting GRADLE_4_8_1_HOME=/home/jenkins/tools/gradle/4.8.1
Not sending mail to unregistered user ismael@juma.me.uk
Not sending mail to unregistered user manikumar.reddy@gmail.com
Not sending mail to unregistered user wangguoz@gmail.com
Build failed in Jenkins: kafka-2.1-jdk8 #112
Posted by Apache Jenkins Server <je...@builds.apache.org>.
See <https://builds.apache.org/job/kafka-2.1-jdk8/112/display/redirect?page=changes>
Changes:
[jason] MINOR: Cleanup handling of mixed transactional/idempotent records
------------------------------------------
[...truncated 2.81 MB...]
org.apache.kafka.connect.runtime.ConnectMetricsTest > testKafkaMetricsNotNull STARTED
org.apache.kafka.connect.runtime.ConnectMetricsTest > testKafkaMetricsNotNull PASSED
org.apache.kafka.connect.runtime.WorkerSourceTaskTest > testPollsInBackground STARTED
org.apache.kafka.connect.runtime.WorkerSourceTaskTest > testPollsInBackground PASSED
org.apache.kafka.connect.runtime.WorkerSourceTaskTest > testFailureInPoll STARTED
org.apache.kafka.connect.runtime.WorkerSourceTaskTest > testFailureInPoll PASSED
org.apache.kafka.connect.runtime.WorkerSourceTaskTest > testSendRecordsConvertsData STARTED
org.apache.kafka.connect.runtime.WorkerSourceTaskTest > testSendRecordsConvertsData PASSED
org.apache.kafka.connect.runtime.WorkerSourceTaskTest > testSendRecordsPropagatesTimestamp STARTED
org.apache.kafka.connect.runtime.WorkerSourceTaskTest > testSendRecordsPropagatesTimestamp PASSED
org.apache.kafka.connect.runtime.WorkerSourceTaskTest > testSendRecordsCorruptTimestamp STARTED
org.apache.kafka.connect.runtime.WorkerSourceTaskTest > testSendRecordsCorruptTimestamp PASSED
org.apache.kafka.connect.runtime.WorkerSourceTaskTest > testSendRecordsNoTimestamp STARTED
org.apache.kafka.connect.runtime.WorkerSourceTaskTest > testSendRecordsNoTimestamp PASSED
org.apache.kafka.connect.runtime.WorkerSourceTaskTest > testSendRecordsRetries STARTED
org.apache.kafka.connect.runtime.WorkerSourceTaskTest > testSendRecordsRetries PASSED
org.apache.kafka.connect.runtime.WorkerSourceTaskTest > testSendRecordsTaskCommitRecordFail STARTED
org.apache.kafka.connect.runtime.WorkerSourceTaskTest > testSendRecordsTaskCommitRecordFail PASSED
org.apache.kafka.connect.runtime.WorkerSourceTaskTest > testSlowTaskStart STARTED
org.apache.kafka.connect.runtime.WorkerSourceTaskTest > testSlowTaskStart PASSED
org.apache.kafka.connect.runtime.WorkerSourceTaskTest > testCommit STARTED
org.apache.kafka.connect.runtime.WorkerSourceTaskTest > testCommit PASSED
org.apache.kafka.connect.runtime.WorkerSourceTaskTest > testCommitFailure STARTED
org.apache.kafka.connect.runtime.WorkerSourceTaskTest > testCommitFailure PASSED
org.apache.kafka.connect.runtime.WorkerSourceTaskTest > testMetricsGroup STARTED
org.apache.kafka.connect.runtime.WorkerSourceTaskTest > testMetricsGroup PASSED
org.apache.kafka.connect.runtime.WorkerSourceTaskTest > testStartPaused STARTED
org.apache.kafka.connect.runtime.WorkerSourceTaskTest > testStartPaused PASSED
org.apache.kafka.connect.runtime.WorkerSourceTaskTest > testPause STARTED
org.apache.kafka.connect.runtime.WorkerSourceTaskTest > testPause PASSED
org.apache.kafka.connect.runtime.distributed.DistributedHerderTest > testPutConnectorConfig STARTED
org.apache.kafka.connect.runtime.distributed.DistributedHerderTest > testPutConnectorConfig PASSED
org.apache.kafka.connect.runtime.distributed.DistributedHerderTest > testJoinLeaderCatchUpFails STARTED
org.apache.kafka.connect.runtime.distributed.DistributedHerderTest > testJoinLeaderCatchUpFails PASSED
org.apache.kafka.connect.runtime.distributed.DistributedHerderTest > testCreateConnector STARTED
org.apache.kafka.connect.runtime.distributed.DistributedHerderTest > testCreateConnector PASSED
org.apache.kafka.connect.runtime.distributed.DistributedHerderTest > testRestartTaskRedirectToLeader STARTED
org.apache.kafka.connect.runtime.distributed.DistributedHerderTest > testRestartTaskRedirectToLeader PASSED
org.apache.kafka.connect.runtime.distributed.DistributedHerderTest > testConnectorConfigAdded STARTED
org.apache.kafka.connect.runtime.distributed.DistributedHerderTest > testConnectorConfigAdded PASSED
org.apache.kafka.connect.runtime.distributed.DistributedHerderTest > testUnknownConnectorPaused STARTED
org.apache.kafka.connect.runtime.distributed.DistributedHerderTest > testUnknownConnectorPaused PASSED
org.apache.kafka.connect.runtime.distributed.DistributedHerderTest > testRestartUnknownTask STARTED
org.apache.kafka.connect.runtime.distributed.DistributedHerderTest > testRestartUnknownTask PASSED
org.apache.kafka.connect.runtime.distributed.DistributedHerderTest > testRequestProcessingOrder STARTED
org.apache.kafka.connect.runtime.distributed.DistributedHerderTest > testRequestProcessingOrder PASSED
org.apache.kafka.connect.runtime.distributed.DistributedHerderTest > testRestartConnectorRedirectToOwner STARTED
org.apache.kafka.connect.runtime.distributed.DistributedHerderTest > testRestartConnectorRedirectToOwner PASSED
org.apache.kafka.connect.runtime.distributed.DistributedHerderTest > testRebalance STARTED
org.apache.kafka.connect.runtime.distributed.DistributedHerderTest > testRebalance PASSED
org.apache.kafka.connect.runtime.distributed.DistributedHerderTest > testHaltCleansUpWorker STARTED
org.apache.kafka.connect.runtime.distributed.DistributedHerderTest > testHaltCleansUpWorker PASSED
org.apache.kafka.connect.runtime.distributed.DistributedHerderTest > testRestartUnknownConnector STARTED
org.apache.kafka.connect.runtime.distributed.DistributedHerderTest > testRestartUnknownConnector PASSED
org.apache.kafka.connect.runtime.distributed.DistributedHerderTest > testJoinAssignment STARTED
org.apache.kafka.connect.runtime.distributed.DistributedHerderTest > testJoinAssignment PASSED
org.apache.kafka.connect.runtime.distributed.DistributedHerderTest > testConnectorPaused STARTED
org.apache.kafka.connect.runtime.distributed.DistributedHerderTest > testConnectorPaused PASSED
org.apache.kafka.connect.runtime.distributed.DistributedHerderTest > testTaskConfigAdded STARTED
org.apache.kafka.connect.runtime.distributed.DistributedHerderTest > testTaskConfigAdded PASSED
org.apache.kafka.connect.runtime.distributed.DistributedHerderTest > testInconsistentConfigs STARTED
org.apache.kafka.connect.runtime.distributed.DistributedHerderTest > testInconsistentConfigs PASSED
org.apache.kafka.connect.runtime.distributed.DistributedHerderTest > testConnectorResumedRunningTaskOnly STARTED
org.apache.kafka.connect.runtime.distributed.DistributedHerderTest > testConnectorResumedRunningTaskOnly PASSED
org.apache.kafka.connect.runtime.distributed.DistributedHerderTest > testConnectorResumed STARTED
org.apache.kafka.connect.runtime.distributed.DistributedHerderTest > testConnectorResumed PASSED
org.apache.kafka.connect.runtime.distributed.DistributedHerderTest > testConnectorConfigUpdate STARTED
org.apache.kafka.connect.runtime.distributed.DistributedHerderTest > testConnectorConfigUpdate PASSED
org.apache.kafka.connect.runtime.distributed.DistributedHerderTest > testRestartConnectorRedirectToLeader STARTED
org.apache.kafka.connect.runtime.distributed.DistributedHerderTest > testRestartConnectorRedirectToLeader PASSED
org.apache.kafka.connect.runtime.distributed.DistributedHerderTest > testCreateConnectorFailedBasicValidation STARTED
org.apache.kafka.connect.runtime.distributed.DistributedHerderTest > testCreateConnectorFailedBasicValidation PASSED
org.apache.kafka.connect.runtime.distributed.DistributedHerderTest > testCreateConnectorFailedCustomValidation STARTED
org.apache.kafka.connect.runtime.distributed.DistributedHerderTest > testCreateConnectorFailedCustomValidation PASSED
org.apache.kafka.connect.runtime.distributed.DistributedHerderTest > testCreateConnectorAlreadyExists STARTED
org.apache.kafka.connect.runtime.distributed.DistributedHerderTest > testCreateConnectorAlreadyExists PASSED
org.apache.kafka.connect.runtime.distributed.DistributedHerderTest > testDestroyConnector STARTED
org.apache.kafka.connect.runtime.distributed.DistributedHerderTest > testDestroyConnector PASSED
org.apache.kafka.connect.runtime.distributed.DistributedHerderTest > testRestartConnector STARTED
org.apache.kafka.connect.runtime.distributed.DistributedHerderTest > testRestartConnector PASSED
org.apache.kafka.connect.runtime.distributed.DistributedHerderTest > testRestartTask STARTED
org.apache.kafka.connect.runtime.distributed.DistributedHerderTest > testRestartTask PASSED
org.apache.kafka.connect.runtime.distributed.DistributedHerderTest > testAccessors STARTED
org.apache.kafka.connect.runtime.distributed.DistributedHerderTest > testAccessors PASSED
org.apache.kafka.connect.runtime.distributed.DistributedHerderTest > testRestartTaskRedirectToOwner STARTED
org.apache.kafka.connect.runtime.distributed.DistributedHerderTest > testRestartTaskRedirectToOwner PASSED
org.apache.kafka.connect.runtime.distributed.DistributedHerderTest > testConnectorPausedRunningTaskOnly STARTED
org.apache.kafka.connect.runtime.distributed.DistributedHerderTest > testConnectorPausedRunningTaskOnly PASSED
org.apache.kafka.connect.runtime.distributed.DistributedHerderTest > testConnectorNameConflictsWithWorkerGroupId STARTED
org.apache.kafka.connect.runtime.distributed.DistributedHerderTest > testConnectorNameConflictsWithWorkerGroupId PASSED
org.apache.kafka.connect.runtime.distributed.DistributedHerderTest > testRebalanceFailedConnector STARTED
org.apache.kafka.connect.runtime.distributed.DistributedHerderTest > testRebalanceFailedConnector PASSED
org.apache.kafka.connect.runtime.distributed.WorkerCoordinatorTest > testLeaderPerformAssignmentSingleTaskConnectors STARTED
org.apache.kafka.connect.runtime.distributed.WorkerCoordinatorTest > testLeaderPerformAssignmentSingleTaskConnectors PASSED
org.apache.kafka.connect.runtime.distributed.WorkerCoordinatorTest > testNormalJoinGroupFollower STARTED
org.apache.kafka.connect.runtime.distributed.WorkerCoordinatorTest > testNormalJoinGroupFollower PASSED
org.apache.kafka.connect.runtime.distributed.WorkerCoordinatorTest > testMetadata STARTED
org.apache.kafka.connect.runtime.distributed.WorkerCoordinatorTest > testMetadata PASSED
org.apache.kafka.connect.runtime.distributed.WorkerCoordinatorTest > testLeaderPerformAssignment1 STARTED
org.apache.kafka.connect.runtime.distributed.WorkerCoordinatorTest > testLeaderPerformAssignment1 PASSED
org.apache.kafka.connect.runtime.distributed.WorkerCoordinatorTest > testLeaderPerformAssignment2 STARTED
org.apache.kafka.connect.runtime.distributed.WorkerCoordinatorTest > testLeaderPerformAssignment2 PASSED
org.apache.kafka.connect.runtime.distributed.WorkerCoordinatorTest > testJoinLeaderCannotAssign STARTED
org.apache.kafka.connect.runtime.distributed.WorkerCoordinatorTest > testJoinLeaderCannotAssign PASSED
org.apache.kafka.connect.runtime.distributed.WorkerCoordinatorTest > testRejoinGroup STARTED
org.apache.kafka.connect.runtime.distributed.WorkerCoordinatorTest > testRejoinGroup PASSED
org.apache.kafka.connect.runtime.distributed.WorkerCoordinatorTest > testNormalJoinGroupLeader STARTED
org.apache.kafka.connect.runtime.distributed.WorkerCoordinatorTest > testNormalJoinGroupLeader PASSED
380 tests completed, 1 failed
> Task :connect:runtime:test FAILED
FAILURE: Build failed with an exception.
* What went wrong:
Execution failed for task ':connect:runtime:test'.
> There were failing tests. See the report at: file://<https://builds.apache.org/job/kafka-2.1-jdk8/ws/connect/runtime/build/reports/tests/test/index.html>
* Try:
Run with --stacktrace option to get the stack trace. Run with --info or --debug option to get more log output. Run with --scan to get full insights.
* Get more help at https://help.gradle.org
BUILD FAILED in 4h 7m 1s
132 actionable tasks: 96 executed, 36 up-to-date
Build step 'Execute shell' marked build as failure
[FINDBUGS] Collecting findbugs analysis files...
Setting GRADLE_4_8_1_HOME=/home/jenkins/tools/gradle/4.8.1
[FINDBUGS] Searching for all files in <https://builds.apache.org/job/kafka-2.1-jdk8/ws/> that match the pattern **/build/reports/findbugs/*.xml
[FINDBUGS] No files found. Configuration error?
Setting GRADLE_4_8_1_HOME=/home/jenkins/tools/gradle/4.8.1
Setting GRADLE_4_8_1_HOME=/home/jenkins/tools/gradle/4.8.1
<Git Blamer> Using GitBlamer to create author and commit information for all warnings.
<Git Blamer> GIT_COMMIT=59a0cbb98cef10ddf62d294670aa2e4eb9f8cf8c, workspace=<https://builds.apache.org/job/kafka-2.1-jdk8/ws/>
[FINDBUGS] Computing warning deltas based on reference build #96
Recording test results
Setting GRADLE_4_8_1_HOME=/home/jenkins/tools/gradle/4.8.1
Setting GRADLE_4_8_1_HOME=/home/jenkins/tools/gradle/4.8.1
Not sending mail to unregistered user ismael@juma.me.uk
Not sending mail to unregistered user manikumar.reddy@gmail.com
Not sending mail to unregistered user wangguoz@gmail.com
Build failed in Jenkins: kafka-2.1-jdk8 #111
Posted by Apache Jenkins Server <je...@builds.apache.org>.
See <https://builds.apache.org/job/kafka-2.1-jdk8/111/display/redirect?page=changes>
Changes:
[ismael] MINOR: Fix checkstyle error caused by #5781
------------------------------------------
[...truncated 686.79 KB...]
kafka.security.auth.SimpleAclAuthorizerTest > testWritesLiteralAclChangeEventWhenInterBrokerProtocolIsKafkaV2 STARTED
kafka.security.auth.SimpleAclAuthorizerTest > testWritesLiteralAclChangeEventWhenInterBrokerProtocolIsKafkaV2 PASSED
kafka.security.auth.SimpleAclAuthorizerTest > testTopicAcl STARTED
kafka.security.auth.SimpleAclAuthorizerTest > testTopicAcl PASSED
kafka.security.auth.SimpleAclAuthorizerTest > testSuperUserHasAccess STARTED
kafka.security.auth.SimpleAclAuthorizerTest > testSuperUserHasAccess PASSED
kafka.security.auth.SimpleAclAuthorizerTest > testDeleteAclOnPrefixedResource STARTED
kafka.security.auth.SimpleAclAuthorizerTest > testDeleteAclOnPrefixedResource PASSED
kafka.security.auth.SimpleAclAuthorizerTest > testDenyTakesPrecedence STARTED
kafka.security.auth.SimpleAclAuthorizerTest > testDenyTakesPrecedence PASSED
kafka.security.auth.SimpleAclAuthorizerTest > testSingleCharacterResourceAcls STARTED
kafka.security.auth.SimpleAclAuthorizerTest > testSingleCharacterResourceAcls PASSED
kafka.security.auth.SimpleAclAuthorizerTest > testNoAclFoundOverride STARTED
kafka.security.auth.SimpleAclAuthorizerTest > testNoAclFoundOverride PASSED
kafka.security.auth.SimpleAclAuthorizerTest > testEmptyAclThrowsException STARTED
kafka.security.auth.SimpleAclAuthorizerTest > testEmptyAclThrowsException PASSED
kafka.security.auth.SimpleAclAuthorizerTest > testSuperUserWithCustomPrincipalHasAccess STARTED
kafka.security.auth.SimpleAclAuthorizerTest > testSuperUserWithCustomPrincipalHasAccess PASSED
kafka.security.auth.SimpleAclAuthorizerTest > testAllowAccessWithCustomPrincipal STARTED
kafka.security.auth.SimpleAclAuthorizerTest > testAllowAccessWithCustomPrincipal PASSED
kafka.security.auth.SimpleAclAuthorizerTest > testDeleteAclOnWildcardResource STARTED
kafka.security.auth.SimpleAclAuthorizerTest > testDeleteAclOnWildcardResource PASSED
kafka.security.auth.SimpleAclAuthorizerTest > testChangeListenerTiming STARTED
kafka.security.auth.SimpleAclAuthorizerTest > testChangeListenerTiming PASSED
kafka.security.auth.SimpleAclAuthorizerTest > testWritesLiteralWritesLiteralAclChangeEventWhenInterBrokerProtocolLessThanKafkaV2eralAclChangesForOlderProtocolVersions STARTED
kafka.security.auth.SimpleAclAuthorizerTest > testWritesLiteralWritesLiteralAclChangeEventWhenInterBrokerProtocolLessThanKafkaV2eralAclChangesForOlderProtocolVersions PASSED
kafka.security.auth.SimpleAclAuthorizerTest > testThrowsOnAddPrefixedAclIfInterBrokerProtocolVersionTooLow STARTED
kafka.security.auth.SimpleAclAuthorizerTest > testThrowsOnAddPrefixedAclIfInterBrokerProtocolVersionTooLow PASSED
kafka.security.auth.SimpleAclAuthorizerTest > testAccessAllowedIfAllowAclExistsOnPrefixedResource STARTED
kafka.security.auth.SimpleAclAuthorizerTest > testAccessAllowedIfAllowAclExistsOnPrefixedResource PASSED
kafka.security.auth.SimpleAclAuthorizerTest > testHighConcurrencyModificationOfResourceAcls STARTED
kafka.security.auth.SimpleAclAuthorizerTest > testHighConcurrencyModificationOfResourceAcls PASSED
kafka.security.auth.SimpleAclAuthorizerTest > testAuthorizeWithEmptyResourceName STARTED
kafka.security.auth.SimpleAclAuthorizerTest > testAuthorizeWithEmptyResourceName PASSED
kafka.security.auth.SimpleAclAuthorizerTest > testDeleteAllAclOnPrefixedResource STARTED
kafka.security.auth.SimpleAclAuthorizerTest > testDeleteAllAclOnPrefixedResource PASSED
kafka.security.auth.SimpleAclAuthorizerTest > testAddAclsOnLiteralResource STARTED
kafka.security.auth.SimpleAclAuthorizerTest > testAddAclsOnLiteralResource PASSED
kafka.security.auth.SimpleAclAuthorizerTest > testAuthorizeThrowsOnNoneLiteralResource STARTED
kafka.security.auth.SimpleAclAuthorizerTest > testAuthorizeThrowsOnNoneLiteralResource PASSED
kafka.security.auth.SimpleAclAuthorizerTest > testGetAclsPrincipal STARTED
kafka.security.auth.SimpleAclAuthorizerTest > testGetAclsPrincipal PASSED
kafka.security.auth.SimpleAclAuthorizerTest > testAddAclsOnPrefiexedResource STARTED
kafka.security.auth.SimpleAclAuthorizerTest > testAddAclsOnPrefiexedResource PASSED
kafka.security.auth.SimpleAclAuthorizerTest > testWritesExtendedAclChangeEventIfInterBrokerProtocolNotSet STARTED
kafka.security.auth.SimpleAclAuthorizerTest > testWritesExtendedAclChangeEventIfInterBrokerProtocolNotSet PASSED
kafka.security.auth.SimpleAclAuthorizerTest > testAccessAllowedIfAllowAclExistsOnWildcardResource STARTED
kafka.security.auth.SimpleAclAuthorizerTest > testAccessAllowedIfAllowAclExistsOnWildcardResource PASSED
kafka.security.auth.SimpleAclAuthorizerTest > testLoadCache STARTED
kafka.security.auth.SimpleAclAuthorizerTest > testLoadCache PASSED
kafka.security.auth.ZkAuthorizationTest > testIsZkSecurityEnabled STARTED
kafka.security.auth.ZkAuthorizationTest > testIsZkSecurityEnabled PASSED
kafka.security.auth.ZkAuthorizationTest > testZkUtils STARTED
kafka.security.auth.ZkAuthorizationTest > testZkUtils PASSED
kafka.security.auth.ZkAuthorizationTest > testZkAntiMigration STARTED
kafka.security.auth.ZkAuthorizationTest > testZkAntiMigration PASSED
kafka.security.auth.ZkAuthorizationTest > testConsumerOffsetPathAcls STARTED
kafka.security.auth.ZkAuthorizationTest > testConsumerOffsetPathAcls PASSED
kafka.security.auth.ZkAuthorizationTest > testZkMigration STARTED
kafka.security.auth.ZkAuthorizationTest > testZkMigration PASSED
kafka.security.auth.ZkAuthorizationTest > testChroot STARTED
kafka.security.auth.ZkAuthorizationTest > testChroot PASSED
kafka.security.auth.ZkAuthorizationTest > testDelete STARTED
kafka.security.auth.ZkAuthorizationTest > testDelete PASSED
kafka.security.auth.ZkAuthorizationTest > testDeleteRecursive STARTED
kafka.security.auth.ZkAuthorizationTest > testDeleteRecursive PASSED
kafka.security.auth.ResourceTest > shouldParseOldTwoPartString STARTED
kafka.security.auth.ResourceTest > shouldParseOldTwoPartString PASSED
kafka.security.auth.ResourceTest > shouldParseOldTwoPartWithEmbeddedSeparators STARTED
kafka.security.auth.ResourceTest > shouldParseOldTwoPartWithEmbeddedSeparators PASSED
kafka.security.auth.ResourceTest > shouldThrowOnTwoPartStringWithUnknownResourceType STARTED
kafka.security.auth.ResourceTest > shouldThrowOnTwoPartStringWithUnknownResourceType PASSED
kafka.security.auth.ResourceTest > shouldThrowOnBadResourceTypeSeparator STARTED
kafka.security.auth.ResourceTest > shouldThrowOnBadResourceTypeSeparator PASSED
kafka.security.auth.ResourceTest > shouldParseThreePartString STARTED
kafka.security.auth.ResourceTest > shouldParseThreePartString PASSED
kafka.security.auth.ResourceTest > shouldRoundTripViaString STARTED
kafka.security.auth.ResourceTest > shouldRoundTripViaString PASSED
kafka.security.auth.ResourceTest > shouldParseThreePartWithEmbeddedSeparators STARTED
kafka.security.auth.ResourceTest > shouldParseThreePartWithEmbeddedSeparators PASSED
kafka.security.auth.AclTest > testAclJsonConversion STARTED
kafka.security.auth.AclTest > testAclJsonConversion PASSED
kafka.security.auth.OperationTest > testJavaConversions STARTED
kafka.security.auth.OperationTest > testJavaConversions PASSED
kafka.security.auth.PermissionTypeTest > testJavaConversions STARTED
kafka.security.auth.PermissionTypeTest > testJavaConversions PASSED
kafka.security.auth.PermissionTypeTest > testFromString STARTED
kafka.security.auth.PermissionTypeTest > testFromString PASSED
kafka.security.token.delegation.DelegationTokenManagerTest > testPeriodicTokenExpiry STARTED
kafka.security.token.delegation.DelegationTokenManagerTest > testPeriodicTokenExpiry PASSED
kafka.security.token.delegation.DelegationTokenManagerTest > testTokenRequestsWithDelegationTokenDisabled STARTED
kafka.security.token.delegation.DelegationTokenManagerTest > testTokenRequestsWithDelegationTokenDisabled PASSED
kafka.security.token.delegation.DelegationTokenManagerTest > testDescribeToken STARTED
kafka.security.token.delegation.DelegationTokenManagerTest > testDescribeToken PASSED
kafka.security.token.delegation.DelegationTokenManagerTest > testCreateToken STARTED
kafka.security.token.delegation.DelegationTokenManagerTest > testCreateToken PASSED
kafka.security.token.delegation.DelegationTokenManagerTest > testExpireToken STARTED
kafka.security.token.delegation.DelegationTokenManagerTest > testExpireToken PASSED
kafka.security.token.delegation.DelegationTokenManagerTest > testRenewToken STARTED
kafka.security.token.delegation.DelegationTokenManagerTest > testRenewToken PASSED
2150 tests completed, 1 failed, 4 skipped
> Task :kafka-2.1-jdk8:core:test FAILED
> Task :testScala_2_12 FAILED
> Task :testScala_2_11 FAILED
FAILURE: Build completed with 2 failures.
1: Task failed with an exception.
-----------
* What went wrong:
Execution failed for task ':kafka-2.1-jdk8:core:test'.
> There were failing tests. See the report at: file://<https://builds.apache.org/job/kafka-2.1-jdk8/ws/core/build/reports/tests/test/index.html>
* Try:
Run with --stacktrace option to get the stack trace. Run with --info or --debug option to get more log output. Run with --scan to get full insights.
==============================================================================
2: Task failed with an exception.
-----------
* What went wrong:
Execution failed for task ':kafka-2.1-jdk8:core:spotbugsMain'.
> A failure occurred while executing com.github.spotbugs.internal.spotbugs.SpotBugsRunner
> SpotBugs rule violations were found. See the report at: file://<https://builds.apache.org/job/kafka-2.1-jdk8/ws/core/build/reports/spotbugs/main.xml>
* Try:
Run with --stacktrace option to get the stack trace. Run with --info or --debug option to get more log output. Run with --scan to get full insights.
==============================================================================
* Get more help at https://help.gradle.org
BUILD FAILED in 1h 52m 49s
27 actionable tasks: 10 executed, 17 up-to-date
Build step 'Execute shell' marked build as failure
[FINDBUGS] Collecting findbugs analysis files...
Setting GRADLE_4_8_1_HOME=/home/jenkins/tools/gradle/4.8.1
[FINDBUGS] Searching for all files in <https://builds.apache.org/job/kafka-2.1-jdk8/ws/> that match the pattern **/build/reports/findbugs/*.xml
[FINDBUGS] No files found. Configuration error?
Setting GRADLE_4_8_1_HOME=/home/jenkins/tools/gradle/4.8.1
Setting GRADLE_4_8_1_HOME=/home/jenkins/tools/gradle/4.8.1
<Git Blamer> Using GitBlamer to create author and commit information for all warnings.
<Git Blamer> GIT_COMMIT=a79771d9bc8ffeb713d3b0c3b281dfeb84592ff0, workspace=<https://builds.apache.org/job/kafka-2.1-jdk8/ws/>
[FINDBUGS] Computing warning deltas based on reference build #96
Recording test results
Setting GRADLE_4_8_1_HOME=/home/jenkins/tools/gradle/4.8.1
Setting GRADLE_4_8_1_HOME=/home/jenkins/tools/gradle/4.8.1
Not sending mail to unregistered user ismael@juma.me.uk
Not sending mail to unregistered user manikumar.reddy@gmail.com
Not sending mail to unregistered user wangguoz@gmail.com
Build failed in Jenkins: kafka-2.1-jdk8 #110
Posted by Apache Jenkins Server <je...@builds.apache.org>.
See <https://builds.apache.org/job/kafka-2.1-jdk8/110/display/redirect?page=changes>
Changes:
[matthias] MINOR: Handle case where connector status endpoints returns 404 (#6176)
------------------------------------------
[...truncated 915.53 KB...]
kafka.server.KafkaConfigTest > testInterBrokerListenerNameAndSecurityProtocolSet STARTED
kafka.server.KafkaConfigTest > testInterBrokerListenerNameAndSecurityProtocolSet PASSED
kafka.server.KafkaConfigTest > testFromPropsInvalid STARTED
kafka.server.KafkaConfigTest > testFromPropsInvalid PASSED
kafka.server.KafkaConfigTest > testInvalidCompressionType STARTED
kafka.server.KafkaConfigTest > testInvalidCompressionType PASSED
kafka.server.KafkaConfigTest > testAdvertiseHostNameDefault STARTED
kafka.server.KafkaConfigTest > testAdvertiseHostNameDefault PASSED
kafka.server.KafkaConfigTest > testLogRetentionTimeMinutesProvided STARTED
kafka.server.KafkaConfigTest > testLogRetentionTimeMinutesProvided PASSED
kafka.server.KafkaConfigTest > testValidCompressionType STARTED
kafka.server.KafkaConfigTest > testValidCompressionType PASSED
kafka.server.KafkaConfigTest > testUncleanElectionInvalid STARTED
kafka.server.KafkaConfigTest > testUncleanElectionInvalid PASSED
kafka.server.KafkaConfigTest > testListenerNamesWithAdvertisedListenerUnset STARTED
kafka.server.KafkaConfigTest > testListenerNamesWithAdvertisedListenerUnset PASSED
kafka.server.KafkaConfigTest > testLogRetentionTimeBothMinutesAndMsProvided STARTED
kafka.server.KafkaConfigTest > testLogRetentionTimeBothMinutesAndMsProvided PASSED
kafka.server.KafkaConfigTest > testLogRollTimeMsProvided STARTED
kafka.server.KafkaConfigTest > testLogRollTimeMsProvided PASSED
kafka.server.KafkaConfigTest > testUncleanLeaderElectionDefault STARTED
kafka.server.KafkaConfigTest > testUncleanLeaderElectionDefault PASSED
kafka.server.KafkaConfigTest > testInvalidAdvertisedListenersProtocol STARTED
kafka.server.KafkaConfigTest > testInvalidAdvertisedListenersProtocol PASSED
kafka.server.KafkaConfigTest > testUncleanElectionEnabled STARTED
kafka.server.KafkaConfigTest > testUncleanElectionEnabled PASSED
kafka.server.KafkaConfigTest > testInterBrokerVersionMessageFormatCompatibility STARTED
kafka.server.KafkaConfigTest > testInterBrokerVersionMessageFormatCompatibility PASSED
kafka.server.KafkaConfigTest > testAdvertisePortDefault STARTED
kafka.server.KafkaConfigTest > testAdvertisePortDefault PASSED
kafka.server.KafkaConfigTest > testVersionConfiguration STARTED
kafka.server.KafkaConfigTest > testVersionConfiguration PASSED
kafka.server.KafkaConfigTest > testEqualAdvertisedListenersProtocol STARTED
kafka.server.KafkaConfigTest > testEqualAdvertisedListenersProtocol PASSED
kafka.server.ListOffsetsRequestTest > testListOffsetsErrorCodes STARTED
kafka.server.ListOffsetsRequestTest > testListOffsetsErrorCodes PASSED
kafka.server.ListOffsetsRequestTest > testCurrentEpochValidation STARTED
kafka.server.ListOffsetsRequestTest > testCurrentEpochValidation PASSED
kafka.server.CreateTopicsRequestTest > testValidCreateTopicsRequests STARTED
kafka.server.CreateTopicsRequestTest > testValidCreateTopicsRequests PASSED
kafka.server.CreateTopicsRequestTest > testErrorCreateTopicsRequests STARTED
kafka.server.CreateTopicsRequestTest > testErrorCreateTopicsRequests PASSED
kafka.server.CreateTopicsRequestTest > testInvalidCreateTopicsRequests STARTED
kafka.server.CreateTopicsRequestTest > testInvalidCreateTopicsRequests PASSED
kafka.server.CreateTopicsRequestTest > testNotController STARTED
kafka.server.CreateTopicsRequestTest > testNotController PASSED
kafka.server.CreateTopicsRequestWithPolicyTest > testValidCreateTopicsRequests STARTED
kafka.server.CreateTopicsRequestWithPolicyTest > testValidCreateTopicsRequests PASSED
kafka.server.CreateTopicsRequestWithPolicyTest > testErrorCreateTopicsRequests STARTED
kafka.server.CreateTopicsRequestWithPolicyTest > testErrorCreateTopicsRequests PASSED
kafka.server.FetchRequestDownConversionConfigTest > testV1FetchWithDownConversionDisabled STARTED
kafka.server.FetchRequestDownConversionConfigTest > testV1FetchWithDownConversionDisabled PASSED
kafka.server.FetchRequestDownConversionConfigTest > testV1FetchFromReplica STARTED
kafka.server.FetchRequestDownConversionConfigTest > testV1FetchFromReplica PASSED
kafka.server.FetchRequestDownConversionConfigTest > testLatestFetchWithDownConversionDisabled STARTED
kafka.server.FetchRequestDownConversionConfigTest > testLatestFetchWithDownConversionDisabled PASSED
kafka.server.FetchRequestDownConversionConfigTest > testV1FetchWithTopicLevelOverrides STARTED
kafka.server.FetchRequestDownConversionConfigTest > testV1FetchWithTopicLevelOverrides PASSED
kafka.server.SaslApiVersionsRequestTest > testApiVersionsRequestWithUnsupportedVersion STARTED
kafka.server.SaslApiVersionsRequestTest > testApiVersionsRequestWithUnsupportedVersion PASSED
kafka.server.SaslApiVersionsRequestTest > testApiVersionsRequestBeforeSaslHandshakeRequest STARTED
kafka.server.SaslApiVersionsRequestTest > testApiVersionsRequestBeforeSaslHandshakeRequest PASSED
kafka.server.SaslApiVersionsRequestTest > testApiVersionsRequestAfterSaslHandshakeRequest STARTED
kafka.server.SaslApiVersionsRequestTest > testApiVersionsRequestAfterSaslHandshakeRequest PASSED
kafka.server.LogDirFailureTest > testIOExceptionDuringLogRoll STARTED
kafka.server.LogDirFailureTest > testIOExceptionDuringLogRoll PASSED
kafka.server.LogDirFailureTest > testIOExceptionDuringCheckpoint STARTED
kafka.server.LogDirFailureTest > testIOExceptionDuringCheckpoint PASSED
kafka.server.LogDirFailureTest > brokerWithOldInterBrokerProtocolShouldHaltOnLogDirFailure STARTED
kafka.server.LogDirFailureTest > brokerWithOldInterBrokerProtocolShouldHaltOnLogDirFailure PASSED
kafka.server.LogDirFailureTest > testReplicaFetcherThreadAfterLogDirFailureOnFollower STARTED
kafka.server.LogDirFailureTest > testReplicaFetcherThreadAfterLogDirFailureOnFollower PASSED
kafka.server.AlterReplicaLogDirsRequestTest > testAlterReplicaLogDirsRequest STARTED
kafka.server.AlterReplicaLogDirsRequestTest > testAlterReplicaLogDirsRequest PASSED
kafka.server.AlterReplicaLogDirsRequestTest > testAlterReplicaLogDirsRequestErrorCode STARTED
kafka.server.AlterReplicaLogDirsRequestTest > testAlterReplicaLogDirsRequestErrorCode PASSED
kafka.server.ServerGenerateBrokerIdTest > testBrokerMetadataOnIdCollision STARTED
kafka.server.ServerGenerateBrokerIdTest > testBrokerMetadataOnIdCollision PASSED
kafka.server.ServerGenerateBrokerIdTest > testAutoGenerateBrokerId STARTED
kafka.server.ServerGenerateBrokerIdTest > testAutoGenerateBrokerId PASSED
kafka.server.ServerGenerateBrokerIdTest > testMultipleLogDirsMetaProps STARTED
kafka.server.ServerGenerateBrokerIdTest > testMultipleLogDirsMetaProps PASSED
kafka.server.ServerGenerateBrokerIdTest > testDisableGeneratedBrokerId STARTED
kafka.server.ServerGenerateBrokerIdTest > testDisableGeneratedBrokerId PASSED
kafka.server.ServerGenerateBrokerIdTest > testUserConfigAndGeneratedBrokerId STARTED
kafka.server.ServerGenerateBrokerIdTest > testUserConfigAndGeneratedBrokerId PASSED
kafka.server.ServerGenerateBrokerIdTest > testConsistentBrokerIdFromUserConfigAndMetaProps STARTED
kafka.server.ServerGenerateBrokerIdTest > testConsistentBrokerIdFromUserConfigAndMetaProps PASSED
kafka.server.DeleteTopicsRequestWithDeletionDisabledTest > testDeleteRecordsRequest STARTED
kafka.server.DeleteTopicsRequestWithDeletionDisabledTest > testDeleteRecordsRequest PASSED
kafka.server.ServerShutdownTest > testCleanShutdownAfterFailedStartup STARTED
kafka.server.ServerShutdownTest > testCleanShutdownAfterFailedStartup PASSED
kafka.server.ServerShutdownTest > testConsecutiveShutdown STARTED
kafka.server.ServerShutdownTest > testConsecutiveShutdown PASSED
kafka.server.ServerShutdownTest > testControllerShutdownDuringSend STARTED
kafka.server.ServerShutdownTest > testControllerShutdownDuringSend PASSED
kafka.server.ServerShutdownTest > testCleanShutdownAfterFailedStartupDueToCorruptLogs STARTED
kafka.server.ServerShutdownTest > testCleanShutdownAfterFailedStartupDueToCorruptLogs PASSED
kafka.server.ServerShutdownTest > testCleanShutdown STARTED
kafka.server.ServerShutdownTest > testCleanShutdown PASSED
kafka.server.ServerShutdownTest > testCleanShutdownWithDeleteTopicEnabled STARTED
kafka.server.ServerShutdownTest > testCleanShutdownWithDeleteTopicEnabled PASSED
unit.kafka.utils.ThrottlerTest > testThrottleDesiredRate STARTED
unit.kafka.utils.ThrottlerTest > testThrottleDesiredRate PASSED
> Task :clients:compileJava UP-TO-DATE
> Task :clients:processResources UP-TO-DATE
> Task :clients:classes UP-TO-DATE
> Task :clients:checkstyleMain
[ant:checkstyle] [ERROR] <https://builds.apache.org/job/kafka-2.1-jdk8/ws/clients/src/main/java/org/apache/kafka/clients/producer/KafkaProducer.java>:1200:13: '}' at column 13 should be on the same line as the next part of a multi-block statement (one that directly contains multiple blocks: if/else-if/else, do/while or try/catch/finally). [RightCurly]
> Task :clients:checkstyleMain FAILED
FAILURE: Build failed with an exception.
* What went wrong:
Execution failed for task ':clients:checkstyleMain'.
> Checkstyle rule violations were found. See the report at: file://<https://builds.apache.org/job/kafka-2.1-jdk8/ws/clients/build/reports/checkstyle/main.html>
Checkstyle files with violations: 1
Checkstyle violations by severity: [error:1]
* Try:
Run with --stacktrace option to get the stack trace. Run with --info or --debug option to get more log output. Run with --scan to get full insights.
* Get more help at https://help.gradle.org
BUILD FAILED in 3h 34m 8s
30 actionable tasks: 11 executed, 19 up-to-date
Build step 'Execute shell' marked build as failure
[FINDBUGS] Collecting findbugs analysis files...
Setting GRADLE_4_8_1_HOME=/home/jenkins/tools/gradle/4.8.1
[FINDBUGS] Searching for all files in <https://builds.apache.org/job/kafka-2.1-jdk8/ws/> that match the pattern **/build/reports/findbugs/*.xml
[FINDBUGS] No files found. Configuration error?
Setting GRADLE_4_8_1_HOME=/home/jenkins/tools/gradle/4.8.1
Setting GRADLE_4_8_1_HOME=/home/jenkins/tools/gradle/4.8.1
<Git Blamer> Using GitBlamer to create author and commit information for all warnings.
<Git Blamer> GIT_COMMIT=3c7363367a634a2c47a8a190b29be30a4c526f33, workspace=<https://builds.apache.org/job/kafka-2.1-jdk8/ws/>
[FINDBUGS] Computing warning deltas based on reference build #96
Recording test results
Setting GRADLE_4_8_1_HOME=/home/jenkins/tools/gradle/4.8.1
Setting GRADLE_4_8_1_HOME=/home/jenkins/tools/gradle/4.8.1
Not sending mail to unregistered user ismael@juma.me.uk
Not sending mail to unregistered user manikumar.reddy@gmail.com
Not sending mail to unregistered user wangguoz@gmail.com
Build failed in Jenkins: kafka-2.1-jdk8 #109
Posted by Apache Jenkins Server <je...@builds.apache.org>.
See <https://builds.apache.org/job/kafka-2.1-jdk8/109/display/redirect?page=changes>
Changes:
[ismael] MINOR: Log partition info when creating new request batch in controller
------------------------------------------
[...truncated 911.65 KB...]
kafka.security.auth.SimpleAclAuthorizerTest > testAclManagementAPIs STARTED
kafka.security.auth.SimpleAclAuthorizerTest > testAclManagementAPIs PASSED
kafka.security.auth.SimpleAclAuthorizerTest > testWildCardAcls STARTED
kafka.security.auth.SimpleAclAuthorizerTest > testWildCardAcls PASSED
kafka.security.auth.SimpleAclAuthorizerTest > testWritesLiteralAclChangeEventWhenInterBrokerProtocolIsKafkaV2 STARTED
kafka.security.auth.SimpleAclAuthorizerTest > testWritesLiteralAclChangeEventWhenInterBrokerProtocolIsKafkaV2 PASSED
kafka.security.auth.SimpleAclAuthorizerTest > testTopicAcl STARTED
kafka.security.auth.SimpleAclAuthorizerTest > testTopicAcl PASSED
kafka.security.auth.SimpleAclAuthorizerTest > testSuperUserHasAccess STARTED
kafka.security.auth.SimpleAclAuthorizerTest > testSuperUserHasAccess PASSED
kafka.security.auth.SimpleAclAuthorizerTest > testDeleteAclOnPrefixedResource STARTED
kafka.security.auth.SimpleAclAuthorizerTest > testDeleteAclOnPrefixedResource PASSED
kafka.security.auth.SimpleAclAuthorizerTest > testDenyTakesPrecedence STARTED
kafka.security.auth.SimpleAclAuthorizerTest > testDenyTakesPrecedence PASSED
kafka.security.auth.SimpleAclAuthorizerTest > testSingleCharacterResourceAcls STARTED
kafka.security.auth.SimpleAclAuthorizerTest > testSingleCharacterResourceAcls PASSED
kafka.security.auth.SimpleAclAuthorizerTest > testNoAclFoundOverride STARTED
kafka.security.auth.SimpleAclAuthorizerTest > testNoAclFoundOverride PASSED
kafka.security.auth.SimpleAclAuthorizerTest > testEmptyAclThrowsException STARTED
kafka.security.auth.SimpleAclAuthorizerTest > testEmptyAclThrowsException PASSED
kafka.security.auth.SimpleAclAuthorizerTest > testSuperUserWithCustomPrincipalHasAccess STARTED
kafka.security.auth.SimpleAclAuthorizerTest > testSuperUserWithCustomPrincipalHasAccess PASSED
kafka.security.auth.SimpleAclAuthorizerTest > testAllowAccessWithCustomPrincipal STARTED
kafka.security.auth.SimpleAclAuthorizerTest > testAllowAccessWithCustomPrincipal PASSED
kafka.security.auth.SimpleAclAuthorizerTest > testDeleteAclOnWildcardResource STARTED
kafka.security.auth.SimpleAclAuthorizerTest > testDeleteAclOnWildcardResource PASSED
kafka.security.auth.SimpleAclAuthorizerTest > testChangeListenerTiming STARTED
kafka.security.auth.SimpleAclAuthorizerTest > testChangeListenerTiming PASSED
kafka.security.auth.SimpleAclAuthorizerTest > testWritesLiteralWritesLiteralAclChangeEventWhenInterBrokerProtocolLessThanKafkaV2eralAclChangesForOlderProtocolVersions STARTED
kafka.security.auth.SimpleAclAuthorizerTest > testWritesLiteralWritesLiteralAclChangeEventWhenInterBrokerProtocolLessThanKafkaV2eralAclChangesForOlderProtocolVersions PASSED
kafka.security.auth.SimpleAclAuthorizerTest > testThrowsOnAddPrefixedAclIfInterBrokerProtocolVersionTooLow STARTED
kafka.security.auth.SimpleAclAuthorizerTest > testThrowsOnAddPrefixedAclIfInterBrokerProtocolVersionTooLow PASSED
kafka.security.auth.SimpleAclAuthorizerTest > testAccessAllowedIfAllowAclExistsOnPrefixedResource STARTED
kafka.security.auth.SimpleAclAuthorizerTest > testAccessAllowedIfAllowAclExistsOnPrefixedResource PASSED
kafka.security.auth.SimpleAclAuthorizerTest > testHighConcurrencyModificationOfResourceAcls STARTED
kafka.security.auth.SimpleAclAuthorizerTest > testHighConcurrencyModificationOfResourceAcls PASSED
kafka.security.auth.SimpleAclAuthorizerTest > testAuthorizeWithEmptyResourceName STARTED
kafka.security.auth.SimpleAclAuthorizerTest > testAuthorizeWithEmptyResourceName PASSED
kafka.security.auth.SimpleAclAuthorizerTest > testDeleteAllAclOnPrefixedResource STARTED
kafka.security.auth.SimpleAclAuthorizerTest > testDeleteAllAclOnPrefixedResource PASSED
kafka.security.auth.SimpleAclAuthorizerTest > testAddAclsOnLiteralResource STARTED
kafka.security.auth.SimpleAclAuthorizerTest > testAddAclsOnLiteralResource PASSED
kafka.security.auth.SimpleAclAuthorizerTest > testAuthorizeThrowsOnNoneLiteralResource STARTED
kafka.security.auth.SimpleAclAuthorizerTest > testAuthorizeThrowsOnNoneLiteralResource PASSED
kafka.security.auth.SimpleAclAuthorizerTest > testGetAclsPrincipal STARTED
kafka.security.auth.SimpleAclAuthorizerTest > testGetAclsPrincipal PASSED
kafka.security.auth.SimpleAclAuthorizerTest > testAddAclsOnPrefiexedResource STARTED
kafka.security.auth.SimpleAclAuthorizerTest > testAddAclsOnPrefiexedResource PASSED
kafka.security.auth.SimpleAclAuthorizerTest > testWritesExtendedAclChangeEventIfInterBrokerProtocolNotSet STARTED
kafka.security.auth.SimpleAclAuthorizerTest > testWritesExtendedAclChangeEventIfInterBrokerProtocolNotSet PASSED
kafka.security.auth.SimpleAclAuthorizerTest > testAccessAllowedIfAllowAclExistsOnWildcardResource STARTED
kafka.security.auth.SimpleAclAuthorizerTest > testAccessAllowedIfAllowAclExistsOnWildcardResource PASSED
kafka.security.auth.SimpleAclAuthorizerTest > testLoadCache STARTED
kafka.security.auth.SimpleAclAuthorizerTest > testLoadCache PASSED
kafka.security.auth.ZkAuthorizationTest > testIsZkSecurityEnabled STARTED
kafka.security.auth.ZkAuthorizationTest > testIsZkSecurityEnabled PASSED
kafka.security.auth.ZkAuthorizationTest > testZkUtils STARTED
kafka.security.auth.ZkAuthorizationTest > testZkUtils PASSED
kafka.security.auth.ZkAuthorizationTest > testZkAntiMigration STARTED
kafka.security.auth.ZkAuthorizationTest > testZkAntiMigration PASSED
kafka.security.auth.ZkAuthorizationTest > testConsumerOffsetPathAcls STARTED
kafka.security.auth.ZkAuthorizationTest > testConsumerOffsetPathAcls PASSED
kafka.security.auth.ZkAuthorizationTest > testZkMigration STARTED
kafka.security.auth.ZkAuthorizationTest > testZkMigration PASSED
kafka.security.auth.ZkAuthorizationTest > testChroot STARTED
kafka.security.auth.ZkAuthorizationTest > testChroot PASSED
kafka.security.auth.ZkAuthorizationTest > testDelete STARTED
kafka.security.auth.ZkAuthorizationTest > testDelete PASSED
kafka.security.auth.ZkAuthorizationTest > testDeleteRecursive STARTED
kafka.security.auth.ZkAuthorizationTest > testDeleteRecursive PASSED
kafka.security.auth.ResourceTest > shouldParseOldTwoPartString STARTED
kafka.security.auth.ResourceTest > shouldParseOldTwoPartString PASSED
kafka.security.auth.ResourceTest > shouldParseOldTwoPartWithEmbeddedSeparators STARTED
kafka.security.auth.ResourceTest > shouldParseOldTwoPartWithEmbeddedSeparators PASSED
kafka.security.auth.ResourceTest > shouldThrowOnTwoPartStringWithUnknownResourceType STARTED
kafka.security.auth.ResourceTest > shouldThrowOnTwoPartStringWithUnknownResourceType PASSED
kafka.security.auth.ResourceTest > shouldThrowOnBadResourceTypeSeparator STARTED
kafka.security.auth.ResourceTest > shouldThrowOnBadResourceTypeSeparator PASSED
kafka.security.auth.ResourceTest > shouldParseThreePartString STARTED
kafka.security.auth.ResourceTest > shouldParseThreePartString PASSED
kafka.security.auth.ResourceTest > shouldRoundTripViaString STARTED
kafka.security.auth.ResourceTest > shouldRoundTripViaString PASSED
kafka.security.auth.ResourceTest > shouldParseThreePartWithEmbeddedSeparators STARTED
kafka.security.auth.ResourceTest > shouldParseThreePartWithEmbeddedSeparators PASSED
kafka.security.auth.AclTest > testAclJsonConversion STARTED
kafka.security.auth.AclTest > testAclJsonConversion PASSED
kafka.security.auth.OperationTest > testJavaConversions STARTED
kafka.security.auth.OperationTest > testJavaConversions PASSED
kafka.security.auth.PermissionTypeTest > testJavaConversions STARTED
kafka.security.auth.PermissionTypeTest > testJavaConversions PASSED
kafka.security.auth.PermissionTypeTest > testFromString STARTED
kafka.security.auth.PermissionTypeTest > testFromString PASSED
kafka.security.token.delegation.DelegationTokenManagerTest > testPeriodicTokenExpiry STARTED
kafka.security.token.delegation.DelegationTokenManagerTest > testPeriodicTokenExpiry PASSED
kafka.security.token.delegation.DelegationTokenManagerTest > testTokenRequestsWithDelegationTokenDisabled STARTED
kafka.security.token.delegation.DelegationTokenManagerTest > testTokenRequestsWithDelegationTokenDisabled PASSED
kafka.security.token.delegation.DelegationTokenManagerTest > testDescribeToken STARTED
kafka.security.token.delegation.DelegationTokenManagerTest > testDescribeToken PASSED
kafka.security.token.delegation.DelegationTokenManagerTest > testCreateToken STARTED
kafka.security.token.delegation.DelegationTokenManagerTest > testCreateToken PASSED
kafka.security.token.delegation.DelegationTokenManagerTest > testExpireToken STARTED
kafka.security.token.delegation.DelegationTokenManagerTest > testExpireToken PASSED
kafka.security.token.delegation.DelegationTokenManagerTest > testRenewToken STARTED
kafka.security.token.delegation.DelegationTokenManagerTest > testRenewToken PASSED
> Task :clients:compileJava UP-TO-DATE
> Task :clients:processResources UP-TO-DATE
> Task :clients:classes UP-TO-DATE
> Task :clients:checkstyleMain
[ant:checkstyle] [ERROR] <https://builds.apache.org/job/kafka-2.1-jdk8/ws/clients/src/main/java/org/apache/kafka/clients/producer/KafkaProducer.java>:1200:13: '}' at column 13 should be on the same line as the next part of a multi-block statement (one that directly contains multiple blocks: if/else-if/else, do/while or try/catch/finally). [RightCurly]
> Task :clients:checkstyleMain FAILED
FAILURE: Build failed with an exception.
* What went wrong:
Execution failed for task ':clients:checkstyleMain'.
> Checkstyle rule violations were found. See the report at: file://<https://builds.apache.org/job/kafka-2.1-jdk8/ws/clients/build/reports/checkstyle/main.html>
Checkstyle files with violations: 1
Checkstyle violations by severity: [error:1]
* Try:
Run with --stacktrace option to get the stack trace. Run with --info or --debug option to get more log output. Run with --scan to get full insights.
* Get more help at https://help.gradle.org
BUILD FAILED in 3h 51m 45s
30 actionable tasks: 11 executed, 19 up-to-date
Build step 'Execute shell' marked build as failure
[FINDBUGS] Collecting findbugs analysis files...
Setting GRADLE_4_8_1_HOME=/home/jenkins/tools/gradle/4.8.1
[FINDBUGS] Searching for all files in <https://builds.apache.org/job/kafka-2.1-jdk8/ws/> that match the pattern **/build/reports/findbugs/*.xml
[FINDBUGS] No files found. Configuration error?
Setting GRADLE_4_8_1_HOME=/home/jenkins/tools/gradle/4.8.1
Setting GRADLE_4_8_1_HOME=/home/jenkins/tools/gradle/4.8.1
<Git Blamer> Using GitBlamer to create author and commit information for all warnings.
<Git Blamer> GIT_COMMIT=93d29b9059ad821edd2c83035b82adc7e9402de6, workspace=<https://builds.apache.org/job/kafka-2.1-jdk8/ws/>
[FINDBUGS] Computing warning deltas based on reference build #96
Recording test results
Setting GRADLE_4_8_1_HOME=/home/jenkins/tools/gradle/4.8.1
Setting GRADLE_4_8_1_HOME=/home/jenkins/tools/gradle/4.8.1
Not sending mail to unregistered user wangguoz@gmail.com
Not sending mail to unregistered user ismael@juma.me.uk
Not sending mail to unregistered user manikumar.reddy@gmail.com
Build failed in Jenkins: kafka-2.1-jdk8 #108
Posted by Apache Jenkins Server <je...@builds.apache.org>.
See <https://builds.apache.org/job/kafka-2.1-jdk8/108/display/redirect?page=changes>
Changes:
[wangguoz] KAFKA-7652: Part I; Fix SessionStore's findSession(single-key) (#6134)
------------------------------------------
[...truncated 914.32 KB...]
kafka.api.GroupAuthorizerIntegrationTest > shouldThrowTransactionalIdAuthorizationExceptionWhenNoTransactionAccessOnSendOffsetsToTxn STARTED
kafka.api.GroupAuthorizerIntegrationTest > shouldThrowTransactionalIdAuthorizationExceptionWhenNoTransactionAccessOnSendOffsetsToTxn PASSED
kafka.api.GroupAuthorizerIntegrationTest > testCommitWithNoGroupAccess STARTED
kafka.api.GroupAuthorizerIntegrationTest > testCommitWithNoGroupAccess PASSED
kafka.api.GroupAuthorizerIntegrationTest > testTransactionalProducerInitTransactionsNoDescribeTransactionalIdAcl STARTED
kafka.api.GroupAuthorizerIntegrationTest > testTransactionalProducerInitTransactionsNoDescribeTransactionalIdAcl PASSED
kafka.api.GroupAuthorizerIntegrationTest > testUnauthorizedDeleteRecordsWithDescribe STARTED
kafka.api.GroupAuthorizerIntegrationTest > testUnauthorizedDeleteRecordsWithDescribe PASSED
kafka.api.GroupAuthorizerIntegrationTest > testCreateTopicAuthorizationWithClusterCreate STARTED
kafka.api.GroupAuthorizerIntegrationTest > testCreateTopicAuthorizationWithClusterCreate PASSED
kafka.api.GroupAuthorizerIntegrationTest > testOffsetFetchWithTopicAndGroupRead STARTED
kafka.api.GroupAuthorizerIntegrationTest > testOffsetFetchWithTopicAndGroupRead PASSED
kafka.api.GroupAuthorizerIntegrationTest > testCommitWithTopicDescribe STARTED
kafka.api.GroupAuthorizerIntegrationTest > testCommitWithTopicDescribe PASSED
kafka.api.GroupAuthorizerIntegrationTest > testAuthorizationWithTopicExisting STARTED
kafka.api.GroupAuthorizerIntegrationTest > testAuthorizationWithTopicExisting PASSED
kafka.api.GroupAuthorizerIntegrationTest > testUnauthorizedDeleteRecordsWithoutDescribe STARTED
kafka.api.GroupAuthorizerIntegrationTest > testUnauthorizedDeleteRecordsWithoutDescribe PASSED
kafka.api.GroupAuthorizerIntegrationTest > testMetadataWithTopicDescribe STARTED
kafka.api.GroupAuthorizerIntegrationTest > testMetadataWithTopicDescribe PASSED
kafka.api.GroupAuthorizerIntegrationTest > testProduceWithTopicDescribe STARTED
kafka.api.GroupAuthorizerIntegrationTest > testProduceWithTopicDescribe PASSED
kafka.api.GroupAuthorizerIntegrationTest > testDescribeGroupApiWithNoGroupAcl STARTED
kafka.api.GroupAuthorizerIntegrationTest > testDescribeGroupApiWithNoGroupAcl PASSED
kafka.api.GroupAuthorizerIntegrationTest > testPatternSubscriptionMatchingInternalTopic STARTED
kafka.api.GroupAuthorizerIntegrationTest > testPatternSubscriptionMatchingInternalTopic PASSED
kafka.api.GroupAuthorizerIntegrationTest > testSendOffsetsWithNoConsumerGroupDescribeAccess STARTED
kafka.api.GroupAuthorizerIntegrationTest > testSendOffsetsWithNoConsumerGroupDescribeAccess PASSED
kafka.api.GroupAuthorizerIntegrationTest > testOffsetFetchTopicDescribe STARTED
kafka.api.GroupAuthorizerIntegrationTest > testOffsetFetchTopicDescribe PASSED
kafka.api.GroupAuthorizerIntegrationTest > testCommitWithTopicAndGroupRead STARTED
kafka.api.GroupAuthorizerIntegrationTest > testCommitWithTopicAndGroupRead PASSED
kafka.api.GroupAuthorizerIntegrationTest > testIdempotentProducerNoIdempotentWriteAclInInitProducerId STARTED
kafka.api.GroupAuthorizerIntegrationTest > testIdempotentProducerNoIdempotentWriteAclInInitProducerId PASSED
kafka.api.GroupAuthorizerIntegrationTest > testSimpleConsumeWithExplicitSeekAndNoGroupAccess STARTED
kafka.api.GroupAuthorizerIntegrationTest > testSimpleConsumeWithExplicitSeekAndNoGroupAccess PASSED
kafka.api.SaslPlaintextConsumerTest > testCoordinatorFailover STARTED
kafka.api.SaslPlaintextConsumerTest > testCoordinatorFailover PASSED
kafka.api.SaslPlaintextConsumerTest > testSimpleConsumption STARTED
kafka.api.SaslPlaintextConsumerTest > testSimpleConsumption PASSED
kafka.api.TransactionsTest > testBasicTransactions STARTED
kafka.api.TransactionsTest > testBasicTransactions PASSED
kafka.api.TransactionsTest > testFencingOnSendOffsets STARTED
kafka.api.TransactionsTest > testFencingOnSendOffsets PASSED
kafka.api.TransactionsTest > testFencingOnAddPartitions STARTED
kafka.api.TransactionsTest > testFencingOnAddPartitions PASSED
kafka.api.TransactionsTest > testFencingOnTransactionExpiration STARTED
kafka.api.TransactionsTest > testFencingOnTransactionExpiration PASSED
kafka.api.TransactionsTest > testDelayedFetchIncludesAbortedTransaction STARTED
kafka.api.TransactionsTest > testDelayedFetchIncludesAbortedTransaction PASSED
kafka.api.TransactionsTest > testOffsetMetadataInSendOffsetsToTransaction STARTED
kafka.api.TransactionsTest > testOffsetMetadataInSendOffsetsToTransaction PASSED
kafka.api.TransactionsTest > testConsecutivelyRunInitTransactions STARTED
kafka.api.TransactionsTest > testConsecutivelyRunInitTransactions PASSED
kafka.api.TransactionsTest > testReadCommittedConsumerShouldNotSeeUndecidedData STARTED
kafka.api.TransactionsTest > testReadCommittedConsumerShouldNotSeeUndecidedData PASSED
kafka.api.TransactionsTest > testFencingOnSend STARTED
kafka.api.TransactionsTest > testFencingOnSend PASSED
kafka.api.TransactionsTest > testFencingOnCommit STARTED
kafka.api.TransactionsTest > testFencingOnCommit PASSED
kafka.api.TransactionsTest > testMultipleMarkersOneLeader STARTED
kafka.api.TransactionsTest > testMultipleMarkersOneLeader PASSED
kafka.api.TransactionsTest > testSendOffsets STARTED
kafka.api.TransactionsTest > testSendOffsets PASSED
kafka.api.LogAppendTimeTest > testProduceConsume STARTED
kafka.api.LogAppendTimeTest > testProduceConsume PASSED
kafka.api.SaslPlainSslEndToEndAuthorizationTest > testAcls STARTED
kafka.api.SaslPlainSslEndToEndAuthorizationTest > testAcls PASSED
kafka.api.SaslPlainSslEndToEndAuthorizationTest > testTwoConsumersWithDifferentSaslCredentials STARTED
kafka.api.SaslPlainSslEndToEndAuthorizationTest > testTwoConsumersWithDifferentSaslCredentials PASSED
kafka.api.SaslPlainSslEndToEndAuthorizationTest > testNoConsumeWithoutDescribeAclViaSubscribe STARTED
kafka.api.SaslPlainSslEndToEndAuthorizationTest > testNoConsumeWithoutDescribeAclViaSubscribe PASSED
kafka.api.SaslPlainSslEndToEndAuthorizationTest > testProduceConsumeWithPrefixedAcls STARTED
kafka.api.SaslPlainSslEndToEndAuthorizationTest > testProduceConsumeWithPrefixedAcls PASSED
kafka.api.SaslPlainSslEndToEndAuthorizationTest > testProduceConsumeViaAssign STARTED
kafka.api.SaslPlainSslEndToEndAuthorizationTest > testProduceConsumeViaAssign PASSED
kafka.api.SaslPlainSslEndToEndAuthorizationTest > testNoConsumeWithDescribeAclViaAssign STARTED
kafka.api.SaslPlainSslEndToEndAuthorizationTest > testNoConsumeWithDescribeAclViaAssign PASSED
kafka.api.SaslPlainSslEndToEndAuthorizationTest > testProduceConsumeTopicAutoCreateTopicCreateAcl STARTED
kafka.api.SaslPlainSslEndToEndAuthorizationTest > testProduceConsumeTopicAutoCreateTopicCreateAcl PASSED
kafka.api.SaslPlainSslEndToEndAuthorizationTest > testProduceConsumeWithWildcardAcls STARTED
kafka.api.SaslPlainSslEndToEndAuthorizationTest > testProduceConsumeWithWildcardAcls PASSED
kafka.api.SaslPlainSslEndToEndAuthorizationTest > testNoConsumeWithDescribeAclViaSubscribe STARTED
kafka.api.SaslPlainSslEndToEndAuthorizationTest > testNoConsumeWithDescribeAclViaSubscribe PASSED
kafka.api.SaslPlainSslEndToEndAuthorizationTest > testNoConsumeWithoutDescribeAclViaAssign STARTED
kafka.api.SaslPlainSslEndToEndAuthorizationTest > testNoConsumeWithoutDescribeAclViaAssign PASSED
kafka.api.SaslPlainSslEndToEndAuthorizationTest > testNoGroupAcl STARTED
kafka.api.SaslPlainSslEndToEndAuthorizationTest > testNoGroupAcl PASSED
kafka.api.SaslPlainSslEndToEndAuthorizationTest > testNoProduceWithDescribeAcl STARTED
kafka.api.SaslPlainSslEndToEndAuthorizationTest > testNoProduceWithDescribeAcl PASSED
kafka.api.SaslPlainSslEndToEndAuthorizationTest > testProduceConsumeViaSubscribe STARTED
kafka.api.SaslPlainSslEndToEndAuthorizationTest > testProduceConsumeViaSubscribe PASSED
kafka.api.SaslPlainSslEndToEndAuthorizationTest > testNoProduceWithoutDescribeAcl STARTED
kafka.api.SaslPlainSslEndToEndAuthorizationTest > testNoProduceWithoutDescribeAcl PASSED
kafka.api.ClientIdQuotaTest > testProducerConsumerOverrideUnthrottled STARTED
kafka.api.ClientIdQuotaTest > testProducerConsumerOverrideUnthrottled PASSED
kafka.api.ClientIdQuotaTest > testThrottledProducerConsumer STARTED
kafka.api.ClientIdQuotaTest > testThrottledProducerConsumer PASSED
kafka.api.ClientIdQuotaTest > testQuotaOverrideDelete STARTED
kafka.api.ClientIdQuotaTest > testQuotaOverrideDelete PASSED
kafka.api.ClientIdQuotaTest > testThrottledRequest STARTED
kafka.api.ClientIdQuotaTest > testThrottledRequest PASSED
unit.kafka.utils.ThrottlerTest > testThrottleDesiredRate STARTED
unit.kafka.utils.ThrottlerTest > testThrottleDesiredRate PASSED
> Task :clients:compileJava UP-TO-DATE
> Task :clients:processResources UP-TO-DATE
> Task :clients:classes UP-TO-DATE
> Task :clients:checkstyleMain
[ant:checkstyle] [ERROR] <https://builds.apache.org/job/kafka-2.1-jdk8/ws/clients/src/main/java/org/apache/kafka/clients/producer/KafkaProducer.java>:1200:13: '}' at column 13 should be on the same line as the next part of a multi-block statement (one that directly contains multiple blocks: if/else-if/else, do/while or try/catch/finally). [RightCurly]
> Task :clients:checkstyleMain FAILED
FAILURE: Build failed with an exception.
* What went wrong:
Execution failed for task ':clients:checkstyleMain'.
> Checkstyle rule violations were found. See the report at: file://<https://builds.apache.org/job/kafka-2.1-jdk8/ws/clients/build/reports/checkstyle/main.html>
Checkstyle files with violations: 1
Checkstyle violations by severity: [error:1]
* Try:
Run with --stacktrace option to get the stack trace. Run with --info or --debug option to get more log output. Run with --scan to get full insights.
* Get more help at https://help.gradle.org
BUILD FAILED in 3h 42m 49s
30 actionable tasks: 11 executed, 19 up-to-date
Build step 'Execute shell' marked build as failure
[FINDBUGS] Collecting findbugs analysis files...
Setting GRADLE_4_8_1_HOME=/home/jenkins/tools/gradle/4.8.1
[FINDBUGS] Searching for all files in <https://builds.apache.org/job/kafka-2.1-jdk8/ws/> that match the pattern **/build/reports/findbugs/*.xml
[FINDBUGS] No files found. Configuration error?
Setting GRADLE_4_8_1_HOME=/home/jenkins/tools/gradle/4.8.1
Setting GRADLE_4_8_1_HOME=/home/jenkins/tools/gradle/4.8.1
<Git Blamer> Using GitBlamer to create author and commit information for all warnings.
<Git Blamer> GIT_COMMIT=2436c8f762043139ee3cd7de86b7d6f137781f9f, workspace=<https://builds.apache.org/job/kafka-2.1-jdk8/ws/>
[FINDBUGS] Computing warning deltas based on reference build #96
Recording test results
Setting GRADLE_4_8_1_HOME=/home/jenkins/tools/gradle/4.8.1
Setting GRADLE_4_8_1_HOME=/home/jenkins/tools/gradle/4.8.1
Not sending mail to unregistered user wangguoz@gmail.com
Not sending mail to unregistered user manikumar.reddy@gmail.com
Build failed in Jenkins: kafka-2.1-jdk8 #107
Posted by Apache Jenkins Server <je...@builds.apache.org>.
See <https://builds.apache.org/job/kafka-2.1-jdk8/107/display/redirect?page=changes>
Changes:
[me] MINOR: Start Connect REST server in standalone mode to match distributed
------------------------------------------
[...truncated 912.04 KB...]
kafka.server.KafkaConfigTest > testInterBrokerListenerNameAndSecurityProtocolSet STARTED
kafka.server.KafkaConfigTest > testInterBrokerListenerNameAndSecurityProtocolSet PASSED
kafka.server.KafkaConfigTest > testFromPropsInvalid STARTED
kafka.server.KafkaConfigTest > testFromPropsInvalid PASSED
kafka.server.KafkaConfigTest > testInvalidCompressionType STARTED
kafka.server.KafkaConfigTest > testInvalidCompressionType PASSED
kafka.server.KafkaConfigTest > testAdvertiseHostNameDefault STARTED
kafka.server.KafkaConfigTest > testAdvertiseHostNameDefault PASSED
kafka.server.KafkaConfigTest > testLogRetentionTimeMinutesProvided STARTED
kafka.server.KafkaConfigTest > testLogRetentionTimeMinutesProvided PASSED
kafka.server.KafkaConfigTest > testValidCompressionType STARTED
kafka.server.KafkaConfigTest > testValidCompressionType PASSED
kafka.server.KafkaConfigTest > testUncleanElectionInvalid STARTED
kafka.server.KafkaConfigTest > testUncleanElectionInvalid PASSED
kafka.server.KafkaConfigTest > testListenerNamesWithAdvertisedListenerUnset STARTED
kafka.server.KafkaConfigTest > testListenerNamesWithAdvertisedListenerUnset PASSED
kafka.server.KafkaConfigTest > testLogRetentionTimeBothMinutesAndMsProvided STARTED
kafka.server.KafkaConfigTest > testLogRetentionTimeBothMinutesAndMsProvided PASSED
kafka.server.KafkaConfigTest > testLogRollTimeMsProvided STARTED
kafka.server.KafkaConfigTest > testLogRollTimeMsProvided PASSED
kafka.server.KafkaConfigTest > testUncleanLeaderElectionDefault STARTED
kafka.server.KafkaConfigTest > testUncleanLeaderElectionDefault PASSED
kafka.server.KafkaConfigTest > testInvalidAdvertisedListenersProtocol STARTED
kafka.server.KafkaConfigTest > testInvalidAdvertisedListenersProtocol PASSED
kafka.server.KafkaConfigTest > testUncleanElectionEnabled STARTED
kafka.server.KafkaConfigTest > testUncleanElectionEnabled PASSED
kafka.server.KafkaConfigTest > testInterBrokerVersionMessageFormatCompatibility STARTED
kafka.server.KafkaConfigTest > testInterBrokerVersionMessageFormatCompatibility PASSED
kafka.server.KafkaConfigTest > testAdvertisePortDefault STARTED
kafka.server.KafkaConfigTest > testAdvertisePortDefault PASSED
kafka.server.KafkaConfigTest > testVersionConfiguration STARTED
kafka.server.KafkaConfigTest > testVersionConfiguration PASSED
kafka.server.KafkaConfigTest > testEqualAdvertisedListenersProtocol STARTED
kafka.server.KafkaConfigTest > testEqualAdvertisedListenersProtocol PASSED
kafka.server.ListOffsetsRequestTest > testListOffsetsErrorCodes STARTED
kafka.server.ListOffsetsRequestTest > testListOffsetsErrorCodes PASSED
kafka.server.ListOffsetsRequestTest > testCurrentEpochValidation STARTED
kafka.server.ListOffsetsRequestTest > testCurrentEpochValidation PASSED
kafka.server.CreateTopicsRequestTest > testValidCreateTopicsRequests STARTED
kafka.server.CreateTopicsRequestTest > testValidCreateTopicsRequests PASSED
kafka.server.CreateTopicsRequestTest > testErrorCreateTopicsRequests STARTED
kafka.server.CreateTopicsRequestTest > testErrorCreateTopicsRequests PASSED
kafka.server.CreateTopicsRequestTest > testInvalidCreateTopicsRequests STARTED
kafka.server.CreateTopicsRequestTest > testInvalidCreateTopicsRequests PASSED
kafka.server.CreateTopicsRequestTest > testNotController STARTED
kafka.server.CreateTopicsRequestTest > testNotController PASSED
kafka.server.CreateTopicsRequestWithPolicyTest > testValidCreateTopicsRequests STARTED
kafka.server.CreateTopicsRequestWithPolicyTest > testValidCreateTopicsRequests PASSED
kafka.server.CreateTopicsRequestWithPolicyTest > testErrorCreateTopicsRequests STARTED
kafka.server.CreateTopicsRequestWithPolicyTest > testErrorCreateTopicsRequests PASSED
kafka.server.FetchRequestDownConversionConfigTest > testV1FetchWithDownConversionDisabled STARTED
kafka.server.FetchRequestDownConversionConfigTest > testV1FetchWithDownConversionDisabled PASSED
kafka.server.FetchRequestDownConversionConfigTest > testV1FetchFromReplica STARTED
kafka.server.FetchRequestDownConversionConfigTest > testV1FetchFromReplica PASSED
kafka.server.FetchRequestDownConversionConfigTest > testLatestFetchWithDownConversionDisabled STARTED
kafka.server.FetchRequestDownConversionConfigTest > testLatestFetchWithDownConversionDisabled PASSED
kafka.server.FetchRequestDownConversionConfigTest > testV1FetchWithTopicLevelOverrides STARTED
kafka.server.FetchRequestDownConversionConfigTest > testV1FetchWithTopicLevelOverrides PASSED
kafka.server.SaslApiVersionsRequestTest > testApiVersionsRequestWithUnsupportedVersion STARTED
kafka.server.SaslApiVersionsRequestTest > testApiVersionsRequestWithUnsupportedVersion PASSED
kafka.server.SaslApiVersionsRequestTest > testApiVersionsRequestBeforeSaslHandshakeRequest STARTED
kafka.server.SaslApiVersionsRequestTest > testApiVersionsRequestBeforeSaslHandshakeRequest PASSED
kafka.server.SaslApiVersionsRequestTest > testApiVersionsRequestAfterSaslHandshakeRequest STARTED
kafka.server.SaslApiVersionsRequestTest > testApiVersionsRequestAfterSaslHandshakeRequest PASSED
kafka.server.LogDirFailureTest > testIOExceptionDuringLogRoll STARTED
kafka.server.LogDirFailureTest > testIOExceptionDuringLogRoll PASSED
kafka.server.LogDirFailureTest > testIOExceptionDuringCheckpoint STARTED
kafka.server.LogDirFailureTest > testIOExceptionDuringCheckpoint PASSED
kafka.server.LogDirFailureTest > brokerWithOldInterBrokerProtocolShouldHaltOnLogDirFailure STARTED
kafka.server.LogDirFailureTest > brokerWithOldInterBrokerProtocolShouldHaltOnLogDirFailure PASSED
kafka.server.LogDirFailureTest > testReplicaFetcherThreadAfterLogDirFailureOnFollower STARTED
kafka.server.LogDirFailureTest > testReplicaFetcherThreadAfterLogDirFailureOnFollower PASSED
kafka.server.AlterReplicaLogDirsRequestTest > testAlterReplicaLogDirsRequest STARTED
kafka.server.AlterReplicaLogDirsRequestTest > testAlterReplicaLogDirsRequest PASSED
kafka.server.AlterReplicaLogDirsRequestTest > testAlterReplicaLogDirsRequestErrorCode STARTED
kafka.server.AlterReplicaLogDirsRequestTest > testAlterReplicaLogDirsRequestErrorCode PASSED
kafka.server.ServerGenerateBrokerIdTest > testBrokerMetadataOnIdCollision STARTED
kafka.server.ServerGenerateBrokerIdTest > testBrokerMetadataOnIdCollision PASSED
kafka.server.ServerGenerateBrokerIdTest > testAutoGenerateBrokerId STARTED
kafka.server.ServerGenerateBrokerIdTest > testAutoGenerateBrokerId PASSED
kafka.server.ServerGenerateBrokerIdTest > testMultipleLogDirsMetaProps STARTED
kafka.server.ServerGenerateBrokerIdTest > testMultipleLogDirsMetaProps PASSED
kafka.server.ServerGenerateBrokerIdTest > testDisableGeneratedBrokerId STARTED
kafka.server.ServerGenerateBrokerIdTest > testDisableGeneratedBrokerId PASSED
kafka.server.ServerGenerateBrokerIdTest > testUserConfigAndGeneratedBrokerId STARTED
kafka.server.ServerGenerateBrokerIdTest > testUserConfigAndGeneratedBrokerId PASSED
kafka.server.ServerGenerateBrokerIdTest > testConsistentBrokerIdFromUserConfigAndMetaProps STARTED
kafka.server.ServerGenerateBrokerIdTest > testConsistentBrokerIdFromUserConfigAndMetaProps PASSED
kafka.server.DeleteTopicsRequestWithDeletionDisabledTest > testDeleteRecordsRequest STARTED
kafka.server.DeleteTopicsRequestWithDeletionDisabledTest > testDeleteRecordsRequest PASSED
kafka.server.ServerShutdownTest > testCleanShutdownAfterFailedStartup STARTED
kafka.server.ServerShutdownTest > testCleanShutdownAfterFailedStartup PASSED
kafka.server.ServerShutdownTest > testConsecutiveShutdown STARTED
kafka.server.ServerShutdownTest > testConsecutiveShutdown PASSED
kafka.server.ServerShutdownTest > testControllerShutdownDuringSend STARTED
kafka.server.ServerShutdownTest > testControllerShutdownDuringSend PASSED
kafka.server.ServerShutdownTest > testCleanShutdownAfterFailedStartupDueToCorruptLogs STARTED
kafka.server.ServerShutdownTest > testCleanShutdownAfterFailedStartupDueToCorruptLogs PASSED
kafka.server.ServerShutdownTest > testCleanShutdown STARTED
kafka.server.ServerShutdownTest > testCleanShutdown PASSED
kafka.server.ServerShutdownTest > testCleanShutdownWithDeleteTopicEnabled STARTED
kafka.server.ServerShutdownTest > testCleanShutdownWithDeleteTopicEnabled PASSED
unit.kafka.utils.ThrottlerTest > testThrottleDesiredRate STARTED
unit.kafka.utils.ThrottlerTest > testThrottleDesiredRate PASSED
> Task :clients:compileJava UP-TO-DATE
> Task :clients:processResources UP-TO-DATE
> Task :clients:classes UP-TO-DATE
> Task :clients:checkstyleMain
[ant:checkstyle] [ERROR] <https://builds.apache.org/job/kafka-2.1-jdk8/ws/clients/src/main/java/org/apache/kafka/clients/producer/KafkaProducer.java>:1200:13: '}' at column 13 should be on the same line as the next part of a multi-block statement (one that directly contains multiple blocks: if/else-if/else, do/while or try/catch/finally). [RightCurly]
> Task :clients:checkstyleMain FAILED
FAILURE: Build failed with an exception.
* What went wrong:
Execution failed for task ':clients:checkstyleMain'.
> Checkstyle rule violations were found. See the report at: file://<https://builds.apache.org/job/kafka-2.1-jdk8/ws/clients/build/reports/checkstyle/main.html>
Checkstyle files with violations: 1
Checkstyle violations by severity: [error:1]
* Try:
Run with --stacktrace option to get the stack trace. Run with --info or --debug option to get more log output. Run with --scan to get full insights.
* Get more help at https://help.gradle.org
BUILD FAILED in 3h 34m 58s
30 actionable tasks: 11 executed, 19 up-to-date
Build step 'Execute shell' marked build as failure
[FINDBUGS] Collecting findbugs analysis files...
Setting GRADLE_4_8_1_HOME=/home/jenkins/tools/gradle/4.8.1
[FINDBUGS] Searching for all files in <https://builds.apache.org/job/kafka-2.1-jdk8/ws/> that match the pattern **/build/reports/findbugs/*.xml
[FINDBUGS] No files found. Configuration error?
Setting GRADLE_4_8_1_HOME=/home/jenkins/tools/gradle/4.8.1
Setting GRADLE_4_8_1_HOME=/home/jenkins/tools/gradle/4.8.1
<Git Blamer> Using GitBlamer to create author and commit information for all warnings.
<Git Blamer> GIT_COMMIT=93d8f7a906203412d2e9a52649e87842df2dba17, workspace=<https://builds.apache.org/job/kafka-2.1-jdk8/ws/>
[FINDBUGS] Computing warning deltas based on reference build #96
Recording test results
Setting GRADLE_4_8_1_HOME=/home/jenkins/tools/gradle/4.8.1
Setting GRADLE_4_8_1_HOME=/home/jenkins/tools/gradle/4.8.1
Not sending mail to unregistered user wangguoz@gmail.com
Not sending mail to unregistered user manikumar.reddy@gmail.com