You are viewing a plain text version of this content. The canonical link for it is here.
Posted to commits@beam.apache.org by "Batkhuyag Batsaikhan (JIRA)" <ji...@apache.org> on 2018/07/25 20:57:00 UTC
[jira] [Commented] (BEAM-4637) Flaky post-commit test
org.apache.beam.examples.subprocess.ExampleEchoPipelineTest.testExampleEchoPipeline
[ https://issues.apache.org/jira/browse/BEAM-4637?page=com.atlassian.jira.plugin.system.issuetabpanels:comment-tabpanel&focusedCommentId=16556264#comment-16556264 ]
Batkhuyag Batsaikhan commented on BEAM-4637:
--------------------------------------------
h3. Stacktrace
org.apache.beam.sdk.Pipeline$PipelineExecutionException: java.lang.Exception: java.io.IOException: Cannot run program "/tmp/test-Echoo1592469548047731777/test-EchoAgain7719841557053972248.sh": error=26, Text file busy at org.apache.beam.runners.direct.DirectRunner$DirectPipelineResult.waitUntilFinish(DirectRunner.java:332) at org.apache.beam.runners.direct.DirectRunner$DirectPipelineResult.waitUntilFinish(DirectRunner.java:302) at org.apache.beam.runners.direct.DirectRunner.run(DirectRunner.java:197) at org.apache.beam.runners.direct.DirectRunner.run(DirectRunner.java:64) at org.apache.beam.sdk.Pipeline.run(Pipeline.java:313) at org.apache.beam.sdk.testing.TestPipeline.run(TestPipeline.java:350) at org.apache.beam.sdk.testing.TestPipeline.run(TestPipeline.java:331) at org.apache.beam.examples.subprocess.ExampleEchoPipelineTest.testExampleEchoPipeline(ExampleEchoPipelineTest.java:124) at sun.reflect.NativeMethodAccessorImpl.invoke0(Native Method) at sun.reflect.NativeMethodAccessorImpl.invoke(NativeMethodAccessorImpl.java:62) at sun.reflect.DelegatingMethodAccessorImpl.invoke(DelegatingMethodAccessorImpl.java:43) at java.lang.reflect.Method.invoke(Method.java:498) at org.junit.runners.model.FrameworkMethod$1.runReflectiveCall(FrameworkMethod.java:50) at org.junit.internal.runners.model.ReflectiveCallable.run(ReflectiveCallable.java:12) at org.junit.runners.model.FrameworkMethod.invokeExplosively(FrameworkMethod.java:47) at org.junit.internal.runners.statements.InvokeMethod.evaluate(InvokeMethod.java:17) at org.apache.beam.sdk.testing.TestPipeline$1.evaluate(TestPipeline.java:319) at org.junit.rules.RunRules.evaluate(RunRules.java:20) at org.junit.runners.ParentRunner.runLeaf(ParentRunner.java:325) at org.junit.runners.BlockJUnit4ClassRunner.runChild(BlockJUnit4ClassRunner.java:78) at org.junit.runners.BlockJUnit4ClassRunner.runChild(BlockJUnit4ClassRunner.java:57) at org.junit.runners.ParentRunner$3.run(ParentRunner.java:290) at org.junit.runners.ParentRunner$1.schedule(ParentRunner.java:71) at org.junit.runners.ParentRunner.runChildren(ParentRunner.java:288) at org.junit.runners.ParentRunner.access$000(ParentRunner.java:58) at org.junit.runners.ParentRunner$2.evaluate(ParentRunner.java:268) at org.junit.runners.ParentRunner.run(ParentRunner.java:363) at org.gradle.api.internal.tasks.testing.junit.JUnitTestClassExecutor.runTestClass(JUnitTestClassExecutor.java:106) at org.gradle.api.internal.tasks.testing.junit.JUnitTestClassExecutor.execute(JUnitTestClassExecutor.java:58) at org.gradle.api.internal.tasks.testing.junit.JUnitTestClassExecutor.execute(JUnitTestClassExecutor.java:38) at org.gradle.api.internal.tasks.testing.junit.AbstractJUnitTestClassProcessor.processTestClass(AbstractJUnitTestClassProcessor.java:66) at org.gradle.api.internal.tasks.testing.SuiteTestClassProcessor.processTestClass(SuiteTestClassProcessor.java:51) at sun.reflect.NativeMethodAccessorImpl.invoke0(Native Method) at sun.reflect.NativeMethodAccessorImpl.invoke(NativeMethodAccessorImpl.java:62) at sun.reflect.DelegatingMethodAccessorImpl.invoke(DelegatingMethodAccessorImpl.java:43) at java.lang.reflect.Method.invoke(Method.java:498) at org.gradle.internal.dispatch.ReflectionDispatch.dispatch(ReflectionDispatch.java:35) at org.gradle.internal.dispatch.ReflectionDispatch.dispatch(ReflectionDispatch.java:24) at org.gradle.internal.dispatch.ContextClassLoaderDispatch.dispatch(ContextClassLoaderDispatch.java:32) at org.gradle.internal.dispatch.ProxyDispatchAdapter$DispatchingInvocationHandler.invoke(ProxyDispatchAdapter.java:93) at com.sun.proxy.$Proxy2.processTestClass(Unknown Source) at org.gradle.api.internal.tasks.testing.worker.TestWorker.processTestClass(TestWorker.java:109) at sun.reflect.NativeMethodAccessorImpl.invoke0(Native Method) at sun.reflect.NativeMethodAccessorImpl.invoke(NativeMethodAccessorImpl.java:62) at sun.reflect.DelegatingMethodAccessorImpl.invoke(DelegatingMethodAccessorImpl.java:43) at java.lang.reflect.Method.invoke(Method.java:498) at org.gradle.internal.dispatch.ReflectionDispatch.dispatch(ReflectionDispatch.java:35) at org.gradle.internal.dispatch.ReflectionDispatch.dispatch(ReflectionDispatch.java:24) at org.gradle.internal.remote.internal.hub.MessageHubBackedObjectConnection$DispatchWrapper.dispatch(MessageHubBackedObjectConnection.java:155) at org.gradle.internal.remote.internal.hub.MessageHubBackedObjectConnection$DispatchWrapper.dispatch(MessageHubBackedObjectConnection.java:137) at org.gradle.internal.remote.internal.hub.MessageHub$Handler.run(MessageHub.java:404) at org.gradle.internal.concurrent.ExecutorPolicy$CatchAndRecordFailures.onExecute(ExecutorPolicy.java:63) at org.gradle.internal.concurrent.ManagedExecutorImpl$1.run(ManagedExecutorImpl.java:46) at java.util.concurrent.ThreadPoolExecutor.runWorker(ThreadPoolExecutor.java:1149) at java.util.concurrent.ThreadPoolExecutor$Worker.run(ThreadPoolExecutor.java:624) at org.gradle.internal.concurrent.ThreadFactoryImpl$ManagedThreadRunnable.run(ThreadFactoryImpl.java:55) at java.lang.Thread.run(Thread.java:748) Caused by: java.lang.Exception: java.io.IOException: Cannot run program "/tmp/test-Echoo1592469548047731777/test-EchoAgain7719841557053972248.sh": error=26, Text file busy at org.apache.beam.examples.subprocess.kernel.SubProcessKernel.execBinary(SubProcessKernel.java:170) at org.apache.beam.examples.subprocess.kernel.SubProcessKernel.exec(SubProcessKernel.java:68) at org.apache.beam.examples.subprocess.ExampleEchoPipelineTest$EchoInputDoFn.processElement(ExampleEchoPipelineTest.java:160) Caused by: java.io.IOException: Cannot run program "/tmp/test-Echoo1592469548047731777/test-EchoAgain7719841557053972248.sh": error=26, Text file busy at java.lang.ProcessBuilder.start(ProcessBuilder.java:1048) at org.apache.beam.examples.subprocess.kernel.SubProcessKernel.execBinary(SubProcessKernel.java:150) at org.apache.beam.examples.subprocess.kernel.SubProcessKernel.exec(SubProcessKernel.java:68) at org.apache.beam.examples.subprocess.ExampleEchoPipelineTest$EchoInputDoFn.processElement(ExampleEchoPipelineTest.java:160) at org.apache.beam.examples.subprocess.ExampleEchoPipelineTest$EchoInputDoFn$DoFnInvoker.invokeProcessElement(Unknown Source) at org.apache.beam.repackaged.beam_runners_direct_java.runners.core.SimpleDoFnRunner.invokeProcessElement(SimpleDoFnRunner.java:275) at org.apache.beam.repackaged.beam_runners_direct_java.runners.core.SimpleDoFnRunner.processElement(SimpleDoFnRunner.java:240) at org.apache.beam.repackaged.beam_runners_direct_java.runners.core.SimplePushbackSideInputDoFnRunner.processElementInReadyWindows(SimplePushbackSideInputDoFnRunner.java:78) at org.apache.beam.runners.direct.ParDoEvaluator.processElement(ParDoEvaluator.java:207) at org.apache.beam.runners.direct.DoFnLifecycleManagerRemovingTransformEvaluator.processElement(DoFnLifecycleManagerRemovingTransformEvaluator.java:55) at org.apache.beam.runners.direct.DirectTransformExecutor.processElements(DirectTransformExecutor.java:160) at org.apache.beam.runners.direct.DirectTransformExecutor.run(DirectTransformExecutor.java:124) at java.util.concurrent.Executors$RunnableAdapter.call(Executors.java:511) at java.util.concurrent.FutureTask.run(FutureTask.java:266) at java.util.concurrent.ThreadPoolExecutor.runWorker(ThreadPoolExecutor.java:1149) at java.util.concurrent.ThreadPoolExecutor$Worker.run(ThreadPoolExecutor.java:624) at java.lang.Thread.run(Thread.java:748) Caused by: java.io.IOException: error=26, Text file busy at java.lang.UNIXProcess.forkAndExec(Native Method) at java.lang.UNIXProcess.<init>(UNIXProcess.java:247) at java.lang.ProcessImpl.start(ProcessImpl.java:134) at java.lang.ProcessBuilder.start(ProcessBuilder.java:1029)
> Flaky post-commit test org.apache.beam.examples.subprocess.ExampleEchoPipelineTest.testExampleEchoPipeline
> ----------------------------------------------------------------------------------------------------------
>
> Key: BEAM-4637
> URL: https://issues.apache.org/jira/browse/BEAM-4637
> Project: Beam
> Issue Type: Sub-task
> Components: examples-java
> Reporter: Mikhail Gryzykhin
> Assignee: Batkhuyag Batsaikhan
> Priority: Critical
> Labels: flake
>
> Post commit test failed with "Text file busy" exception.
> [https://builds.apache.org/job/beam_PostCommit_Java_GradleBuild/916/testReport/junit/org.apache.beam.examples.subprocess/ExampleEchoPipelineTest/testExampleEchoPipeline/]
>
--
This message was sent by Atlassian JIRA
(v7.6.3#76005)