You are viewing a plain text version of this content. The canonical link for it is here.
Posted to dev@brooklyn.apache.org by Apache Jenkins Server <je...@builds.apache.org> on 2019/05/20 16:17:26 UTC
Build failed in Jenkins: brooklyn-master-build-docker #1931
See <https://builds.apache.org/job/brooklyn-master-build-docker/1931/display/redirect>
------------------------------------------
[...truncated 10.84 MB...]
2019-05-20 16:16:58,162 INFO - REST created catalog items: [BasicRegisteredType[my-jungle:0.1.2]]
2019-05-20 16:16:58,164 INFO - added, at: http://localhost:9998/catalog
2019-05-20 16:16:58,172 INFO - item: CatalogLocationSummary{config=[]}
2019-05-20 16:16:58,184 WARN - Request for bundle 'aws-ec2' was ignored as no framework available; and failed to find 'us-east-1' in plain old classpath
2019-05-20 16:16:58,192 INFO - summary: LocationSummary{id='my-jungle:0.1.2', type='null', catalog='CatalogLocationSummary{config=[]}', links={self=/locations/my-jungle:0.1.2}}
2019-05-20 16:16:58,198 WARN - Request for bundle 'aws-ec2' was ignored as no framework available; and failed to find 'us-east-1' in plain old classpath
2019-05-20 16:16:58,206 INFO - TESTNG PASSED: "Surefire test" - org.apache.brooklyn.rest.resources.LocationResourceTest.testAddNewLocationDefinition() finished in 92 ms
2019-05-20 16:16:58,206 INFO - TESTNG INVOKING CONFIGURATION: "Surefire test" - @AfterMethod org.apache.brooklyn.rest.testing.BrooklynRestApiTest.tearDownMethod()
2019-05-20 16:16:58,206 INFO - TESTNG PASSED CONFIGURATION: "Surefire test" - @AfterMethod org.apache.brooklyn.rest.testing.BrooklynRestApiTest.tearDownMethod() finished in 0 ms
2019-05-20 16:16:58,207 INFO - TESTNG INVOKING CONFIGURATION: "Surefire test" - @BeforeMethod org.apache.brooklyn.rest.testing.BrooklynRestApiTest.setUpMethod()
2019-05-20 16:16:58,207 INFO - TESTNG PASSED CONFIGURATION: "Surefire test" - @BeforeMethod org.apache.brooklyn.rest.testing.BrooklynRestApiTest.setUpMethod() finished in 0 ms
2019-05-20 16:16:58,207 INFO - TESTNG INVOKING: "Surefire test" - org.apache.brooklyn.rest.resources.LocationResourceTest.testDisplayNameInConfig()
2019-05-20 16:16:58,230 WARN - Request for bundle 'byon' was ignored as no framework available; and failed to find '(hosts="10.10.10.102")' in plain old classpath
2019-05-20 16:16:58,246 WARN - Request for bundle 'byon' was ignored as no framework available; and failed to find '(hosts="10.10.10.102")' in plain old classpath
2019-05-20 16:16:58,256 WARN - Request for bundle 'byon' was ignored as no framework available; and failed to find '(hosts="10.10.10.102")' in plain old classpath
2019-05-20 16:16:58,262 INFO - REST created catalog items: [BasicRegisteredType[test_config_displayName_id:0.1.2]]
2019-05-20 16:16:58,264 INFO - added, at: http://localhost:9998/catalog
2019-05-20 16:16:58,272 INFO - item: CatalogLocationSummary{config=[]}
2019-05-20 16:16:58,284 WARN - Request for bundle 'byon' was ignored as no framework available; and failed to find '(hosts="10.10.10.102")' in plain old classpath
2019-05-20 16:16:58,293 INFO - summary: LocationSummary{id='test_config_displayName_id:0.1.2', type='null', catalog='CatalogLocationSummary{config=[]}', links={self=/locations/test_config_displayName_id:0.1.2}}
2019-05-20 16:16:58,297 WARN - Request for bundle 'byon' was ignored as no framework available; and failed to find '(hosts="10.10.10.102")' in plain old classpath
2019-05-20 16:16:58,303 INFO - TESTNG PASSED: "Surefire test" - org.apache.brooklyn.rest.resources.LocationResourceTest.testDisplayNameInConfig() finished in 95 ms
2019-05-20 16:16:58,303 INFO - TESTNG INVOKING CONFIGURATION: "Surefire test" - @AfterMethod org.apache.brooklyn.rest.testing.BrooklynRestApiTest.tearDownMethod()
2019-05-20 16:16:58,303 INFO - TESTNG PASSED CONFIGURATION: "Surefire test" - @AfterMethod org.apache.brooklyn.rest.testing.BrooklynRestApiTest.tearDownMethod() finished in 0 ms
2019-05-20 16:16:58,303 INFO - TESTNG INVOKING CONFIGURATION: "Surefire test" - @BeforeMethod org.apache.brooklyn.rest.testing.BrooklynRestApiTest.setUpMethod()
2019-05-20 16:16:58,303 INFO - TESTNG PASSED CONFIGURATION: "Surefire test" - @BeforeMethod org.apache.brooklyn.rest.testing.BrooklynRestApiTest.setUpMethod() finished in 0 ms
2019-05-20 16:16:58,303 INFO - TESTNG INVOKING: "Surefire test" - org.apache.brooklyn.rest.resources.LocationResourceTest.testDisplayNameInItems()
2019-05-20 16:16:58,319 WARN - Request for bundle 'byon' was ignored as no framework available; and failed to find '(hosts="10.10.10.102")' in plain old classpath
2019-05-20 16:16:58,328 WARN - Request for bundle 'byon' was ignored as no framework available; and failed to find '(hosts="10.10.10.102")' in plain old classpath
2019-05-20 16:16:58,338 WARN - Request for bundle 'byon' was ignored as no framework available; and failed to find '(hosts="10.10.10.102")' in plain old classpath
2019-05-20 16:16:58,344 INFO - REST created catalog items: [BasicRegisteredType[test_items_displayName_id:0.1.2]]
2019-05-20 16:16:58,346 INFO - added, at: http://localhost:9998/catalog
2019-05-20 16:16:58,355 INFO - item: CatalogLocationSummary{config=[]}
2019-05-20 16:16:58,371 WARN - Request for bundle 'byon' was ignored as no framework available; and failed to find '(hosts="10.10.10.102")' in plain old classpath
[GC (Allocation Failure) 233805K->67231K(744448K), 0.0277530 secs]
2019-05-20 16:16:58,409 INFO - summary: LocationSummary{id='test_items_displayName_id:0.1.2', type='null', catalog='CatalogLocationSummary{config=[]}', links={self=/locations/test_items_displayName_id:0.1.2}}
2019-05-20 16:16:58,414 WARN - Request for bundle 'byon' was ignored as no framework available; and failed to find '(hosts="10.10.10.102")' in plain old classpath
2019-05-20 16:16:58,420 INFO - TESTNG PASSED: "Surefire test" - org.apache.brooklyn.rest.resources.LocationResourceTest.testDisplayNameInItems() finished in 116 ms
2019-05-20 16:16:58,420 INFO - TESTNG INVOKING CONFIGURATION: "Surefire test" - @AfterMethod org.apache.brooklyn.rest.testing.BrooklynRestApiTest.tearDownMethod()
2019-05-20 16:16:58,420 INFO - TESTNG PASSED CONFIGURATION: "Surefire test" - @AfterMethod org.apache.brooklyn.rest.testing.BrooklynRestApiTest.tearDownMethod() finished in 0 ms
2019-05-20 16:16:58,420 INFO - TESTNG INVOKING CONFIGURATION: "Surefire test" - @BeforeMethod org.apache.brooklyn.rest.testing.BrooklynRestApiTest.setUpMethod()
2019-05-20 16:16:58,421 INFO - TESTNG PASSED CONFIGURATION: "Surefire test" - @BeforeMethod org.apache.brooklyn.rest.testing.BrooklynRestApiTest.setUpMethod() finished in 1 ms
2019-05-20 16:16:58,421 INFO - TESTNG INVOKING: "Surefire test" - org.apache.brooklyn.rest.resources.LocationResourceTest.testGetLocationConfig()
2019-05-20 16:16:58,426 WARN - Deprecated use of unmanaged location (SimulatedLocation{id=scvtpnryjx, name=SimulatedLocation:scvt}); will be managed automatically now but not supported in future versions
2019-05-20 16:16:58,457 INFO - TESTNG PASSED: "Surefire test" - org.apache.brooklyn.rest.resources.LocationResourceTest.testGetLocationConfig() finished in 36 ms
2019-05-20 16:16:58,457 INFO - TESTNG INVOKING CONFIGURATION: "Surefire test" - @AfterMethod org.apache.brooklyn.rest.testing.BrooklynRestApiTest.tearDownMethod()
2019-05-20 16:16:58,457 INFO - TESTNG PASSED CONFIGURATION: "Surefire test" - @AfterMethod org.apache.brooklyn.rest.testing.BrooklynRestApiTest.tearDownMethod() finished in 0 ms
2019-05-20 16:16:58,457 INFO - TESTNG INVOKING CONFIGURATION: "Surefire test" - @BeforeMethod org.apache.brooklyn.rest.testing.BrooklynRestApiTest.setUpMethod()
2019-05-20 16:16:58,457 INFO - TESTNG PASSED CONFIGURATION: "Surefire test" - @BeforeMethod org.apache.brooklyn.rest.testing.BrooklynRestApiTest.setUpMethod() finished in 0 ms
2019-05-20 16:16:58,457 INFO - TESTNG INVOKING: "Surefire test" - org.apache.brooklyn.rest.resources.LocationResourceTest.testDisplayNameInConfigOverridesItems()
2019-05-20 16:16:58,472 WARN - Request for bundle 'byon' was ignored as no framework available; and failed to find '(hosts="10.10.10.102")' in plain old classpath
2019-05-20 16:16:58,482 WARN - Request for bundle 'byon' was ignored as no framework available; and failed to find '(hosts="10.10.10.102")' in plain old classpath
2019-05-20 16:16:58,490 WARN - Request for bundle 'byon' was ignored as no framework available; and failed to find '(hosts="10.10.10.102")' in plain old classpath
2019-05-20 16:16:58,494 INFO - REST created catalog items: [BasicRegisteredType[test_config_overrides_items_displayName_id:0.1.2]]
2019-05-20 16:16:58,495 INFO - added, at: http://localhost:9998/catalog
2019-05-20 16:16:58,500 INFO - item: CatalogLocationSummary{config=[]}
2019-05-20 16:16:58,510 WARN - Request for bundle 'byon' was ignored as no framework available; and failed to find '(hosts="10.10.10.102")' in plain old classpath
2019-05-20 16:16:58,515 INFO - summary: LocationSummary{id='test_config_overrides_items_displayName_id:0.1.2', type='null', catalog='CatalogLocationSummary{config=[]}', links={self=/locations/test_config_overrides_items_displayName_id:0.1.2}}
2019-05-20 16:16:58,519 WARN - Request for bundle 'byon' was ignored as no framework available; and failed to find '(hosts="10.10.10.102")' in plain old classpath
2019-05-20 16:16:58,523 INFO - TESTNG PASSED: "Surefire test" - org.apache.brooklyn.rest.resources.LocationResourceTest.testDisplayNameInConfigOverridesItems() finished in 66 ms
2019-05-20 16:16:58,524 INFO - TESTNG INVOKING CONFIGURATION: "Surefire test" - @AfterMethod org.apache.brooklyn.rest.testing.BrooklynRestApiTest.tearDownMethod()
2019-05-20 16:16:58,524 INFO - TESTNG PASSED CONFIGURATION: "Surefire test" - @AfterMethod org.apache.brooklyn.rest.testing.BrooklynRestApiTest.tearDownMethod() finished in 1 ms
2019-05-20 16:16:58,524 INFO - TESTNG INVOKING CONFIGURATION: "Surefire test" - @BeforeMethod org.apache.brooklyn.rest.testing.BrooklynRestApiTest.setUpMethod()
2019-05-20 16:16:58,524 INFO - TESTNG PASSED CONFIGURATION: "Surefire test" - @BeforeMethod org.apache.brooklyn.rest.testing.BrooklynRestApiTest.setUpMethod() finished in 0 ms
2019-05-20 16:16:58,524 INFO - TESTNG INVOKING: "Surefire test" - org.apache.brooklyn.rest.resources.LocationResourceTest.testDeleteLocation()
2019-05-20 16:16:58,534 INFO - TESTNG PASSED: "Surefire test" - org.apache.brooklyn.rest.resources.LocationResourceTest.testDeleteLocation() finished in 10 ms
2019-05-20 16:16:58,534 INFO - TESTNG INVOKING CONFIGURATION: "Surefire test" - @AfterMethod org.apache.brooklyn.rest.testing.BrooklynRestApiTest.tearDownMethod()
2019-05-20 16:16:58,535 INFO - TESTNG PASSED CONFIGURATION: "Surefire test" - @AfterMethod org.apache.brooklyn.rest.testing.BrooklynRestApiTest.tearDownMethod() finished in 1 ms
2019-05-20 16:16:58,535 INFO - TESTNG INVOKING CONFIGURATION: "Surefire test" - @BeforeMethod org.apache.brooklyn.rest.testing.BrooklynRestApiTest.setUpMethod()
2019-05-20 16:16:58,535 INFO - TESTNG PASSED CONFIGURATION: "Surefire test" - @BeforeMethod org.apache.brooklyn.rest.testing.BrooklynRestApiTest.setUpMethod() finished in 0 ms
2019-05-20 16:16:58,536 INFO - TESTNG INVOKING: "Surefire test" - org.apache.brooklyn.rest.resources.LocationResourceTest.testListAllLocationDefinitions()
2019-05-20 16:16:58,548 WARN - Request for bundle 'aws-ec2' was ignored as no framework available; and failed to find 'us-east-1' in plain old classpath
2019-05-20 16:16:58,559 WARN - Request for bundle 'byon' was ignored as no framework available; and failed to find '(hosts="10.10.10.102")' in plain old classpath
2019-05-20 16:16:58,569 WARN - Request for bundle 'byon' was ignored as no framework available; and failed to find '(hosts="10.10.10.102")' in plain old classpath
2019-05-20 16:16:58,580 WARN - Request for bundle 'byon' was ignored as no framework available; and failed to find '(hosts="10.10.10.102")' in plain old classpath
2019-05-20 16:16:58,591 INFO - TESTNG PASSED: "Surefire test" - org.apache.brooklyn.rest.resources.LocationResourceTest.testListAllLocationDefinitions() finished in 56 ms
2019-05-20 16:16:58,592 INFO - TESTNG INVOKING CONFIGURATION: "Surefire test" - @AfterMethod org.apache.brooklyn.rest.testing.BrooklynRestApiTest.tearDownMethod()
2019-05-20 16:16:58,592 INFO - TESTNG PASSED CONFIGURATION: "Surefire test" - @AfterMethod org.apache.brooklyn.rest.testing.BrooklynRestApiTest.tearDownMethod() finished in 1 ms
2019-05-20 16:16:58,592 INFO - TESTNG INVOKING CONFIGURATION: "Surefire test" - @BeforeMethod org.apache.brooklyn.rest.testing.BrooklynRestApiTest.setUpMethod()
2019-05-20 16:16:58,592 INFO - TESTNG PASSED CONFIGURATION: "Surefire test" - @BeforeMethod org.apache.brooklyn.rest.testing.BrooklynRestApiTest.setUpMethod() finished in 0 ms
2019-05-20 16:16:58,592 INFO - TESTNG INVOKING: "Surefire test" - org.apache.brooklyn.rest.resources.LocationResourceTest.testGetSpecificLocation()
2019-05-20 16:16:58,606 WARN - Request for bundle 'aws-ec2' was ignored as no framework available; and failed to find 'us-east-1' in plain old classpath
2019-05-20 16:16:58,615 INFO - TESTNG PASSED: "Surefire test" - org.apache.brooklyn.rest.resources.LocationResourceTest.testGetSpecificLocation() finished in 23 ms
2019-05-20 16:16:58,615 INFO - TESTNG INVOKING CONFIGURATION: "Surefire test" - @AfterMethod org.apache.brooklyn.rest.testing.BrooklynRestApiTest.tearDownMethod()
2019-05-20 16:16:58,616 INFO - TESTNG PASSED CONFIGURATION: "Surefire test" - @AfterMethod org.apache.brooklyn.rest.testing.BrooklynRestApiTest.tearDownMethod() finished in 0 ms
2019-05-20 16:16:58,616 INFO - TESTNG INVOKING CONFIGURATION: "Surefire test" - @AfterClass org.apache.brooklyn.rest.testing.BrooklynRestApiTest.tearDownClass()
2019-05-20 16:16:58,634 INFO - TESTNG PASSED CONFIGURATION: "Surefire test" - @AfterClass org.apache.brooklyn.rest.testing.BrooklynRestApiTest.tearDownClass() finished in 18 ms
2019-05-20 16:16:58,636 INFO - TESTNG
===============================================
Surefire test
Tests run: 238, Failures: 1, Skips: 0
===============================================
Tests run: 238, Failures: 1, Errors: 0, Skipped: 0, Time elapsed: 73.165 sec <<< FAILURE! - in TestSuite
testInvokeEffectorWithTimeoutTimesOut(org.apache.brooklyn.rest.resources.EffectorResourceTest) Time elapsed: 0.035 sec <<< FAILURE!
java.lang.AssertionError: responseMap={id=PeOMeFDi, displayName=sleepEffector, description=Invoking effector sleepEffector on TestEntity:tjrl with parameters {duration=5m}, entityId=tjrlzpoh4b, entityDisplayName=TestEntity:tjrl, tags=[EFFECTOR, {wrappingType=contextEntity, entity={type=org.apache.brooklyn.api.entity.Entity, id=tjrlzpoh4b}}, {type=org.apache.brooklyn.api.mgmt.ManagementContext}, {wrappingType=targetEntity, entity={type=org.apache.brooklyn.api.entity.Entity, id=tjrlzpoh4b}}, {entityId=tjrlzpoh4b, effectorName=sleepEffector}], submitTimeUtc=1.558369001372E12, startTimeUtc=null, endTimeUtc=null, currentStatus=Submitted for execution, result=null, isError=false, isCancelled=false, children=[], submittedByTask=null, detailedStatus=Submitted for execution 18036d 16h ago, streams={}, links={self=/activities/PeOMeFDi, children=/activities/PeOMeFDi/children, entity=/applications/d748grf3r7/entities/tjrlzpoh4b}} expected [true] but found [false]
at org.apache.brooklyn.rest.resources.EffectorResourceTest.testInvokeEffectorWithTimeoutTimesOut(EffectorResourceTest.java:163)
Results :
Failed tests:
EffectorResourceTest.testInvokeEffectorWithTimeoutTimesOut:163 responseMap={id=PeOMeFDi, displayName=sleepEffector, description=Invoking effector sleepEffector on TestEntity:tjrl with parameters {duration=5m}, entityId=tjrlzpoh4b, entityDisplayName=TestEntity:tjrl, tags=[EFFECTOR, {wrappingType=contextEntity, entity={type=org.apache.brooklyn.api.entity.Entity, id=tjrlzpoh4b}}, {type=org.apache.brooklyn.api.mgmt.ManagementContext}, {wrappingType=targetEntity, entity={type=org.apache.brooklyn.api.entity.Entity, id=tjrlzpoh4b}}, {entityId=tjrlzpoh4b, effectorName=sleepEffector}], submitTimeUtc=1.558369001372E12, startTimeUtc=null, endTimeUtc=null, currentStatus=Submitted for execution, result=null, isError=false, isCancelled=false, children=[], submittedByTask=null, detailedStatus=Submitted for execution 18036d 16h ago, streams={}, links={self=/activities/PeOMeFDi, children=/activities/PeOMeFDi/children, entity=/applications/d748grf3r7/entities/tjrlzpoh4b}} expected [true] but found [false]
Tests run: 238, Failures: 1, Errors: 0, Skipped: 0
[INFO] ------------------------------------------------------------------------
[INFO] Reactor Summary:
[INFO]
[INFO] Brooklyn Server Root ............................... SUCCESS [ 5.189 s]
[INFO] Brooklyn Parent Project ............................ SUCCESS [ 6.118 s]
[INFO] Brooklyn Test Support Utilities .................... SUCCESS [ 8.900 s]
[INFO] Brooklyn Logback Includable Configuration .......... SUCCESS [ 0.375 s]
[INFO] Brooklyn Common Utilities .......................... SUCCESS [ 29.820 s]
[INFO] Brooklyn API ....................................... SUCCESS [ 3.523 s]
[INFO] CAMP Server Parent Project ......................... SUCCESS [ 0.129 s]
[INFO] CAMP Base .......................................... SUCCESS [ 3.041 s]
[INFO] Brooklyn Test Support .............................. SUCCESS [ 2.598 s]
[INFO] Brooklyn REST Swagger Apidoc Utilities ............. SUCCESS [ 13.098 s]
[INFO] Brooklyn Logback Configuration ..................... SUCCESS [ 0.233 s]
[INFO] CAMP Server ........................................ SUCCESS [ 16.871 s]
[INFO] Brooklyn Felix Runtime ............................. SUCCESS [ 3.368 s]
[INFO] Brooklyn Groovy Utilities .......................... SUCCESS [ 2.176 s]
[INFO] Brooklyn Core ...................................... SUCCESS [04:27 min]
[INFO] Brooklyn Policies .................................. SUCCESS [ 36.901 s]
[INFO] Brooklyn WinRM Software Entities ................... SUCCESS [ 19.805 s]
[INFO] Brooklyn Secure JMXMP Agent ........................ SUCCESS [ 8.126 s]
[INFO] Brooklyn JMX RMI Agent ............................. SUCCESS [ 0.400 s]
[INFO] Brooklyn Jclouds Location Targets .................. SUCCESS [01:09 min]
[INFO] Brooklyn Software Base ............................. SUCCESS [01:35 min]
[INFO] Brooklyn CAMP ...................................... SUCCESS [04:00 min]
[INFO] Brooklyn Launcher Common ........................... SUCCESS [ 5.471 s]
[INFO] Brooklyn REST API .................................. SUCCESS [ 11.405 s]
[INFO] Brooklyn REST Resources ............................ FAILURE [01:26 min]
[INFO] Brooklyn REST Server ............................... SKIPPED
[INFO] Brooklyn Launcher .................................. SKIPPED
[INFO] Brooklyn Container Location Targets ................ SKIPPED
[INFO] Brooklyn Command Line Interface .................... SKIPPED
[INFO] Brooklyn Test Framework ............................ SKIPPED
[INFO] Brooklyn OSGi init ................................. SKIPPED
[INFO] Brooklyn OSGi start ................................ SKIPPED
[INFO] Brooklyn Karaf ..................................... SKIPPED
[INFO] Jetty config fragment .............................. SKIPPED
[INFO] Apache Http Component extension .................... SKIPPED
[INFO] Brooklyn Karaf Features ............................ SKIPPED
[INFO] Brooklyn Karaf Shell Commands ...................... SKIPPED
[INFO] Brooklyn UI :: Parent .............................. SKIPPED
[INFO] Brooklyn UI :: Modularity Server (parent) .......... SKIPPED
[INFO] Brooklyn UI :: Modularity Server :: UI Module API .. SKIPPED
[INFO] Brooklyn UI :: Modularity Server :: UI Module Registry SKIPPED
[INFO] Brooklyn UI :: Modularity Server :: UI Proxy ....... SKIPPED
[INFO] Brooklyn UI :: Modularity Server :: UI Metadata Registry SKIPPED
[INFO] Brooklyn UI :: Modularity Server :: External UI Modules Registration Hooks SKIPPED
[INFO] Brooklyn UI :: Modularity Server :: Features ....... SKIPPED
[INFO] Brooklyn UI :: Modules (parent) .................... SKIPPED
[INFO] Brooklyn UI :: Modules - UI Utils .................. SKIPPED
[INFO] Brooklyn UI :: Modules - Home ...................... SKIPPED
[INFO] Brooklyn UI :: Modules - App inspector ............. SKIPPED
[INFO] Brooklyn UI :: Modules - Blueprint composer ........ SKIPPED
[INFO] Brooklyn UI :: Modules - Blueprint importer ........ SKIPPED
[INFO] Brooklyn UI :: Modules - Catalog ................... SKIPPED
[INFO] Brooklyn UI :: Modules - Location manager .......... SKIPPED
[INFO] Brooklyn UI :: Modules - REST API Docs ............. SKIPPED
[INFO] Brooklyn UI :: Modules - Groovy console ............ SKIPPED
[INFO] Brooklyn UI :: Modules - Logout .................... SKIPPED
[INFO] Brooklyn UI :: Modules - Features .................. SKIPPED
[INFO] Brooklyn UI :: Features ............................ SKIPPED
[INFO] Brooklyn Library Root .............................. SKIPPED
[INFO] Brooklyn CM Chef ................................... SKIPPED
[INFO] Brooklyn CM SaltStack .............................. SKIPPED
[INFO] Brooklyn CM Ansible ................................ SKIPPED
[INFO] Brooklyn CM Integration Root ....................... SKIPPED
[INFO] Brooklyn Network Software Entities ................. SKIPPED
[INFO] Brooklyn OSGi Software Entities .................... SKIPPED
[INFO] Brooklyn Database Software Entities ................ SKIPPED
[INFO] Brooklyn Web App Software Entities ................. SKIPPED
[INFO] Brooklyn Messaging Software Entities ............... SKIPPED
[INFO] Brooklyn NoSQL Data Store Software Entities ........ SKIPPED
[INFO] Brooklyn Monitoring Software Entities .............. SKIPPED
[INFO] Brooklyn Web App Software Entities ................. SKIPPED
[INFO] Brooklyn QA ........................................ SKIPPED
[INFO] Brooklyn Examples Aggregator Project ............... SKIPPED
[INFO] Brooklyn Examples Aggregator Project - Webapps ..... SKIPPED
[INFO] hello-world-webapp Maven Webapp .................... SKIPPED
[INFO] hello-world-sql-webapp Maven Webapp ................ SKIPPED
[INFO] Brooklyn Simple Web Cluster Example ................ SKIPPED
[INFO] Brooklyn Library Karaf integration ................. SKIPPED
[INFO] Brooklyn Library Catalog ........................... SKIPPED
[INFO] Brooklyn Library Karaf Features .................... SKIPPED
[INFO] Brooklyn Client .................................... SKIPPED
[INFO] Brooklyn Client Command Line Interface ............. SKIPPED
[INFO] Brooklyn REST java Client .......................... SKIPPED
[INFO] Brooklyn Downstream Project Parent ................. SKIPPED
[INFO] Brooklyn Dist Root ................................. SKIPPED
[INFO] Brooklyn All Things ................................ SKIPPED
[INFO] Brooklyn Distribution .............................. SKIPPED
[INFO] Brooklyn Karaf Distribution Parent ................. SKIPPED
[INFO] Brooklyn Karaf Server Configuration ................ SKIPPED
[INFO] Brooklyn Dist Karaf Features ....................... SKIPPED
[INFO] Brooklyn Karaf Distribution ........................ SKIPPED
[INFO] Brooklyn Karaf pax-exam itest ...................... SKIPPED
[INFO] Brooklyn Vagrant Getting Started Environment ....... SKIPPED
[INFO] Brooklyn Quick-Start Project Archetype ............. SKIPPED
[INFO] Brooklyn Shared Package Files ...................... SKIPPED
[INFO] Brooklyn RPM Package ............................... SKIPPED
[INFO] Brooklyn DEB Package ............................... SKIPPED
[INFO] Brooklyn Docker Image .............................. SKIPPED
[INFO] Brooklyn Root 1.0.0-SNAPSHOT ....................... SKIPPED
[INFO] ------------------------------------------------------------------------
[INFO] BUILD FAILURE
[INFO] ------------------------------------------------------------------------
[INFO] Total time: 15:58 min
[INFO] Finished at: 2019-05-20T16:16:59Z
[INFO] ------------------------------------------------------------------------
[ERROR] Failed to execute goal org.apache.maven.plugins:maven-surefire-plugin:2.19.1:test (default-test) on project brooklyn-rest-resources: There are test failures.
[ERROR]
[ERROR] Please refer to /usr/build/brooklyn-server/rest/rest-resources/target/surefire-reports for the individual test results.
[ERROR] -> [Help 1]
[ERROR]
[ERROR] To see the full stack trace of the errors, re-run Maven with the -e switch.
[ERROR] Re-run Maven using the -X switch to enable full debug logging.
[ERROR]
[ERROR] For more information about the errors and possible solutions, please read the following articles:
[ERROR] [Help 1] http://cwiki.apache.org/confluence/display/MAVEN/MojoFailureException
[ERROR]
[ERROR] After correcting the problems, you can resume the build with the command
[ERROR] mvn <goals> -rf :brooklyn-rest-resources
Build step 'Execute shell' marked build as failure
Recording test results
TestNG Reports Processing: START
Looking for TestNG results report in workspace using pattern: **/testng-results.xml
Saving reports...
Processing '/x1/jenkins/jenkins-home/jobs/brooklyn-master-build-docker/builds/1931/testng/testng-results-1.xml'
Processing '/x1/jenkins/jenkins-home/jobs/brooklyn-master-build-docker/builds/1931/testng/testng-results-10.xml'
Processing '/x1/jenkins/jenkins-home/jobs/brooklyn-master-build-docker/builds/1931/testng/testng-results-11.xml'
Processing '/x1/jenkins/jenkins-home/jobs/brooklyn-master-build-docker/builds/1931/testng/testng-results-12.xml'
Processing '/x1/jenkins/jenkins-home/jobs/brooklyn-master-build-docker/builds/1931/testng/testng-results-13.xml'
Processing '/x1/jenkins/jenkins-home/jobs/brooklyn-master-build-docker/builds/1931/testng/testng-results-14.xml'
Processing '/x1/jenkins/jenkins-home/jobs/brooklyn-master-build-docker/builds/1931/testng/testng-results-15.xml'
Processing '/x1/jenkins/jenkins-home/jobs/brooklyn-master-build-docker/builds/1931/testng/testng-results-2.xml'
Processing '/x1/jenkins/jenkins-home/jobs/brooklyn-master-build-docker/builds/1931/testng/testng-results-3.xml'
Processing '/x1/jenkins/jenkins-home/jobs/brooklyn-master-build-docker/builds/1931/testng/testng-results-4.xml'
Processing '/x1/jenkins/jenkins-home/jobs/brooklyn-master-build-docker/builds/1931/testng/testng-results-5.xml'
Processing '/x1/jenkins/jenkins-home/jobs/brooklyn-master-build-docker/builds/1931/testng/testng-results-6.xml'
Processing '/x1/jenkins/jenkins-home/jobs/brooklyn-master-build-docker/builds/1931/testng/testng-results-7.xml'
Processing '/x1/jenkins/jenkins-home/jobs/brooklyn-master-build-docker/builds/1931/testng/testng-results-8.xml'
Processing '/x1/jenkins/jenkins-home/jobs/brooklyn-master-build-docker/builds/1931/testng/testng-results-9.xml'
Processing '/x1/jenkins/jenkins-home/jobs/brooklyn-master-build-docker/builds/1931/testng/testng-results.xml'
0.021524% of tests failed, which exceeded threshold of 0%. Marking build as UNSTABLE
TestNG Reports Processing: FINISH
Jenkins build is back to normal : brooklyn-master-build-docker
#1932
Posted by Apache Jenkins Server <je...@builds.apache.org>.
See <https://builds.apache.org/job/brooklyn-master-build-docker/1932/display/redirect>