You are viewing a plain text version of this content. The canonical link for it is here.
Posted to builds@mesos.apache.org by Apache Jenkins Server <je...@builds.apache.org> on 2017/01/07 09:42:13 UTC
Build failed in Jenkins: Mesos » autotools,gcc,--verbose --enable-libevent --enable-ssl,GLOG_v=1 MESOS_VERBOSE=1,centos:7,(docker||Hadoop)&&(!ubuntu-us1)&&(!ubuntu-6)&&(!ubuntu-eu2) #3095
See <https://builds.apache.org/job/Mesos/BUILDTOOL=autotools,COMPILER=gcc,CONFIGURATION=--verbose%20--enable-libevent%20--enable-ssl,ENVIRONMENT=GLOG_v=1%20MESOS_VERBOSE=1,OS=centos%3A7,label_exp=(docker%7C%7CHadoop)&&(!ubuntu-us1)&&(!ubuntu-6)&&(!ubuntu-eu2)/3095/>
------------------------------------------
Started by upstream project "Mesos" build number 3095
originally caused by:
Started by an SCM change
[EnvInject] - Loading node environment variables.
Building remotely on H1 (Hadoop) in workspace <https://builds.apache.org/job/Mesos/BUILDTOOL=autotools,COMPILER=gcc,CONFIGURATION=--verbose%20--enable-libevent%20--enable-ssl,ENVIRONMENT=GLOG_v=1%20MESOS_VERBOSE=1,OS=centos%3A7,label_exp=(docker%7C%7CHadoop)&&(!ubuntu-us1)&&(!ubuntu-6)&&(!ubuntu-eu2)/ws/>
Cloning the remote Git repository
Cloning repository https://git-wip-us.apache.org/repos/asf/mesos.git
> git init <https://builds.apache.org/job/Mesos/BUILDTOOL=autotools,COMPILER=gcc,CONFIGURATION=--verbose%20--enable-libevent%20--enable-ssl,ENVIRONMENT=GLOG_v=1%20MESOS_VERBOSE=1,OS=centos%3A7,label_exp=(docker%7C%7CHadoop)&&(!ubuntu-us1)&&(!ubuntu-6)&&(!ubuntu-eu2)/ws/> # timeout=10
Fetching upstream changes from https://git-wip-us.apache.org/repos/asf/mesos.git
> git --version # timeout=10
> git -c core.askpass=true fetch --tags --progress https://git-wip-us.apache.org/repos/asf/mesos.git +refs/heads/*:refs/remotes/origin/*
ERROR: Error cloning remote repo 'origin'
hudson.plugins.git.GitException: Command "git -c core.askpass=true fetch --tags --progress https://git-wip-us.apache.org/repos/asf/mesos.git +refs/heads/*:refs/remotes/origin/*" returned status code 128:
stdout:
stderr: error: RPC failed; result=56, HTTP code = 200
fatal: The remote end hung up unexpectedly
fatal: protocol error: bad pack header
at org.jenkinsci.plugins.gitclient.CliGitAPIImpl.launchCommandIn(CliGitAPIImpl.java:1723)
at org.jenkinsci.plugins.gitclient.CliGitAPIImpl.launchCommandWithCredentials(CliGitAPIImpl.java:1459)
at org.jenkinsci.plugins.gitclient.CliGitAPIImpl.access$300(CliGitAPIImpl.java:63)
at org.jenkinsci.plugins.gitclient.CliGitAPIImpl$1.execute(CliGitAPIImpl.java:314)
at org.jenkinsci.plugins.gitclient.CliGitAPIImpl$2.execute(CliGitAPIImpl.java:506)
at org.jenkinsci.plugins.gitclient.RemoteGitImpl$CommandInvocationHandler$1.call(RemoteGitImpl.java:152)
at org.jenkinsci.plugins.gitclient.RemoteGitImpl$CommandInvocationHandler$1.call(RemoteGitImpl.java:145)
at hudson.remoting.UserRequest.perform(UserRequest.java:153)
at hudson.remoting.UserRequest.perform(UserRequest.java:50)
at hudson.remoting.Request$2.run(Request.java:332)
at hudson.remoting.InterceptingExecutorService$1.call(InterceptingExecutorService.java:68)
at java.util.concurrent.FutureTask.run(FutureTask.java:262)
at java.util.concurrent.ThreadPoolExecutor.runWorker(ThreadPoolExecutor.java:1145)
at java.util.concurrent.ThreadPoolExecutor$Worker.run(ThreadPoolExecutor.java:615)
at java.lang.Thread.run(Thread.java:745)
at ......remote call to H1(Native Method)
at hudson.remoting.Channel.attachCallSiteStackTrace(Channel.java:1416)
at hudson.remoting.UserResponse.retrieve(UserRequest.java:253)
at hudson.remoting.Channel.call(Channel.java:781)
at org.jenkinsci.plugins.gitclient.RemoteGitImpl$CommandInvocationHandler.execute(RemoteGitImpl.java:145)
at sun.reflect.GeneratedMethodAccessor761.invoke(Unknown Source)
at sun.reflect.DelegatingMethodAccessorImpl.invoke(DelegatingMethodAccessorImpl.java:43)
at java.lang.reflect.Method.invoke(Method.java:498)
at org.jenkinsci.plugins.gitclient.RemoteGitImpl$CommandInvocationHandler.invoke(RemoteGitImpl.java:131)
at com.sun.proxy.$Proxy175.execute(Unknown Source)
at hudson.plugins.git.GitSCM.retrieveChanges(GitSCM.java:1046)
at hudson.plugins.git.GitSCM.checkout(GitSCM.java:1086)
at hudson.scm.SCM.checkout(SCM.java:485)
at hudson.model.AbstractProject.checkout(AbstractProject.java:1269)
at hudson.model.AbstractBuild$AbstractBuildExecution.defaultCheckout(AbstractBuild.java:604)
at jenkins.scm.SCMCheckoutStrategy.checkout(SCMCheckoutStrategy.java:86)
at hudson.model.AbstractBuild$AbstractBuildExecution.run(AbstractBuild.java:529)
at hudson.model.Run.execute(Run.java:1741)
at hudson.matrix.MatrixRun.run(MatrixRun.java:146)
at hudson.model.ResourceController.execute(ResourceController.java:98)
at hudson.model.Executor.run(Executor.java:410)
ERROR: null
Retrying after 10 seconds
> git rev-parse --is-inside-work-tree # timeout=10
Fetching changes from the remote Git repository
> git config remote.origin.url https://git-wip-us.apache.org/repos/asf/mesos.git # timeout=10
Fetching upstream changes from https://git-wip-us.apache.org/repos/asf/mesos.git
> git --version # timeout=10
> git -c core.askpass=true fetch --tags --progress https://git-wip-us.apache.org/repos/asf/mesos.git +refs/heads/*:refs/remotes/origin/*
ERROR: Error fetching remote repo 'origin'
hudson.plugins.git.GitException: Failed to fetch from https://git-wip-us.apache.org/repos/asf/mesos.git
at hudson.plugins.git.GitSCM.fetchFrom(GitSCM.java:799)
at hudson.plugins.git.GitSCM.retrieveChanges(GitSCM.java:1055)
at hudson.plugins.git.GitSCM.checkout(GitSCM.java:1086)
at hudson.scm.SCM.checkout(SCM.java:485)
at hudson.model.AbstractProject.checkout(AbstractProject.java:1269)
at hudson.model.AbstractBuild$AbstractBuildExecution.defaultCheckout(AbstractBuild.java:604)
at jenkins.scm.SCMCheckoutStrategy.checkout(SCMCheckoutStrategy.java:86)
at hudson.model.AbstractBuild$AbstractBuildExecution.run(AbstractBuild.java:529)
at hudson.model.Run.execute(Run.java:1741)
at hudson.matrix.MatrixRun.run(MatrixRun.java:146)
at hudson.model.ResourceController.execute(ResourceController.java:98)
at hudson.model.Executor.run(Executor.java:410)
Caused by: hudson.plugins.git.GitException: Command "git -c core.askpass=true fetch --tags --progress https://git-wip-us.apache.org/repos/asf/mesos.git +refs/heads/*:refs/remotes/origin/*" returned status code 128:
stdout:
stderr: error: RPC failed; result=56, HTTP code = 200
fatal: The remote end hung up unexpectedly
fatal: protocol error: bad pack header
at org.jenkinsci.plugins.gitclient.CliGitAPIImpl.launchCommandIn(CliGitAPIImpl.java:1723)
at org.jenkinsci.plugins.gitclient.CliGitAPIImpl.launchCommandWithCredentials(CliGitAPIImpl.java:1459)
at org.jenkinsci.plugins.gitclient.CliGitAPIImpl.access$300(CliGitAPIImpl.java:63)
at org.jenkinsci.plugins.gitclient.CliGitAPIImpl$1.execute(CliGitAPIImpl.java:314)
at org.jenkinsci.plugins.gitclient.RemoteGitImpl$CommandInvocationHandler$1.call(RemoteGitImpl.java:152)
at org.jenkinsci.plugins.gitclient.RemoteGitImpl$CommandInvocationHandler$1.call(RemoteGitImpl.java:145)
at hudson.remoting.UserRequest.perform(UserRequest.java:153)
at hudson.remoting.UserRequest.perform(UserRequest.java:50)
at hudson.remoting.Request$2.run(Request.java:332)
at hudson.remoting.InterceptingExecutorService$1.call(InterceptingExecutorService.java:68)
at java.util.concurrent.FutureTask.run(FutureTask.java:262)
at java.util.concurrent.ThreadPoolExecutor.runWorker(ThreadPoolExecutor.java:1145)
at java.util.concurrent.ThreadPoolExecutor$Worker.run(ThreadPoolExecutor.java:615)
at java.lang.Thread.run(Thread.java:745)
at ......remote call to H1(Native Method)
at hudson.remoting.Channel.attachCallSiteStackTrace(Channel.java:1416)
at hudson.remoting.UserResponse.retrieve(UserRequest.java:253)
at hudson.remoting.Channel.call(Channel.java:781)
at org.jenkinsci.plugins.gitclient.RemoteGitImpl$CommandInvocationHandler.execute(RemoteGitImpl.java:145)
at sun.reflect.GeneratedMethodAccessor761.invoke(Unknown Source)
at sun.reflect.DelegatingMethodAccessorImpl.invoke(DelegatingMethodAccessorImpl.java:43)
at java.lang.reflect.Method.invoke(Method.java:498)
at org.jenkinsci.plugins.gitclient.RemoteGitImpl$CommandInvocationHandler.invoke(RemoteGitImpl.java:131)
at com.sun.proxy.$Proxy91.execute(Unknown Source)
at hudson.plugins.git.GitSCM.fetchFrom(GitSCM.java:797)
... 11 more
ERROR: null
Retrying after 10 seconds
> git rev-parse --is-inside-work-tree # timeout=10
Fetching changes from the remote Git repository
> git config remote.origin.url https://git-wip-us.apache.org/repos/asf/mesos.git # timeout=10
Fetching upstream changes from https://git-wip-us.apache.org/repos/asf/mesos.git
> git --version # timeout=10
> git -c core.askpass=true fetch --tags --progress https://git-wip-us.apache.org/repos/asf/mesos.git +refs/heads/*:refs/remotes/origin/*
ERROR: Error fetching remote repo 'origin'
hudson.plugins.git.GitException: Failed to fetch from https://git-wip-us.apache.org/repos/asf/mesos.git
at hudson.plugins.git.GitSCM.fetchFrom(GitSCM.java:799)
at hudson.plugins.git.GitSCM.retrieveChanges(GitSCM.java:1055)
at hudson.plugins.git.GitSCM.checkout(GitSCM.java:1086)
at hudson.scm.SCM.checkout(SCM.java:485)
at hudson.model.AbstractProject.checkout(AbstractProject.java:1269)
at hudson.model.AbstractBuild$AbstractBuildExecution.defaultCheckout(AbstractBuild.java:604)
at jenkins.scm.SCMCheckoutStrategy.checkout(SCMCheckoutStrategy.java:86)
at hudson.model.AbstractBuild$AbstractBuildExecution.run(AbstractBuild.java:529)
at hudson.model.Run.execute(Run.java:1741)
at hudson.matrix.MatrixRun.run(MatrixRun.java:146)
at hudson.model.ResourceController.execute(ResourceController.java:98)
at hudson.model.Executor.run(Executor.java:410)
Caused by: hudson.plugins.git.GitException: Command "git -c core.askpass=true fetch --tags --progress https://git-wip-us.apache.org/repos/asf/mesos.git +refs/heads/*:refs/remotes/origin/*" returned status code 128:
stdout:
stderr: error: RPC failed; result=56, HTTP code = 200
fatal: The remote end hung up unexpectedly
fatal: protocol error: bad pack header
at org.jenkinsci.plugins.gitclient.CliGitAPIImpl.launchCommandIn(CliGitAPIImpl.java:1723)
at org.jenkinsci.plugins.gitclient.CliGitAPIImpl.launchCommandWithCredentials(CliGitAPIImpl.java:1459)
at org.jenkinsci.plugins.gitclient.CliGitAPIImpl.access$300(CliGitAPIImpl.java:63)
at org.jenkinsci.plugins.gitclient.CliGitAPIImpl$1.execute(CliGitAPIImpl.java:314)
at org.jenkinsci.plugins.gitclient.RemoteGitImpl$CommandInvocationHandler$1.call(RemoteGitImpl.java:152)
at org.jenkinsci.plugins.gitclient.RemoteGitImpl$CommandInvocationHandler$1.call(RemoteGitImpl.java:145)
at hudson.remoting.UserRequest.perform(UserRequest.java:153)
at hudson.remoting.UserRequest.perform(UserRequest.java:50)
at hudson.remoting.Request$2.run(Request.java:332)
at hudson.remoting.InterceptingExecutorService$1.call(InterceptingExecutorService.java:68)
at java.util.concurrent.FutureTask.run(FutureTask.java:262)
at java.util.concurrent.ThreadPoolExecutor.runWorker(ThreadPoolExecutor.java:1145)
at java.util.concurrent.ThreadPoolExecutor$Worker.run(ThreadPoolExecutor.java:615)
at java.lang.Thread.run(Thread.java:745)
at ......remote call to H1(Native Method)
at hudson.remoting.Channel.attachCallSiteStackTrace(Channel.java:1416)
at hudson.remoting.UserResponse.retrieve(UserRequest.java:253)
at hudson.remoting.Channel.call(Channel.java:781)
at org.jenkinsci.plugins.gitclient.RemoteGitImpl$CommandInvocationHandler.execute(RemoteGitImpl.java:145)
at sun.reflect.GeneratedMethodAccessor761.invoke(Unknown Source)
at sun.reflect.DelegatingMethodAccessorImpl.invoke(DelegatingMethodAccessorImpl.java:43)
at java.lang.reflect.Method.invoke(Method.java:498)
at org.jenkinsci.plugins.gitclient.RemoteGitImpl$CommandInvocationHandler.invoke(RemoteGitImpl.java:131)
at com.sun.proxy.$Proxy91.execute(Unknown Source)
at hudson.plugins.git.GitSCM.fetchFrom(GitSCM.java:797)
... 11 more
ERROR: null
Jenkins build is back to normal : Mesos » autotools,gcc,--verbose --enable-libevent --enable-ssl,GLOG_v=1 MESOS_VERBOSE=1,centos:7,(docker||Hadoop)&&(!ubuntu-us1)&&(!ubuntu-6)&&(!ubuntu-eu2) #3097
Posted by Apache Jenkins Server <je...@builds.apache.org>.
See <https://builds.apache.org/job/Mesos/BUILDTOOL=autotools,COMPILER=gcc,CONFIGURATION=--verbose%20--enable-libevent%20--enable-ssl,ENVIRONMENT=GLOG_v=1%20MESOS_VERBOSE=1,OS=centos%3A7,label_exp=(docker%7C%7CHadoop)&&(!ubuntu-us1)&&(!ubuntu-6)&&(!ubuntu-eu2)/3097/changes>
Build failed in Jenkins: Mesos » autotools,gcc,--verbose --enable-libevent --enable-ssl,GLOG_v=1 MESOS_VERBOSE=1,centos:7,(docker||Hadoop)&&(!ubuntu-us1)&&(!ubuntu-6)&&(!ubuntu-eu2) #3096
Posted by Apache Jenkins Server <je...@builds.apache.org>.
See <https://builds.apache.org/job/Mesos/BUILDTOOL=autotools,COMPILER=gcc,CONFIGURATION=--verbose%20--enable-libevent%20--enable-ssl,ENVIRONMENT=GLOG_v=1%20MESOS_VERBOSE=1,OS=centos%3A7,label_exp=(docker%7C%7CHadoop)&&(!ubuntu-us1)&&(!ubuntu-6)&&(!ubuntu-eu2)/3096/changes>
Changes:
[joris.van.remoortere] Fixed memory leak in implementation of Future<T>::after().
[mpark] CMake: renamed `stout_tests` to `stout-tests` to match autotools.
[mpark] CMake: renamed `process_tests` to `libprocess-tests` to match autotools.
[mpark] CMake: renamed test binaries to match autotools.
[mpark] Removed mpark's gmail address from `contributors.yaml`.
[mpark] Added a default move constructor for `Try`.
[benjamin.hindman] Used process::io::BUFFERED_READ_SIZE instead of constant.
[benjamin.hindman] Introduced ControlFlow for process::loop.
[benjamin.hindman] Updated Mesos process::loop uses with process::ControlFlow.
[benjamin.hindman] Used process::loop to avoid stack overflow due to recursion.
[benjamin.hindman] Used `loop` in implementation of io::read and io::write.
[vinodkone] Improved comments in agent.
[vinodkone] Cleaned up agent re-registration code in the master slightly.
[vinodkone] Improved OneWayPartitionTest.MasterToSlave.
[vinodkone] Cleaned up two test cases slightly.
[vinodkone] Cleaned up `using` statements.
[vinodkone] Fixed quoting in agent error message.
[vinodkone] Cleaned up slave recovery tests.
[vinodkone] Improved handling of agents that restart but never re-register.
[vinodkone] Cleaned up master logging code slightly.
[mpark] Install a symlink rather than building `mesos-agent` twice.
[mpark] Removed unsupported `friend` declaration.
[yujie.jay] Fixed an FD leak in the IO switchboard.
[mpark] Removed a redundant `return` statement in libprocess.
[mpark] Cleaned up `std::string` usage in stout.
[mpark] Cleaned up `std::string` usage in libprocess.
[mpark] Cleaned up `std::string` usage in mesos.
[mpark] Avoided unnecessary copies in mesos.
[mpark] Removed unused namespace alias declarations in libprocess.
[mpark] Removed unused namespace alias declarations in mesos.
[mpark] Avoided needless copies in log tests + some minor code cleanup.
[haosdent] Fix incorrect glyphicons-halflings-regular.woff2.
------------------------------------------
[...truncated 11751 lines...]
make[9]: Entering directory `/mesos/mesos-1.2.0/_build/3rdparty/libprocess'
make[9]: Nothing to be done for `all-am'.
make[9]: Leaving directory `/mesos/mesos-1.2.0/_build/3rdparty/libprocess'
Making all in include
make[9]: Entering directory `/mesos/mesos-1.2.0/_build/3rdparty/libprocess/include'
make[9]: Nothing to be done for `all'.
make[9]: Leaving directory `/mesos/mesos-1.2.0/_build/3rdparty/libprocess/include'
make[8]: Leaving directory `/mesos/mesos-1.2.0/_build/3rdparty/libprocess'
make libprocess-tests benchmarks ssl-client test-linkee
make[8]: Entering directory `/mesos/mesos-1.2.0/_build/3rdparty/libprocess'
make[8]: `libprocess-tests' is up to date.
make[8]: `benchmarks' is up to date.
make[8]: `ssl-client' is up to date.
make[8]: `test-linkee' is up to date.
make[8]: Leaving directory `/mesos/mesos-1.2.0/_build/3rdparty/libprocess'
./libprocess-tests
WARNING: Logging before InitGoogleLogging() is written to STDERR
I0110 05:21:42.799475 27597 process.cpp:1234] libprocess is initialized on 172.17.0.2:60622 with 16 worker threads
[==========] Running 224 tests from 34 test cases.
[----------] Global test environment set-up.
[----------] 3 tests from CollectTest
[ RUN ] CollectTest.Ready
[ OK ] CollectTest.Ready (0 ms)
[ RUN ] CollectTest.Failure
[ OK ] CollectTest.Failure (5 ms)
[ RUN ] CollectTest.DiscardPropagation
[ OK ] CollectTest.DiscardPropagation (1 ms)
[----------] 3 tests from CollectTest (6 ms total)
[----------] 4 tests from AwaitTest
[ RUN ] AwaitTest.Success
[ OK ] AwaitTest.Success (2 ms)
[ RUN ] AwaitTest.Failure
[ OK ] AwaitTest.Failure (1 ms)
[ RUN ] AwaitTest.Discarded
[ OK ] AwaitTest.Discarded (0 ms)
[ RUN ] AwaitTest.DiscardPropagation
[ OK ] AwaitTest.DiscardPropagation (1 ms)
[----------] 4 tests from AwaitTest (4 ms total)
[----------] 3 tests from RequestDecoderTest/0, where TypeParam = process::DataDecoder
[ RUN ] RequestDecoderTest/0.Request
[ OK ] RequestDecoderTest/0.Request (0 ms)
[ RUN ] RequestDecoderTest/0.HeaderContinuation
[ OK ] RequestDecoderTest/0.HeaderContinuation (0 ms)
[ RUN ] RequestDecoderTest/0.HeaderCaseInsensitive
[ OK ] RequestDecoderTest/0.HeaderCaseInsensitive (0 ms)
[----------] 3 tests from RequestDecoderTest/0 (0 ms total)
[----------] 3 tests from RequestDecoderTest/1, where TypeParam = process::StreamingRequestDecoder
[ RUN ] RequestDecoderTest/1.Request
[ OK ] RequestDecoderTest/1.Request (0 ms)
[ RUN ] RequestDecoderTest/1.HeaderContinuation
[ OK ] RequestDecoderTest/1.HeaderContinuation (0 ms)
[ RUN ] RequestDecoderTest/1.HeaderCaseInsensitive
[ OK ] RequestDecoderTest/1.HeaderCaseInsensitive (0 ms)
[----------] 3 tests from RequestDecoderTest/1 (0 ms total)
[----------] 3 tests from DecoderTest
[ RUN ] DecoderTest.Response
[ OK ] DecoderTest.Response (0 ms)
[ RUN ] DecoderTest.StreamingResponse
[ OK ] DecoderTest.StreamingResponse (0 ms)
[ RUN ] DecoderTest.StreamingResponseFailure
[ OK ] DecoderTest.StreamingResponseFailure (0 ms)
[----------] 3 tests from DecoderTest (0 ms total)
[----------] 2 tests from EncoderTest
[ RUN ] EncoderTest.Response
[ OK ] EncoderTest.Response (1 ms)
[ RUN ] EncoderTest.AcceptableEncodings
[ OK ] EncoderTest.AcceptableEncodings (0 ms)
[----------] 2 tests from EncoderTest (1 ms total)
[----------] 15 tests from FutureTest
[ RUN ] FutureTest.Future
[ OK ] FutureTest.Future (0 ms)
[ RUN ] FutureTest.Associate
[ OK ] FutureTest.Associate (0 ms)
[ RUN ] FutureTest.OnAny
[ OK ] FutureTest.OnAny (0 ms)
[ RUN ] FutureTest.Then
[ OK ] FutureTest.Then (0 ms)
[ RUN ] FutureTest.Repair
[ OK ] FutureTest.Repair (1 ms)
[ RUN ] FutureTest.After1
[ OK ] FutureTest.After1 (0 ms)
[ RUN ] FutureTest.After2
[ OK ] FutureTest.After2 (1 ms)
[ RUN ] FutureTest.After3
[ OK ] FutureTest.After3 (1 ms)
[ RUN ] FutureTest.Chain
[ OK ] FutureTest.Chain (1 ms)
[ RUN ] FutureTest.Discard1
[ OK ] FutureTest.Discard1 (0 ms)
[ RUN ] FutureTest.Discard2
[ OK ] FutureTest.Discard2 (0 ms)
[ RUN ] FutureTest.Discard3
[ OK ] FutureTest.Discard3 (0 ms)
[ RUN ] FutureTest.Select
[ OK ] FutureTest.Select (0 ms)
[ RUN ] FutureTest.FromTry
[ OK ] FutureTest.FromTry (0 ms)
[ RUN ] FutureTest.ArrowOperator
[ OK ] FutureTest.ArrowOperator (0 ms)
[----------] 15 tests from FutureTest (5 ms total)
[----------] 1 test from HTTPTest
[ RUN ] HTTPTest.PipeReadAll
[ OK ] HTTPTest.PipeReadAll (1 ms)
[----------] 1 test from HTTPTest (1 ms total)
[----------] 8 tests from HTTPConnectionTest
[ RUN ] HTTPConnectionTest.GzipRequestBody
I0110 05:21:42.820379 27598 process.cpp:3676] Handling HTTP event for process '(1)' with path: '/(1)/body'
[ OK ] HTTPConnectionTest.GzipRequestBody (4 ms)
[ RUN ] HTTPConnectionTest.Serial
I0110 05:21:42.824177 27613 process.cpp:3676] Handling HTTP event for process '(2)' with path: '/(2)/get'
I0110 05:21:42.826918 27599 process.cpp:3676] Handling HTTP event for process '(2)' with path: '/(2)/get'
[ OK ] HTTPConnectionTest.Serial (47 ms)
[ RUN ] HTTPConnectionTest.Pipeline
I0110 05:21:42.872051 27609 process.cpp:3676] Handling HTTP event for process '(3)' with path: '/(3)/get'
I0110 05:21:42.873060 27612 process.cpp:3676] Handling HTTP event for process '(4)' with path: '/(4)/get'
I0110 05:21:42.874511 27610 process.cpp:3676] Handling HTTP event for process '(3)' with path: '/(3)/get'
[ OK ] HTTPConnectionTest.Pipeline (9 ms)
[ RUN ] HTTPConnectionTest.ClosingRequest
I0110 05:21:42.882232 27602 process.cpp:3676] Handling HTTP event for process '(5)' with path: '/(5)/get'
I0110 05:21:42.882541 27602 process.cpp:3676] Handling HTTP event for process '(5)' with path: '/(5)/get'
[ OK ] HTTPConnectionTest.ClosingRequest (8 ms)
[ RUN ] HTTPConnectionTest.ClosingResponse
I0110 05:21:42.889751 27606 process.cpp:3676] Handling HTTP event for process '(6)' with path: '/(6)/get'
I0110 05:21:42.890075 27606 process.cpp:3676] Handling HTTP event for process '(6)' with path: '/(6)/get'
I0110 05:21:42.898464 27613 process.cpp:2057] Attempting to send on a no longer valid socket!
[ OK ] HTTPConnectionTest.ClosingResponse (20 ms)
[ RUN ] HTTPConnectionTest.ReferenceCounting
[ OK ] HTTPConnectionTest.ReferenceCounting (5 ms)
[ RUN ] HTTPConnectionTest.Equality
[ OK ] HTTPConnectionTest.Equality (3 ms)
[ RUN ] HTTPConnectionTest.RequestStreaming
I0110 05:21:42.917915 27598 process.cpp:3676] Handling HTTP event for process '(9)' with path: '/(9)/requeststreaming'
[ OK ] HTTPConnectionTest.RequestStreaming (6 ms)
[----------] 8 tests from HTTPConnectionTest (103 ms total)
[----------] 2 tests from URLTest
[ RUN ] URLTest.Stringification
[ OK ] URLTest.Stringification (1 ms)
[ RUN ] URLTest.ParseUrls
[ OK ] URLTest.ParseUrls (0 ms)
[----------] 2 tests from URLTest (1 ms total)
[----------] 6 tests from HttpAuthenticationTest
[ RUN ] HttpAuthenticationTest.NoAuthenticator
I0110 05:21:42.925664 27599 process.cpp:3676] Handling HTTP event for process '(10)' with path: '/(10)/authenticated'
[ OK ] HttpAuthenticationTest.NoAuthenticator (5 ms)
[ RUN ] HttpAuthenticationTest.Unauthorized
I0110 05:21:42.928246 27599 process.cpp:3676] Handling HTTP event for process '(11)' with path: '/(11)/authenticated'
[ OK ] HttpAuthenticationTest.Unauthorized (2 ms)
[ RUN ] HttpAuthenticationTest.Forbidden
I0110 05:21:42.931183 27608 process.cpp:3676] Handling HTTP event for process '(12)' with path: '/(12)/authenticated'
[ OK ] HttpAuthenticationTest.Forbidden (4 ms)
[ RUN ] HttpAuthenticationTest.Authenticated
I0110 05:21:42.934463 27612 process.cpp:3676] Handling HTTP event for process '(13)' with path: '/(13)/authenticated'
[ OK ] HttpAuthenticationTest.Authenticated (4 ms)
[ RUN ] HttpAuthenticationTest.Pipelining
I0110 05:21:42.938504 27610 process.cpp:3676] Handling HTTP event for process '(14)' with path: '/(14)/authenticated'
I0110 05:21:42.939069 27598 process.cpp:3676] Handling HTTP event for process '(14)' with path: '/(14)/authenticated'
[ OK ] HttpAuthenticationTest.Pipelining (4 ms)
[ RUN ] HttpAuthenticationTest.Basic
I0110 05:21:42.951253 27607 process.cpp:3676] Handling HTTP event for process '(15)' with path: '/(15)/authenticated'
I0110 05:21:42.953801 27602 process.cpp:3676] Handling HTTP event for process '(15)' with path: '/(15)/authenticated'
I0110 05:21:42.956465 27609 process.cpp:3676] Handling HTTP event for process '(15)' with path: '/(15)/authenticated'
I0110 05:21:42.958600 27610 process.cpp:3676] Handling HTTP event for process '(15)' with path: '/(15)/authenticated'
[ OK ] HttpAuthenticationTest.Basic (19 ms)
[----------] 6 tests from HttpAuthenticationTest (38 ms total)
[----------] 3 tests from HttpServeTest
[ RUN ] HttpServeTest.Pipelining
[ OK ] HttpServeTest.Pipelining (7 ms)
[ RUN ] HttpServeTest.Discard
*** Aborted at 1484025702 (unix time) try "date -d @1484025702" if you are using GNU date ***
PC: @ 0x8cd594 std::__find<>()
*** SIGSEGV (@0x1ec549058) received by PID 27597 (TID 0x7fa8beead8c0) from PID 18446744073379549272; stack trace: ***
@ 0x7fa8bc885370 (unknown)
@ 0x8cd594 std::__find<>()
@ 0x8bbdcc std::find<>()
@ 0x89dab4 process::ProcessManager::enqueue()
@ 0x89b79c process::ProcessManager::spawn()
@ 0x8a2d8f process::spawn()
@ 0x859dd6 process::Latch::Latch()
@ 0x46ef58 process::Future<>::await()
@ 0x4b52cc process::internal::await<>()
@ 0x5306a3 AwaitAssertDiscarded<>()
@ 0x508ea3 HttpServeTest_Discard_Test::TestBody()
@ 0x793478 testing::internal::HandleSehExceptionsInMethodIfSupported<>()
@ 0x78e05e testing::internal::HandleExceptionsInMethodIfSupported<>()
@ 0x76f447 testing::Test::Run()
@ 0x76fbca testing::TestInfo::Run()
@ 0x770210 testing::TestCase::Run()
@ 0x776aea testing::internal::UnitTestImpl::RunAllTests()
@ 0x7941d9 testing::internal::HandleSehExceptionsInMethodIfSupported<>()
@ 0x78ecc6 testing::internal::HandleExceptionsInMethodIfSupported<>()
@ 0x775830 testing::UnitTest::Run()
@ 0x5e6829 RUN_ALL_TESTS()
@ 0x5e655f main
@ 0x7fa8bb693b35 __libc_start_main
@ 0x41ac89 (unknown)
make[7]: *** [check-local] Segmentation fault
make[7]: Leaving directory `/mesos/mesos-1.2.0/_build/3rdparty/libprocess'
make[6]: *** [check-am] Error 2
make[6]: Leaving directory `/mesos/mesos-1.2.0/_build/3rdparty/libprocess'
make[5]: *** [check-recursive] Error 1
make[5]: Leaving directory `/mesos/mesos-1.2.0/_build/3rdparty/libprocess'
make[4]: *** [check] Error 2
make[4]: Leaving directory `/mesos/mesos-1.2.0/_build/3rdparty/libprocess'
make[3]: *** [check-recursive] Error 1
make[3]: Leaving directory `/mesos/mesos-1.2.0/_build/3rdparty'
make[2]: *** [check] Error 2
make[2]: Leaving directory `/mesos/mesos-1.2.0/_build/3rdparty'
make[1]: *** [check-recursive] Error 1
make[1]: Leaving directory `/mesos/mesos-1.2.0/_build'
make: *** [distcheck] Error 1
+ docker rmi mesos-1484024489-24376
Untagged: mesos-1484024489-24376:latest
Deleted: sha256:0eed7368e7de4ee574857ed49c7bfcf7342884164f7cc8a08f4f1c9ba722d624
Deleted: sha256:abc42ec673666a80ad19afdda55131cc629de0978363ef2da08be02f22e2b344
Deleted: sha256:f3b2d831cc1adec2e1d22b1555b5b8261327725cd62b4621963c208c7f257805
Deleted: sha256:e7ab9ebeb645c77d0ba8f85ee48d8f4e33d1de6704a70cf3d47e7a5240ae52ac
Deleted: sha256:f9c7dee26853b704e0c9a3809589d838b3cef7c79aaa38a5907cefc7c5f345aa
Deleted: sha256:f8d58b54bc279bc6513f09026bb91f51805845bd5c0433b4938f8574682d2429
Deleted: sha256:97a8c3fadda25e376e27ed6672380fe111706f72d3006095348323f8fb5d09bd
Deleted: sha256:cd41952c8feede87b38c41b2f863ce079c9ab90c43183d04871adb0b072e4dee
Deleted: sha256:805307c6be413e9bb0a71b8f2ea45d1198d5ff3e13750bcc43fcff1e22aa1ce2
Deleted: sha256:14e4207e4645b93843e66b2b5a2ea1fe0ab7e4882e0ed51dfc480ce89a63a2fa
Deleted: sha256:1a5eec4debebdc7bb03b72882e532e82e65d380d7752e6565ad4afbcd30fce3f
Deleted: sha256:2a88c1868cfcb4c5c69228fc438b51bd01e0d6bd05e3c764720f08d6c1451ba2
Deleted: sha256:b0153ef435a5dcf94561f80f1e71d1ed7886614fb71ea6d8a9dac7e279aa0da0
Deleted: sha256:5d44bd71af11ebbd70ea69ec2b5e5836c157874ecf090cd9c7f7269b341e241b
Deleted: sha256:559721236734702a5cd512b523c71a9f763b4cd169e396b38d244a486bee037c
Deleted: sha256:a18ea55589a32b209bc85dfbf913e339feae8f88c6e164d85b4b22f7796a6a3d
Deleted: sha256:2423870e15b4de87b9d50d382e41b10c625141b92942e354da37b8b491a49e05
Deleted: sha256:fe1aad5b5e697cd308768cf2c7a68dedadc8170e579e47aaae1fc86cd0e048b7
Deleted: sha256:d1c346e63eb5ed2f39c2954c81b21330888b0d65fd97be19ed1ab2d95dedd77f
Deleted: sha256:5feeaf50af7818ee43683e54d0f0c54e10aa60409c6ecd2801f4a5aed97763b2
Deleted: sha256:be206cf8f29416433f01bc7c72dc397d0fe8e46b6212bd386aa8aec812f56307
Deleted: sha256:f03ded4710bf404661721ea39810b4faedfe48868e3321dc7acd8430cb10e9f8
Deleted: sha256:fc01b4884067379e4b5a9d654c19b558bf4c2b607f381a8c3730c7ad2e303078
Deleted: sha256:abd8308c9393a6c54a7a6bcb5b8fe1dfc9e607543f1f2127924e9cc41f15add0
Deleted: sha256:ae26c33c178ad214e31d823f39c2f64734cf3aa8d356d0ec2a792bd13f033aab
Build step 'Execute shell' marked build as failure