You are viewing a plain text version of this content. The canonical link for it is here.
Posted to yarn-dev@hadoop.apache.org by Apache Jenkins Server <je...@builds.apache.org> on 2014/01/04 01:00:44 UTC
Failed: YARN-1496 PreCommit Build #2795
Jira: https://issues.apache.org/jira/browse/YARN-1496
Build: https://builds.apache.org/job/PreCommit-YARN-Build/2795/
###################################################################################
########################## LAST 60 LINES OF THE CONSOLE ###########################
[...truncated 3656 lines...]
/bin/kill -9 26575
kill: No such process
NOP
{color:red}-1 overall{color}. Here are the results of testing the latest attachment
http://issues.apache.org/jira/secure/attachment/12621392/YARN-1496-2.patch
against trunk revision .
{color:green}+1 @author{color}. The patch does not contain any @author tags.
{color:green}+1 tests included{color}. The patch appears to include 1 new or modified test files.
{color:green}+1 javac{color}. The applied patch does not increase the total number of javac compiler warnings.
{color:red}-1 javadoc{color}. The javadoc tool appears to have generated 1 warning messages.
{color:green}+1 eclipse:eclipse{color}. The patch built with eclipse:eclipse.
{color:green}+1 findbugs{color}. The patch does not introduce any new Findbugs (version 1.3.9) warnings.
{color:green}+1 release audit{color}. The applied patch does not increase the total number of release audit warnings.
{color:red}-1 core tests{color}. The test build failed in hadoop-yarn-project/hadoop-yarn/hadoop-yarn-server/hadoop-yarn-server-resourcemanager
{color:green}+1 contrib tests{color}. The patch passed contrib unit tests.
Test results: https://builds.apache.org/job/PreCommit-YARN-Build/2795//testReport/
Console output: https://builds.apache.org/job/PreCommit-YARN-Build/2795//console
This message is automatically generated.
======================================================================
======================================================================
Adding comment to Jira.
======================================================================
======================================================================
Comment added.
e957888042e165a7f52231ef17a1a43f3f65e98f logged out
======================================================================
======================================================================
Finished build.
======================================================================
======================================================================
Build step 'Execute shell' marked build as failure
Archiving artifacts
[description-setter] Could not determine description.
Recording test results
Email was triggered for: Failure
Sending email for trigger: Failure
###################################################################################
############################## FAILED TESTS (if any) ##############################
All tests passed
Success: YARN-1560 PreCommit Build #2800
Posted by Apache Jenkins Server <je...@builds.apache.org>.
Jira: https://issues.apache.org/jira/browse/YARN-1560
Build: https://builds.apache.org/job/PreCommit-YARN-Build/2800/
###################################################################################
########################## LAST 60 LINES OF THE CONSOLE ###########################
[...truncated 2885 lines...]
/bin/kill -9 28006
kill: No such process
NOP
{color:green}+1 overall{color}. Here are the results of testing the latest attachment
http://issues.apache.org/jira/secure/attachment/12621481/yarn-1560-v1.txt
against trunk revision .
{color:green}+1 @author{color}. The patch does not contain any @author tags.
{color:green}+1 tests included{color}. The patch appears to include 1 new or modified test files.
{color:green}+1 javac{color}. The applied patch does not increase the total number of javac compiler warnings.
{color:green}+1 javadoc{color}. The javadoc tool did not generate any warning messages.
{color:green}+1 eclipse:eclipse{color}. The patch built with eclipse:eclipse.
{color:green}+1 findbugs{color}. The patch does not introduce any new Findbugs (version 1.3.9) warnings.
{color:green}+1 release audit{color}. The applied patch does not increase the total number of release audit warnings.
{color:green}+1 core tests{color}. The patch passed unit tests in hadoop-yarn-project/hadoop-yarn/hadoop-yarn-client.
{color:green}+1 contrib tests{color}. The patch passed contrib unit tests.
Test results: https://builds.apache.org/job/PreCommit-YARN-Build/2800//testReport/
Console output: https://builds.apache.org/job/PreCommit-YARN-Build/2800//console
This message is automatically generated.
======================================================================
======================================================================
Adding comment to Jira.
======================================================================
======================================================================
Comment added.
be082b471e8880f803946ed514a5fabc1ca150ed logged out
======================================================================
======================================================================
Finished build.
======================================================================
======================================================================
Archiving artifacts
Description set: YARN-1560
Recording test results
Email was triggered for: Success
Sending email for trigger: Success
###################################################################################
############################## FAILED TESTS (if any) ##############################
All tests passed
Failed: YARN-1559 PreCommit Build #2799
Posted by Apache Jenkins Server <je...@builds.apache.org>.
Jira: https://issues.apache.org/jira/browse/YARN-1559
Build: https://builds.apache.org/job/PreCommit-YARN-Build/2799/
###################################################################################
########################## LAST 60 LINES OF THE CONSOLE ###########################
[...truncated 3157 lines...]
{color:red}-1 overall{color}. Here are the results of testing the latest attachment
http://issues.apache.org/jira/secure/attachment/12621537/YARN-1559-20140105.txt
against trunk revision .
{color:green}+1 @author{color}. The patch does not contain any @author tags.
{color:red}-1 tests included{color}. The patch doesn't appear to include any new or modified tests.
Please justify why no new tests are needed for this patch.
Also please list what manual steps were performed to verify this patch.
{color:green}+1 javac{color}. The applied patch does not increase the total number of javac compiler warnings.
{color:green}+1 javadoc{color}. The javadoc tool did not generate any warning messages.
{color:green}+1 eclipse:eclipse{color}. The patch built with eclipse:eclipse.
{color:green}+1 findbugs{color}. The patch does not introduce any new Findbugs (version 1.3.9) warnings.
{color:green}+1 release audit{color}. The applied patch does not increase the total number of release audit warnings.
{color:red}-1 core tests{color}. The patch failed these unit tests in hadoop-yarn-project/hadoop-yarn/hadoop-yarn-client hadoop-yarn-project/hadoop-yarn/hadoop-yarn-common hadoop-yarn-project/hadoop-yarn/hadoop-yarn-server/hadoop-yarn-server-common:
org.apache.hadoop.yarn.client.api.impl.TestYarnClient
{color:green}+1 contrib tests{color}. The patch passed contrib unit tests.
Test results: https://builds.apache.org/job/PreCommit-YARN-Build/2799//testReport/
Console output: https://builds.apache.org/job/PreCommit-YARN-Build/2799//console
This message is automatically generated.
======================================================================
======================================================================
Adding comment to Jira.
======================================================================
======================================================================
Comment added.
3d4fb195bb3673e98e50d055a49c14baa7e32ed1 logged out
======================================================================
======================================================================
Finished build.
======================================================================
======================================================================
Build step 'Execute shell' marked build as failure
Archiving artifacts
[description-setter] Could not determine description.
Recording test results
Email was triggered for: Failure
Sending email for trigger: Failure
###################################################################################
############################## FAILED TESTS (if any) ##############################
1 tests failed.
FAILED: org.apache.hadoop.yarn.client.api.impl.TestYarnClient.testAMMRTokens
Error Message:
null
Stack Trace:
junit.framework.AssertionFailedError: null
at junit.framework.Assert.fail(Assert.java:48)
at junit.framework.Assert.assertTrue(Assert.java:20)
at junit.framework.Assert.assertNotNull(Assert.java:218)
at junit.framework.Assert.assertNotNull(Assert.java:211)
at org.apache.hadoop.yarn.client.api.impl.TestYarnClient.testAMMRTokens(TestYarnClient.java:382)
Failed: YARN-1559 PreCommit Build #2798
Posted by Apache Jenkins Server <je...@builds.apache.org>.
Jira: https://issues.apache.org/jira/browse/YARN-1559
Build: https://builds.apache.org/job/PreCommit-YARN-Build/2798/
###################################################################################
########################## LAST 60 LINES OF THE CONSOLE ###########################
[...truncated 3165 lines...]
{color:red}-1 overall{color}. Here are the results of testing the latest attachment
http://issues.apache.org/jira/secure/attachment/12621524/yarn-1559-2.patch
against trunk revision .
{color:green}+1 @author{color}. The patch does not contain any @author tags.
{color:red}-1 tests included{color}. The patch doesn't appear to include any new or modified tests.
Please justify why no new tests are needed for this patch.
Also please list what manual steps were performed to verify this patch.
{color:green}+1 javac{color}. The applied patch does not increase the total number of javac compiler warnings.
{color:green}+1 javadoc{color}. The javadoc tool did not generate any warning messages.
{color:green}+1 eclipse:eclipse{color}. The patch built with eclipse:eclipse.
{color:green}+1 findbugs{color}. The patch does not introduce any new Findbugs (version 1.3.9) warnings.
{color:green}+1 release audit{color}. The applied patch does not increase the total number of release audit warnings.
{color:red}-1 core tests{color}. The patch failed these unit tests in hadoop-yarn-project/hadoop-yarn/hadoop-yarn-client hadoop-yarn-project/hadoop-yarn/hadoop-yarn-common hadoop-yarn-project/hadoop-yarn/hadoop-yarn-server/hadoop-yarn-server-common:
org.apache.hadoop.yarn.client.TestRMFailover
org.apache.hadoop.yarn.client.api.impl.TestYarnClient
{color:green}+1 contrib tests{color}. The patch passed contrib unit tests.
Test results: https://builds.apache.org/job/PreCommit-YARN-Build/2798//testReport/
Console output: https://builds.apache.org/job/PreCommit-YARN-Build/2798//console
This message is automatically generated.
======================================================================
======================================================================
Adding comment to Jira.
======================================================================
======================================================================
Comment added.
7714cd959555c79606de9a289c4b5ba3875deeca logged out
======================================================================
======================================================================
Finished build.
======================================================================
======================================================================
Build step 'Execute shell' marked build as failure
Archiving artifacts
[description-setter] Could not determine description.
Recording test results
Email was triggered for: Failure
Sending email for trigger: Failure
###################################################################################
############################## FAILED TESTS (if any) ##############################
2 tests failed.
REGRESSION: org.apache.hadoop.yarn.client.TestRMFailover.testExplicitFailover
Error Message:
NMs failed to connect to the RM
Stack Trace:
java.lang.AssertionError: NMs failed to connect to the RM
at org.junit.Assert.fail(Assert.java:93)
at org.junit.Assert.assertTrue(Assert.java:43)
at org.apache.hadoop.yarn.client.TestRMFailover.testExplicitFailover(TestRMFailover.java:129)
FAILED: org.apache.hadoop.yarn.client.api.impl.TestYarnClient.testAMMRTokens
Error Message:
null
Stack Trace:
junit.framework.AssertionFailedError: null
at junit.framework.Assert.fail(Assert.java:48)
at junit.framework.Assert.assertTrue(Assert.java:20)
at junit.framework.Assert.assertNotNull(Assert.java:218)
at junit.framework.Assert.assertNotNull(Assert.java:211)
at org.apache.hadoop.yarn.client.api.impl.TestYarnClient.testAMMRTokens(TestYarnClient.java:382)
Failed: YARN-1559 PreCommit Build #2797
Posted by Apache Jenkins Server <je...@builds.apache.org>.
Jira: https://issues.apache.org/jira/browse/YARN-1559
Build: https://builds.apache.org/job/PreCommit-YARN-Build/2797/
###################################################################################
########################## LAST 60 LINES OF THE CONSOLE ###########################
[...truncated 3158 lines...]
{color:red}-1 overall{color}. Here are the results of testing the latest attachment
http://issues.apache.org/jira/secure/attachment/12621523/yarn-1559-1.patch
against trunk revision .
{color:green}+1 @author{color}. The patch does not contain any @author tags.
{color:red}-1 tests included{color}. The patch doesn't appear to include any new or modified tests.
Please justify why no new tests are needed for this patch.
Also please list what manual steps were performed to verify this patch.
{color:red}-1 javac{color}. The applied patch generated 1552 javac compiler warnings (more than the trunk's current 1542 warnings).
{color:green}+1 javadoc{color}. The javadoc tool did not generate any warning messages.
{color:green}+1 eclipse:eclipse{color}. The patch built with eclipse:eclipse.
{color:green}+1 findbugs{color}. The patch does not introduce any new Findbugs (version 1.3.9) warnings.
{color:green}+1 release audit{color}. The applied patch does not increase the total number of release audit warnings.
{color:red}-1 core tests{color}. The patch failed these unit tests in hadoop-yarn-project/hadoop-yarn/hadoop-yarn-client hadoop-yarn-project/hadoop-yarn/hadoop-yarn-common hadoop-yarn-project/hadoop-yarn/hadoop-yarn-server/hadoop-yarn-server-common:
org.apache.hadoop.yarn.client.api.impl.TestYarnClient
{color:green}+1 contrib tests{color}. The patch passed contrib unit tests.
Test results: https://builds.apache.org/job/PreCommit-YARN-Build/2797//testReport/
Javac warnings: https://builds.apache.org/job/PreCommit-YARN-Build/2797//artifact/trunk/patchprocess/diffJavacWarnings.txt
Console output: https://builds.apache.org/job/PreCommit-YARN-Build/2797//console
This message is automatically generated.
======================================================================
======================================================================
Adding comment to Jira.
======================================================================
======================================================================
Comment added.
cf330fe7d5c51e0976023eaf8dd78fab90c1beb1 logged out
======================================================================
======================================================================
Finished build.
======================================================================
======================================================================
Build step 'Execute shell' marked build as failure
Archiving artifacts
[description-setter] Could not determine description.
Recording test results
Email was triggered for: Failure
Sending email for trigger: Failure
###################################################################################
############################## FAILED TESTS (if any) ##############################
1 tests failed.
FAILED: org.apache.hadoop.yarn.client.api.impl.TestYarnClient.testAMMRTokens
Error Message:
null
Stack Trace:
junit.framework.AssertionFailedError: null
at junit.framework.Assert.fail(Assert.java:48)
at junit.framework.Assert.assertTrue(Assert.java:20)
at junit.framework.Assert.assertNotNull(Assert.java:218)
at junit.framework.Assert.assertNotNull(Assert.java:211)
at org.apache.hadoop.yarn.client.api.impl.TestYarnClient.testAMMRTokens(TestYarnClient.java:382)
Failed: YARN-1136 PreCommit Build #2796
Posted by Apache Jenkins Server <je...@builds.apache.org>.
Jira: https://issues.apache.org/jira/browse/YARN-1136
Build: https://builds.apache.org/job/PreCommit-YARN-Build/2796/
###################################################################################
########################## LAST 60 LINES OF THE CONSOLE ###########################
[...truncated 19 lines...]
[PreCommit-YARN-Build] $ /bin/bash /tmp/hudson3400946066783411994.sh
32768
Running in Jenkins mode
======================================================================
======================================================================
Testing patch for YARN-1136.
======================================================================
======================================================================
rm: cannot remove `hadoop-yarn-project/hadoop-yarn/hadoop-yarn-common/target/TestFSDownload/public-cache': Permission denied
At revision 1555263.
YARN-1136 patch is being downloaded at Fri Jan 3 22:20:52 UTC 2014 from
http://issues.apache.org/jira/secure/attachment/12620886/yarn1136.patch
cp: cannot stat `/home/jenkins/buildSupport/lib/*': No such file or directory
The patch does not appear to apply with p0 to p2
PATCH APPLICATION FAILED
{color:red}-1 overall{color}. Here are the results of testing the latest attachment
http://issues.apache.org/jira/secure/attachment/12620886/yarn1136.patch
against trunk revision .
{color:red}-1 patch{color}. The patch command could not apply the patch.
Console output: https://builds.apache.org/job/PreCommit-YARN-Build/2796//console
This message is automatically generated.
======================================================================
======================================================================
Adding comment to Jira.
======================================================================
======================================================================
Comment added.
ba7442e8bf0c1b17ac0c1c4c5a2facec8c05f2f8 logged out
======================================================================
======================================================================
Finished build.
======================================================================
======================================================================
Build step 'Execute shell' marked build as failure
Archiving artifacts
[description-setter] Could not determine description.
Recording test results
Editable Email Notification is waiting for a checkpoint on PreCommit-YARN-Build #2795
Email was triggered for: Failure
Sending email for trigger: Failure
###################################################################################
############################## FAILED TESTS (if any) ##############################
No tests ran.