You are viewing a plain text version of this content. The canonical link for it is here.
Posted to commits@phoenix.apache.org by Apache Jenkins Server <je...@builds.apache.org> on 2018/10/31 21:30:19 UTC
Build failed in Jenkins: Phoenix-4.x-HBase-1.3 #248
See <https://builds.apache.org/job/Phoenix-4.x-HBase-1.3/248/display/redirect?page=changes>
Changes:
[elserj] PHOENIX-4909 Missing the phoenix-loadbalancer module dependency in
------------------------------------------
[...truncated 158.84 KB...]
at org.apache.phoenix.end2end.ViewIT.testRecreateDroppedTableWithChildViews(ViewIT.java:504)
[ERROR] testConcurrentAddDifferentColumn[ViewIT_transactionProvider=TEPHRA, columnEncoded=true](org.apache.phoenix.end2end.ViewIT) Time elapsed: 10.004 s <<< ERROR!
java.lang.RuntimeException: org.apache.thrift.TException: Unable to discover transaction service.
at org.apache.phoenix.end2end.ViewIT.testConcurrentAddDifferentColumn(ViewIT.java:1476)
Caused by: org.apache.thrift.TException: Unable to discover transaction service.
at org.apache.phoenix.end2end.ViewIT.testConcurrentAddDifferentColumn(ViewIT.java:1476)
[ERROR] testViewAndTableAndDropCascadeWithIndexes[ViewIT_transactionProvider=TEPHRA, columnEncoded=true](org.apache.phoenix.end2end.ViewIT) Time elapsed: 10.004 s <<< ERROR!
java.lang.RuntimeException: org.apache.thrift.TException: Unable to discover transaction service.
at org.apache.phoenix.end2end.ViewIT.testViewAndTableAndDropCascadeWithIndexes(ViewIT.java:619)
Caused by: org.apache.thrift.TException: Unable to discover transaction service.
at org.apache.phoenix.end2end.ViewIT.testViewAndTableAndDropCascadeWithIndexes(ViewIT.java:619)
[ERROR] testViewUsesTableLocalIndex[ViewIT_transactionProvider=TEPHRA, columnEncoded=true](org.apache.phoenix.end2end.ViewIT) Time elapsed: 10.004 s <<< ERROR!
java.lang.RuntimeException: org.apache.thrift.TException: Unable to discover transaction service.
at org.apache.phoenix.end2end.ViewIT.testViewUsesTableIndex(ViewIT.java:679)
at org.apache.phoenix.end2end.ViewIT.testViewUsesTableLocalIndex(ViewIT.java:667)
Caused by: org.apache.thrift.TException: Unable to discover transaction service.
at org.apache.phoenix.end2end.ViewIT.testViewUsesTableIndex(ViewIT.java:679)
at org.apache.phoenix.end2end.ViewIT.testViewUsesTableLocalIndex(ViewIT.java:667)
[ERROR] testDisallowDropOfColumnOnParentTable[ViewIT_transactionProvider=TEPHRA, columnEncoded=true](org.apache.phoenix.end2end.ViewIT) Time elapsed: 10.004 s <<< ERROR!
java.lang.RuntimeException: org.apache.thrift.TException: Unable to discover transaction service.
at org.apache.phoenix.end2end.ViewIT.testDisallowDropOfColumnOnParentTable(ViewIT.java:446)
Caused by: org.apache.thrift.TException: Unable to discover transaction service.
at org.apache.phoenix.end2end.ViewIT.testDisallowDropOfColumnOnParentTable(ViewIT.java:446)
[ERROR] testViewUsesTableGlobalIndex[ViewIT_transactionProvider=TEPHRA, columnEncoded=true](org.apache.phoenix.end2end.ViewIT) Time elapsed: 10.006 s <<< ERROR!
java.lang.RuntimeException: org.apache.thrift.TException: Unable to discover transaction service.
at org.apache.phoenix.end2end.ViewIT.testViewUsesTableIndex(ViewIT.java:679)
at org.apache.phoenix.end2end.ViewIT.testViewUsesTableGlobalIndex(ViewIT.java:659)
Caused by: org.apache.thrift.TException: Unable to discover transaction service.
at org.apache.phoenix.end2end.ViewIT.testViewUsesTableIndex(ViewIT.java:679)
at org.apache.phoenix.end2end.ViewIT.testViewUsesTableGlobalIndex(ViewIT.java:659)
[ERROR] testCreateViewDefinesPKConstraint[ViewIT_transactionProvider=TEPHRA, columnEncoded=true](org.apache.phoenix.end2end.ViewIT) Time elapsed: 10.005 s <<< ERROR!
java.lang.RuntimeException: org.apache.thrift.TException: Unable to discover transaction service.
at org.apache.phoenix.end2end.ViewIT.testCreateViewDefinesPKConstraint(ViewIT.java:763)
Caused by: org.apache.thrift.TException: Unable to discover transaction service.
at org.apache.phoenix.end2end.ViewIT.testCreateViewDefinesPKConstraint(ViewIT.java:763)
[ERROR] testReadOnlyViewWithCaseSensitiveColumnNames[ViewIT_transactionProvider=TEPHRA, columnEncoded=true](org.apache.phoenix.end2end.ViewIT) Time elapsed: 10.009 s <<< ERROR!
java.lang.RuntimeException: org.apache.thrift.TException: Unable to discover transaction service.
at org.apache.phoenix.end2end.ViewIT.testReadOnlyViewWithCaseSensitiveColumnNames(ViewIT.java:321)
Caused by: org.apache.thrift.TException: Unable to discover transaction service.
at org.apache.phoenix.end2end.ViewIT.testReadOnlyViewWithCaseSensitiveColumnNames(ViewIT.java:321)
[ERROR] testRecreateIndexWhoseAncestorWasDropped[ViewIT_transactionProvider=TEPHRA, columnEncoded=true](org.apache.phoenix.end2end.ViewIT) Time elapsed: 10.005 s <<< ERROR!
java.lang.RuntimeException: org.apache.thrift.TException: Unable to discover transaction service.
at org.apache.phoenix.end2end.ViewIT.testRecreateIndexWhoseAncestorWasDropped(ViewIT.java:542)
Caused by: org.apache.thrift.TException: Unable to discover transaction service.
at org.apache.phoenix.end2end.ViewIT.testRecreateIndexWhoseAncestorWasDropped(ViewIT.java:542)
[ERROR] testViewAddsPKColumnWhoseParentsLastPKIsVarLength[ViewIT_transactionProvider=TEPHRA, columnEncoded=true](org.apache.phoenix.end2end.ViewIT) Time elapsed: 10.005 s <<< ERROR!
java.lang.RuntimeException: org.apache.thrift.TException: Unable to discover transaction service.
at org.apache.phoenix.end2end.ViewIT.testViewAddsPKColumnWhoseParentsLastPKIsVarLength(ViewIT.java:804)
Caused by: org.apache.thrift.TException: Unable to discover transaction service.
at org.apache.phoenix.end2end.ViewIT.testViewAddsPKColumnWhoseParentsLastPKIsVarLength(ViewIT.java:804)
[ERROR] testViewAddsPKColumn[ViewIT_transactionProvider=TEPHRA, columnEncoded=true](org.apache.phoenix.end2end.ViewIT) Time elapsed: 10.032 s <<< ERROR!
java.lang.RuntimeException: org.apache.thrift.TException: Unable to discover transaction service.
at org.apache.phoenix.end2end.ViewIT.testViewAddsPKColumn(ViewIT.java:785)
Caused by: org.apache.thrift.TException: Unable to discover transaction service.
at org.apache.phoenix.end2end.ViewIT.testViewAddsPKColumn(ViewIT.java:785)
[ERROR] testDisallowDropOfReferencedColumn[ViewIT_transactionProvider=TEPHRA, columnEncoded=true](org.apache.phoenix.end2end.ViewIT) Time elapsed: 10.005 s <<< ERROR!
java.lang.RuntimeException: org.apache.thrift.TException: Unable to discover transaction service.
at org.apache.phoenix.end2end.ViewIT.testDisallowDropOfReferencedColumn(ViewIT.java:244)
Caused by: org.apache.thrift.TException: Unable to discover transaction service.
at org.apache.phoenix.end2end.ViewIT.testDisallowDropOfReferencedColumn(ViewIT.java:244)
[ERROR] testCreateViewMappedToExistingHbaseTableWithNamespaceMappingEnabled[ViewIT_transactionProvider=TEPHRA, columnEncoded=true](org.apache.phoenix.end2end.ViewIT) Time elapsed: 29.171 s <<< ERROR!
org.apache.phoenix.schema.TableNotFoundException: ERROR 1012 (42M03): Table undefined. tableName=NS_N000131.TBL_N000132
at org.apache.phoenix.end2end.ViewIT.testCreateViewMappedToExistingHbaseTableWithNamespaceMappingEnabled(ViewIT.java:962)
[ERROR] testConcurrentViewCreationAndTableDrop[ViewIT_transactionProvider=TEPHRA, columnEncoded=true](org.apache.phoenix.end2end.ViewIT) Time elapsed: 10.004 s <<< ERROR!
java.lang.RuntimeException: org.apache.thrift.TException: Unable to discover transaction service.
at org.apache.phoenix.end2end.ViewIT.testConcurrentViewCreationAndTableDrop(ViewIT.java:1371)
Caused by: org.apache.thrift.TException: Unable to discover transaction service.
at org.apache.phoenix.end2end.ViewIT.testConcurrentViewCreationAndTableDrop(ViewIT.java:1371)
[ERROR] testRecreateViewWhoseParentWasDropped[ViewIT_transactionProvider=TEPHRA, columnEncoded=true](org.apache.phoenix.end2end.ViewIT) Time elapsed: 10.005 s <<< ERROR!
java.lang.RuntimeException: org.apache.thrift.TException: Unable to discover transaction service.
at org.apache.phoenix.end2end.ViewIT.testRecreateViewWhoseParentWasDropped(ViewIT.java:580)
Caused by: org.apache.thrift.TException: Unable to discover transaction service.
at org.apache.phoenix.end2end.ViewIT.testRecreateViewWhoseParentWasDropped(ViewIT.java:580)
[ERROR] testConcurrentAddSameColumnDifferentType[ViewIT_transactionProvider=TEPHRA, columnEncoded=true](org.apache.phoenix.end2end.ViewIT) Time elapsed: 10.005 s <<< ERROR!
java.lang.RuntimeException: org.apache.thrift.TException: Unable to discover transaction service.
at org.apache.phoenix.end2end.ViewIT.testConcurrentAddSameColumnDifferentType(ViewIT.java:1414)
Caused by: org.apache.thrift.TException: Unable to discover transaction service.
at org.apache.phoenix.end2end.ViewIT.testConcurrentAddSameColumnDifferentType(ViewIT.java:1414)
[ERROR] testQueryViewStatementOptimization[ViewIT_transactionProvider=TEPHRA, columnEncoded=true](org.apache.phoenix.end2end.ViewIT) Time elapsed: 10.005 s <<< ERROR!
java.lang.RuntimeException: org.apache.thrift.TException: Unable to discover transaction service.
at org.apache.phoenix.end2end.ViewIT.testQueryViewStatementOptimization(ViewIT.java:865)
Caused by: org.apache.thrift.TException: Unable to discover transaction service.
at org.apache.phoenix.end2end.ViewIT.testQueryViewStatementOptimization(ViewIT.java:865)
[ERROR] testViewAndTableInDifferentSchemasWithNamespaceMappingEnabled[ViewIT_transactionProvider=TEPHRA, columnEncoded=true](org.apache.phoenix.end2end.ViewIT) Time elapsed: 10.013 s <<< ERROR!
java.lang.RuntimeException: org.apache.thrift.TException: Unable to discover transaction service.
at org.apache.phoenix.end2end.ViewIT.testViewAndTableInDifferentSchemas(ViewIT.java:406)
at org.apache.phoenix.end2end.ViewIT.testViewAndTableInDifferentSchemasWithNamespaceMappingEnabled(ViewIT.java:379)
Caused by: org.apache.thrift.TException: Unable to discover transaction service.
at org.apache.phoenix.end2end.ViewIT.testViewAndTableInDifferentSchemas(ViewIT.java:406)
at org.apache.phoenix.end2end.ViewIT.testViewAndTableInDifferentSchemasWithNamespaceMappingEnabled(ViewIT.java:379)
[ERROR] testViewAndTableInDifferentSchemas[ViewIT_transactionProvider=TEPHRA, columnEncoded=true](org.apache.phoenix.end2end.ViewIT) Time elapsed: 10.004 s <<< ERROR!
java.lang.RuntimeException: org.apache.thrift.TException: Unable to discover transaction service.
at org.apache.phoenix.end2end.ViewIT.testViewAndTableInDifferentSchemas(ViewIT.java:406)
at org.apache.phoenix.end2end.ViewIT.testViewAndTableInDifferentSchemas(ViewIT.java:384)
Caused by: org.apache.thrift.TException: Unable to discover transaction service.
at org.apache.phoenix.end2end.ViewIT.testViewAndTableInDifferentSchemas(ViewIT.java:406)
at org.apache.phoenix.end2end.ViewIT.testViewAndTableInDifferentSchemas(ViewIT.java:384)
[ERROR] testChildViewCreationFails[ViewIT_transactionProvider=TEPHRA, columnEncoded=true](org.apache.phoenix.end2end.ViewIT) Time elapsed: 10.004 s <<< ERROR!
java.lang.RuntimeException: org.apache.thrift.TException: Unable to discover transaction service.
at org.apache.phoenix.end2end.ViewIT.testChildViewCreationFails(ViewIT.java:1337)
Caused by: org.apache.thrift.TException: Unable to discover transaction service.
at org.apache.phoenix.end2end.ViewIT.testChildViewCreationFails(ViewIT.java:1337)
[ERROR] testCreateViewDefinesPKColumn[ViewIT_transactionProvider=TEPHRA, columnEncoded=true](org.apache.phoenix.end2end.ViewIT) Time elapsed: 10.004 s <<< ERROR!
java.lang.RuntimeException: org.apache.thrift.TException: Unable to discover transaction service.
at org.apache.phoenix.end2end.ViewIT.testCreateViewDefinesPKColumn(ViewIT.java:729)
Caused by: org.apache.thrift.TException: Unable to discover transaction service.
at org.apache.phoenix.end2end.ViewIT.testCreateViewDefinesPKColumn(ViewIT.java:729)
[ERROR] testViewAndTableAndDropCascade[ViewIT_transactionProvider=TEPHRA, columnEncoded=true](org.apache.phoenix.end2end.ViewIT) Time elapsed: 10.005 s <<< ERROR!
java.lang.RuntimeException: org.apache.thrift.TException: Unable to discover transaction service.
at org.apache.phoenix.end2end.ViewIT.testViewAndTableAndDropCascade(ViewIT.java:466)
Caused by: org.apache.thrift.TException: Unable to discover transaction service.
at org.apache.phoenix.end2end.ViewIT.testViewAndTableAndDropCascade(ViewIT.java:466)
[ERROR] testCreateViewMappedToExistingHbaseTableWithNamespaceMappingEnabled[ViewIT_transactionProvider=null, columnEncoded=false](org.apache.phoenix.end2end.ViewIT) Time elapsed: 29.217 s <<< ERROR!
org.apache.phoenix.schema.TableNotFoundException: ERROR 1012 (42M03): Table undefined. tableName=NS_N000226.TBL_N000227
at org.apache.phoenix.end2end.ViewIT.testCreateViewMappedToExistingHbaseTableWithNamespaceMappingEnabled(ViewIT.java:962)
[ERROR] testCreateViewMappedToExistingHbaseTableWithNamespaceMappingEnabled[ViewIT_transactionProvider=null, columnEncoded=true](org.apache.phoenix.end2end.ViewIT) Time elapsed: 28.093 s <<< ERROR!
org.apache.phoenix.schema.TableNotFoundException: ERROR 1012 (42M03): Table undefined. tableName=NS_N000324.TBL_N000325
at org.apache.phoenix.end2end.ViewIT.testCreateViewMappedToExistingHbaseTableWithNamespaceMappingEnabled(ViewIT.java:962)
[INFO]
[INFO] Results:
[INFO]
[ERROR] Errors:
[ERROR] ViewIT.testChildViewCreationFails:1337 » Runtime org.apache.thrift.TException:...
[ERROR] ViewIT.testChildViewCreationFails:1337 » Runtime org.apache.thrift.TException:...
[ERROR] ViewIT.testConcurrentAddDifferentColumn:1476 » Runtime org.apache.thrift.TExce...
[ERROR] ViewIT.testConcurrentAddDifferentColumn:1476 » Runtime org.apache.thrift.TExce...
[ERROR] ViewIT.testConcurrentAddSameColumnDifferentType:1414 » Runtime org.apache.thri...
[ERROR] ViewIT.testConcurrentAddSameColumnDifferentType:1414 » Runtime org.apache.thri...
[ERROR] ViewIT.testConcurrentViewCreationAndTableDrop:1371 » Runtime org.apache.thrift...
[ERROR] ViewIT.testConcurrentViewCreationAndTableDrop:1371 » Runtime org.apache.thrift...
[ERROR] ViewIT.testCreateViewDefinesPKColumn:729 » Runtime org.apache.thrift.TExceptio...
[ERROR] ViewIT.testCreateViewDefinesPKColumn:729 » Runtime org.apache.thrift.TExceptio...
[ERROR] ViewIT.testCreateViewDefinesPKConstraint:763 » Runtime org.apache.thrift.TExce...
[ERROR] ViewIT.testCreateViewDefinesPKConstraint:763 » Runtime org.apache.thrift.TExce...
[ERROR] ViewIT.testCreateViewMappedToExistingHbaseTableWithNamespaceMappingEnabled:962 » TableNotFound
[ERROR] ViewIT.testCreateViewMappedToExistingHbaseTableWithNamespaceMappingEnabled:962 » TableNotFound
[ERROR] ViewIT.testCreateViewMappedToExistingHbaseTableWithNamespaceMappingEnabled:962 » TableNotFound
[ERROR] ViewIT.testCreateViewMappedToExistingHbaseTableWithNamespaceMappingEnabled:962 » TableNotFound
[ERROR] ViewIT.testDisallowDropOfColumnOnParentTable:446 » Runtime org.apache.thrift.T...
[ERROR] ViewIT.testDisallowDropOfColumnOnParentTable:446 » Runtime org.apache.thrift.T...
[ERROR] ViewIT.testDisallowDropOfReferencedColumn:244 » Runtime org.apache.thrift.TExc...
[ERROR] ViewIT.testDisallowDropOfReferencedColumn:244 » Runtime org.apache.thrift.TExc...
[ERROR] ViewIT.testQueryViewStatementOptimization:865 » Runtime org.apache.thrift.TExc...
[ERROR] ViewIT.testQueryViewStatementOptimization:865 » Runtime org.apache.thrift.TExc...
[ERROR] ViewIT.testReadOnlyOnUpdatableView:211->testUpdatableView:1186 » Runtime org.a...
[ERROR] ViewIT.testReadOnlyOnUpdatableView:211->testUpdatableView:1186 » Runtime org.a...
[ERROR] ViewIT.testReadOnlyViewWithCaseSensitiveColumnNames:321 » Runtime org.apache.t...
[ERROR] ViewIT.testReadOnlyViewWithCaseSensitiveColumnNames:321 » Runtime org.apache.t...
[ERROR] ViewIT.testReadOnlyViewWithCaseSensitiveTableNames:283 » Runtime org.apache.th...
[ERROR] ViewIT.testReadOnlyViewWithCaseSensitiveTableNames:283 » Runtime org.apache.th...
[ERROR] ViewIT.testRecreateDroppedTableWithChildViews:504 » Runtime org.apache.thrift....
[ERROR] ViewIT.testRecreateDroppedTableWithChildViews:504 » Runtime org.apache.thrift....
[ERROR] ViewIT.testRecreateIndexWhoseAncestorWasDropped:542 » Runtime org.apache.thrif...
[ERROR] ViewIT.testRecreateIndexWhoseAncestorWasDropped:542 » Runtime org.apache.thrif...
[ERROR] ViewIT.testRecreateViewWhoseParentWasDropped:580 » Runtime org.apache.thrift.T...
[ERROR] ViewIT.testRecreateViewWhoseParentWasDropped:580 » Runtime org.apache.thrift.T...
[ERROR] ViewIT.testViewAddsClashingPKColumn[ViewIT_transactionProvider=TEPHRA, columnEncoded=false] »
[ERROR] ViewIT.testViewAddsClashingPKColumn[ViewIT_transactionProvider=TEPHRA, columnEncoded=true] »
[ERROR] ViewIT.testViewAddsNotNullPKColumn:845 » Runtime org.apache.thrift.TException:...
[ERROR] ViewIT.testViewAddsNotNullPKColumn:845 » Runtime org.apache.thrift.TException:...
[ERROR] ViewIT.testViewAddsPKColumnWhoseParentsLastPKIsVarLength:804 » Runtime org.apa...
[ERROR] ViewIT.testViewAddsPKColumnWhoseParentsLastPKIsVarLength:804 » Runtime org.apa...
[ERROR] ViewIT.testViewAddsPKColumn:785 » Runtime org.apache.thrift.TException: Unable...
[ERROR] ViewIT.testViewAddsPKColumn:785 » Runtime org.apache.thrift.TException: Unable...
[ERROR] ViewIT.testViewAndTableAndDropCascadeWithIndexes:619 » Runtime org.apache.thri...
[ERROR] ViewIT.testViewAndTableAndDropCascadeWithIndexes:619 » Runtime org.apache.thri...
[ERROR] ViewIT.testViewAndTableAndDropCascade:466 » Runtime org.apache.thrift.TExcepti...
[ERROR] ViewIT.testViewAndTableAndDropCascade:466 » Runtime org.apache.thrift.TExcepti...
[ERROR] ViewIT.testViewAndTableInDifferentSchemasWithNamespaceMappingEnabled:379->testViewAndTableInDifferentSchemas:406 » Runtime
[ERROR] ViewIT.testViewAndTableInDifferentSchemasWithNamespaceMappingEnabled:379->testViewAndTableInDifferentSchemas:406 » Runtime
[ERROR] ViewIT.testViewAndTableInDifferentSchemas:384->testViewAndTableInDifferentSchemas:406 » Runtime
[ERROR] ViewIT.testViewAndTableInDifferentSchemas:384->testViewAndTableInDifferentSchemas:406 » Runtime
[ERROR] ViewIT.testViewUsesTableGlobalIndex:659->testViewUsesTableIndex:679 » Runtime ...
[ERROR] ViewIT.testViewUsesTableGlobalIndex:659->testViewUsesTableIndex:679 » Runtime ...
[ERROR] ViewIT.testViewUsesTableLocalIndex:667->testViewUsesTableIndex:679 » Runtime o...
[ERROR] ViewIT.testViewUsesTableLocalIndex:667->testViewUsesTableIndex:679 » Runtime o...
[ERROR] ViewIT.testViewWithCurrentDate:352 » Runtime org.apache.thrift.TException: Una...
[ERROR] ViewIT.testViewWithCurrentDate:352 » Runtime org.apache.thrift.TException: Una...
[INFO]
[ERROR] Tests run: 273, Failures: 0, Errors: 56, Skipped: 2
[INFO]
[INFO]
[INFO] --- maven-failsafe-plugin:2.20:verify (ParallelStatsEnabledTest) @ phoenix-core ---
[INFO] ------------------------------------------------------------------------
[INFO] Reactor Summary:
[INFO]
[INFO] Apache Phoenix 4.14.0-HBase-1.3 .................... SUCCESS [ 2.097 s]
[INFO] Phoenix Core ....................................... FAILURE [ 04:09 h]
[INFO] Phoenix - Flume .................................... SKIPPED
[INFO] Phoenix - Kafka .................................... SKIPPED
[INFO] Phoenix - Pig ...................................... SKIPPED
[INFO] Phoenix Query Server Client ........................ SKIPPED
[INFO] Phoenix Query Server ............................... SKIPPED
[INFO] Phoenix - Pherf .................................... SKIPPED
[INFO] Phoenix - Spark .................................... SKIPPED
[INFO] Phoenix - Hive ..................................... SKIPPED
[INFO] Phoenix Client ..................................... SKIPPED
[INFO] Phoenix Server ..................................... SKIPPED
[INFO] Phoenix Load Balancer .............................. SKIPPED
[INFO] Phoenix Assembly ................................... SKIPPED
[INFO] Phoenix - Tracing Web Application 4.14.0-HBase-1.3 . SKIPPED
[INFO] ------------------------------------------------------------------------
[INFO] BUILD FAILURE
[INFO] ------------------------------------------------------------------------
[INFO] Total time: 04:09 h
[INFO] Finished at: 2018-10-31T21:24:55Z
[INFO] ------------------------------------------------------------------------
[ERROR] Failed to execute goal org.apache.maven.plugins:maven-failsafe-plugin:2.20:verify (ParallelStatsEnabledTest) on project phoenix-core: There are test failures.
[ERROR]
[ERROR] Please refer to <https://builds.apache.org/job/Phoenix-4.x-HBase-1.3/ws/phoenix-core/target/failsafe-reports> for the individual test results.
[ERROR] Please refer to dump files (if any exist) [date]-jvmRun[N].dump, [date].dumpstream and [date]-jvmRun[N].dumpstream.
[ERROR] -> [Help 1]
[ERROR]
[ERROR] To see the full stack trace of the errors, re-run Maven with the -e switch.
[ERROR] Re-run Maven using the -X switch to enable full debug logging.
[ERROR]
[ERROR] For more information about the errors and possible solutions, please read the following articles:
[ERROR] [Help 1] http://cwiki.apache.org/confluence/display/MAVEN/MojoFailureException
[ERROR]
[ERROR] After correcting the problems, you can resume the build with the command
[ERROR] mvn <goals> -rf :phoenix-core
Build step 'Invoke top-level Maven targets' marked build as failure
Archiving artifacts
[JIRA] Updating issue PHOENIX-4909
Recording test results
Build failed in Jenkins: Phoenix-4.x-HBase-1.3 #249
Posted by Apache Jenkins Server <je...@builds.apache.org>.
See <https://builds.apache.org/job/Phoenix-4.x-HBase-1.3/249/display/redirect>
------------------------------------------
[...truncated 1.70 MB...]
[INFO] Running org.apache.phoenix.end2end.CostBasedDecisionIT
[INFO] Running org.apache.phoenix.end2end.CountDistinctCompressionIT
[INFO] Tests run: 1, Failures: 0, Errors: 0, Skipped: 0, Time elapsed: 2.545 s - in org.apache.phoenix.end2end.CountDistinctCompressionIT
[WARNING] Tests run: 28, Failures: 0, Errors: 0, Skipped: 4, Time elapsed: 104.846 s - in org.apache.phoenix.end2end.ColumnEncodedMutableTxStatsCollectorIT
[INFO] Running org.apache.phoenix.end2end.CsvBulkLoadToolIT
[INFO] Running org.apache.phoenix.end2end.DropSchemaIT
[INFO] Tests run: 2, Failures: 0, Errors: 0, Skipped: 0, Time elapsed: 16.932 s - in org.apache.phoenix.end2end.DropSchemaIT
[INFO] Tests run: 13, Failures: 0, Errors: 0, Skipped: 0, Time elapsed: 74.947 s - in org.apache.phoenix.end2end.CsvBulkLoadToolIT
[INFO] Running org.apache.phoenix.end2end.FlappingLocalIndexIT
[INFO] Running org.apache.phoenix.end2end.IndexExtendedIT
[INFO] Tests run: 32, Failures: 0, Errors: 0, Skipped: 0, Time elapsed: 119.691 s - in org.apache.phoenix.end2end.IndexExtendedIT
[INFO] Tests run: 12, Failures: 0, Errors: 0, Skipped: 0, Time elapsed: 132.121 s - in org.apache.phoenix.end2end.FlappingLocalIndexIT
[INFO] Tests run: 12, Failures: 0, Errors: 0, Skipped: 0, Time elapsed: 587.145 s - in org.apache.phoenix.end2end.ChangePermissionsIT
[INFO] Running org.apache.phoenix.end2end.IndexToolForPartialBuildIT
[INFO] Running org.apache.phoenix.end2end.IndexScrutinyToolIT
[INFO] Running org.apache.phoenix.end2end.IndexToolForPartialBuildWithNamespaceEnabledIT
[INFO] Tests run: 20, Failures: 0, Errors: 0, Skipped: 0, Time elapsed: 384.89 s - in org.apache.phoenix.end2end.CostBasedDecisionIT
[INFO] Tests run: 1, Failures: 0, Errors: 0, Skipped: 0, Time elapsed: 14.25 s - in org.apache.phoenix.end2end.IndexToolForPartialBuildIT
[INFO] Tests run: 2, Failures: 0, Errors: 0, Skipped: 0, Time elapsed: 27.821 s - in org.apache.phoenix.end2end.IndexToolForPartialBuildWithNamespaceEnabledIT
[INFO] Running org.apache.phoenix.end2end.MigrateSystemTablesToSystemNamespaceIT
[INFO] Running org.apache.phoenix.end2end.IndexToolIT
[INFO] Running org.apache.phoenix.end2end.LocalIndexSplitMergeIT
[INFO] Tests run: 4, Failures: 0, Errors: 0, Skipped: 0, Time elapsed: 258.117 s - in org.apache.phoenix.end2end.MigrateSystemTablesToSystemNamespaceIT
[INFO] Running org.apache.phoenix.end2end.NonColumnEncodedImmutableNonTxStatsCollectorIT
[INFO] Tests run: 33, Failures: 0, Errors: 0, Skipped: 0, Time elapsed: 368.566 s - in org.apache.phoenix.end2end.IndexScrutinyToolIT
[INFO] Running org.apache.phoenix.end2end.NonColumnEncodedImmutableTxStatsCollectorIT
[WARNING] Tests run: 28, Failures: 0, Errors: 0, Skipped: 4, Time elapsed: 100.838 s - in org.apache.phoenix.end2end.NonColumnEncodedImmutableNonTxStatsCollectorIT
[INFO] Running org.apache.phoenix.end2end.PartialResultServerConfigurationIT
[WARNING] Tests run: 28, Failures: 0, Errors: 0, Skipped: 4, Time elapsed: 99.905 s - in org.apache.phoenix.end2end.NonColumnEncodedImmutableTxStatsCollectorIT
[INFO] Tests run: 1, Failures: 0, Errors: 0, Skipped: 0, Time elapsed: 34.981 s - in org.apache.phoenix.end2end.PartialResultServerConfigurationIT
[INFO] Tests run: 3, Failures: 0, Errors: 0, Skipped: 0, Time elapsed: 454.895 s - in org.apache.phoenix.end2end.LocalIndexSplitMergeIT
[INFO] Running org.apache.phoenix.end2end.PhoenixDriverIT
[INFO] Running org.apache.phoenix.end2end.QueryLoggerIT
[INFO] Running org.apache.phoenix.end2end.QueryTimeoutIT
[INFO] Tests run: 2, Failures: 0, Errors: 0, Skipped: 0, Time elapsed: 7.806 s - in org.apache.phoenix.end2end.QueryTimeoutIT
[INFO] Tests run: 4, Failures: 0, Errors: 0, Skipped: 0, Time elapsed: 54.686 s - in org.apache.phoenix.end2end.PhoenixDriverIT
[INFO] Tests run: 7, Failures: 0, Errors: 0, Skipped: 0, Time elapsed: 48.88 s - in org.apache.phoenix.end2end.QueryLoggerIT
[INFO] Running org.apache.phoenix.end2end.QueryWithLimitIT
[INFO] Tests run: 2, Failures: 0, Errors: 0, Skipped: 0, Time elapsed: 4.209 s - in org.apache.phoenix.end2end.QueryWithLimitIT
[INFO] Running org.apache.phoenix.end2end.RebuildIndexConnectionPropsIT
[INFO] Tests run: 1, Failures: 0, Errors: 0, Skipped: 0, Time elapsed: 0.531 s - in org.apache.phoenix.end2end.RebuildIndexConnectionPropsIT
[INFO] Running org.apache.phoenix.end2end.RegexBulkLoadToolIT
[INFO] Running org.apache.phoenix.end2end.RenewLeaseIT
[INFO] Running org.apache.phoenix.end2end.SequencePointInTimeIT
[INFO] Tests run: 1, Failures: 0, Errors: 0, Skipped: 0, Time elapsed: 0.185 s - in org.apache.phoenix.end2end.SequencePointInTimeIT
[INFO] Tests run: 1, Failures: 0, Errors: 0, Skipped: 0, Time elapsed: 25.744 s - in org.apache.phoenix.end2end.RenewLeaseIT
[INFO] Tests run: 10, Failures: 0, Errors: 0, Skipped: 0, Time elapsed: 69.649 s - in org.apache.phoenix.end2end.RegexBulkLoadToolIT
[INFO] Running org.apache.phoenix.end2end.SplitIT
[INFO] Running org.apache.phoenix.end2end.SpillableGroupByIT
[INFO] Tests run: 3, Failures: 0, Errors: 0, Skipped: 0, Time elapsed: 7.966 s - in org.apache.phoenix.end2end.SpillableGroupByIT
[INFO] Running org.apache.phoenix.end2end.StatsEnabledSplitSystemCatalogIT
[INFO] Running org.apache.phoenix.end2end.SysTableNamespaceMappedStatsCollectorIT
[INFO] Tests run: 12, Failures: 0, Errors: 0, Skipped: 0, Time elapsed: 91.868 s - in org.apache.phoenix.end2end.StatsEnabledSplitSystemCatalogIT
[INFO] Running org.apache.phoenix.end2end.SystemCatalogCreationOnConnectionIT
[WARNING] Tests run: 28, Failures: 0, Errors: 0, Skipped: 4, Time elapsed: 91.778 s - in org.apache.phoenix.end2end.SysTableNamespaceMappedStatsCollectorIT
[INFO] Running org.apache.phoenix.end2end.SystemCatalogIT
[INFO] Tests run: 12, Failures: 0, Errors: 0, Skipped: 0, Time elapsed: 204.948 s - in org.apache.phoenix.end2end.SplitIT
[INFO] Running org.apache.phoenix.end2end.SystemTablePermissionsIT
[INFO] Tests run: 1, Failures: 0, Errors: 0, Skipped: 0, Time elapsed: 43.08 s - in org.apache.phoenix.end2end.SystemCatalogIT
[INFO] Running org.apache.phoenix.end2end.TableDDLPermissionsIT
[INFO] Tests run: 2, Failures: 0, Errors: 0, Skipped: 0, Time elapsed: 98.354 s - in org.apache.phoenix.end2end.SystemTablePermissionsIT
[INFO] Tests run: 96, Failures: 0, Errors: 0, Skipped: 0, Time elapsed: 1,037.371 s - in org.apache.phoenix.end2end.IndexToolIT
[INFO] Running org.apache.phoenix.end2end.TableSnapshotReadsMapReduceIT
[INFO] Tests run: 3, Failures: 0, Errors: 0, Skipped: 0, Time elapsed: 14.062 s - in org.apache.phoenix.end2end.TableSnapshotReadsMapReduceIT
[INFO] Running org.apache.phoenix.end2end.UpdateCacheAcrossDifferentClientsIT
[INFO] Running org.apache.phoenix.end2end.UserDefinedFunctionsIT
[INFO] Tests run: 6, Failures: 0, Errors: 0, Skipped: 0, Time elapsed: 29.529 s - in org.apache.phoenix.end2end.UpdateCacheAcrossDifferentClientsIT
[INFO] Running org.apache.phoenix.end2end.index.ImmutableIndexIT
[INFO] Tests run: 16, Failures: 0, Errors: 0, Skipped: 0, Time elapsed: 73.55 s - in org.apache.phoenix.end2end.UserDefinedFunctionsIT
[INFO] Running org.apache.phoenix.end2end.index.LocalIndexIT
[ERROR] Tests run: 4, Failures: 0, Errors: 2, Skipped: 0, Time elapsed: 356.002 s <<< FAILURE! - in org.apache.phoenix.end2end.TableDDLPermissionsIT
[ERROR] testAutomaticGrantWithIndexAndView[isNamespaceMapped=false](org.apache.phoenix.end2end.TableDDLPermissionsIT) Time elapsed: 179.976 s <<< ERROR!
java.lang.reflect.UndeclaredThrowableException
at org.apache.phoenix.end2end.TableDDLPermissionsIT.testAutomaticGrantWithIndexAndView(TableDDLPermissionsIT.java:230)
Caused by: org.apache.phoenix.schema.TableNotFoundException: ERROR 1012 (42M03): Table undefined.
at org.apache.phoenix.end2end.TableDDLPermissionsIT.testAutomaticGrantWithIndexAndView(TableDDLPermissionsIT.java:230)
[ERROR] testAutomaticGrantWithIndexAndView[isNamespaceMapped=true](org.apache.phoenix.end2end.TableDDLPermissionsIT) Time elapsed: 143.162 s <<< ERROR!
java.lang.reflect.UndeclaredThrowableException
at org.apache.phoenix.end2end.TableDDLPermissionsIT.testAutomaticGrantWithIndexAndView(TableDDLPermissionsIT.java:230)
Caused by: org.apache.phoenix.schema.TableNotFoundException: ERROR 1012 (42M03): Table undefined.
at org.apache.phoenix.end2end.TableDDLPermissionsIT.testAutomaticGrantWithIndexAndView(TableDDLPermissionsIT.java:230)
[INFO] Running org.apache.phoenix.end2end.index.MutableIndexFailureIT
[INFO] Tests run: 14, Failures: 0, Errors: 0, Skipped: 0, Time elapsed: 584.074 s - in org.apache.phoenix.end2end.SystemCatalogCreationOnConnectionIT
[INFO] Running org.apache.phoenix.end2end.index.MutableIndexFailureWithNamespaceIT
[WARNING] Tests run: 40, Failures: 0, Errors: 0, Skipped: 16, Time elapsed: 315.795 s - in org.apache.phoenix.end2end.index.ImmutableIndexIT
[INFO] Running org.apache.phoenix.end2end.index.MutableIndexRebuilderIT
[INFO] Tests run: 1, Failures: 0, Errors: 0, Skipped: 0, Time elapsed: 40.364 s - in org.apache.phoenix.end2end.index.MutableIndexRebuilderIT
[INFO] Tests run: 13, Failures: 0, Errors: 0, Skipped: 0, Time elapsed: 181.587 s - in org.apache.phoenix.end2end.index.MutableIndexFailureIT
[INFO] Tests run: 7, Failures: 0, Errors: 0, Skipped: 0, Time elapsed: 119.863 s - in org.apache.phoenix.end2end.index.MutableIndexFailureWithNamespaceIT
[INFO] Running org.apache.phoenix.end2end.index.MutableIndexReplicationIT
[INFO] Running org.apache.phoenix.end2end.index.PartialIndexRebuilderIT
[INFO] Tests run: 1, Failures: 0, Errors: 0, Skipped: 0, Time elapsed: 24.56 s - in org.apache.phoenix.end2end.index.MutableIndexReplicationIT
[INFO] Tests run: 44, Failures: 0, Errors: 0, Skipped: 0, Time elapsed: 407.556 s - in org.apache.phoenix.end2end.index.LocalIndexIT
[INFO] Running org.apache.phoenix.end2end.index.PhoenixMRJobSubmitterIT
[INFO] Tests run: 1, Failures: 0, Errors: 0, Skipped: 0, Time elapsed: 5.611 s - in org.apache.phoenix.end2end.index.PhoenixMRJobSubmitterIT
[INFO] Running org.apache.phoenix.end2end.index.txn.TxWriteFailureIT
[INFO] Tests run: 8, Failures: 0, Errors: 0, Skipped: 0, Time elapsed: 31.596 s - in org.apache.phoenix.end2end.index.txn.TxWriteFailureIT
[INFO] Running org.apache.phoenix.hbase.index.FailForUnsupportedHBaseVersionsIT
[INFO] Running org.apache.phoenix.execute.PartialCommitIT
[INFO] Running org.apache.phoenix.execute.UpsertSelectOverlappingBatchesIT
[INFO] Tests run: 2, Failures: 0, Errors: 0, Skipped: 0, Time elapsed: 19.593 s - in org.apache.phoenix.hbase.index.FailForUnsupportedHBaseVersionsIT
[INFO] Tests run: 6, Failures: 0, Errors: 0, Skipped: 0, Time elapsed: 27.563 s - in org.apache.phoenix.execute.PartialCommitIT
[INFO] Running org.apache.phoenix.iterate.RoundRobinResultIteratorWithStatsIT
[INFO] Tests run: 1, Failures: 0, Errors: 0, Skipped: 0, Time elapsed: 4.149 s - in org.apache.phoenix.iterate.RoundRobinResultIteratorWithStatsIT
[INFO] Tests run: 3, Failures: 0, Errors: 0, Skipped: 0, Time elapsed: 61.021 s - in org.apache.phoenix.execute.UpsertSelectOverlappingBatchesIT
[INFO] Running org.apache.phoenix.iterate.ScannerLeaseRenewalIT
[INFO] Running org.apache.phoenix.monitoring.PhoenixLoggingMetricsIT
[INFO] Running org.apache.phoenix.monitoring.PhoenixMetricsIT
[INFO] Tests run: 4, Failures: 0, Errors: 0, Skipped: 0, Time elapsed: 15.546 s - in org.apache.phoenix.monitoring.PhoenixLoggingMetricsIT
[INFO] Tests run: 21, Failures: 0, Errors: 0, Skipped: 0, Time elapsed: 52.703 s - in org.apache.phoenix.monitoring.PhoenixMetricsIT
[INFO] Running org.apache.phoenix.rpc.PhoenixClientRpcIT
[INFO] Tests run: 2, Failures: 0, Errors: 0, Skipped: 0, Time elapsed: 4.346 s - in org.apache.phoenix.rpc.PhoenixClientRpcIT
[INFO] Running org.apache.phoenix.rpc.PhoenixServerRpcIT
[INFO] Tests run: 2, Failures: 0, Errors: 0, Skipped: 0, Time elapsed: 13.601 s - in org.apache.phoenix.rpc.PhoenixServerRpcIT
[INFO] Tests run: 2, Failures: 0, Errors: 0, Skipped: 0, Time elapsed: 162.238 s - in org.apache.phoenix.iterate.ScannerLeaseRenewalIT
[INFO] Tests run: 25, Failures: 0, Errors: 0, Skipped: 0, Time elapsed: 319.14 s - in org.apache.phoenix.end2end.index.PartialIndexRebuilderIT
[INFO]
[INFO] Results:
[INFO]
[ERROR] Errors:
[ERROR] TableDDLPermissionsIT.testAutomaticGrantWithIndexAndView:230->BasePermissionsIT.verifyAllowed:688->BasePermissionsIT.verifyAllowed:695 » UndeclaredThrowable
[ERROR] TableDDLPermissionsIT.testAutomaticGrantWithIndexAndView:230->BasePermissionsIT.verifyAllowed:688->BasePermissionsIT.verifyAllowed:695 » UndeclaredThrowable
[INFO]
[ERROR] Tests run: 718, Failures: 0, Errors: 2, Skipped: 44
[INFO]
[INFO]
[INFO] --- maven-failsafe-plugin:2.20:integration-test (SplitSystemCatalogTests) @ phoenix-core ---
[INFO]
[INFO] -------------------------------------------------------
[INFO] T E S T S
[INFO] -------------------------------------------------------
[INFO] Running org.apache.phoenix.end2end.AlterMultiTenantTableWithViewsIT
[INFO] Running org.apache.phoenix.end2end.AlterTableWithViewsIT
[INFO] Running org.apache.phoenix.end2end.DropTableWithViewsIT
[INFO] Tests run: 4, Failures: 0, Errors: 0, Skipped: 0, Time elapsed: 46.619 s - in org.apache.phoenix.end2end.DropTableWithViewsIT
[INFO] Tests run: 9, Failures: 0, Errors: 0, Skipped: 0, Time elapsed: 94.287 s - in org.apache.phoenix.end2end.AlterMultiTenantTableWithViewsIT
[INFO] Running org.apache.phoenix.end2end.TenantSpecificViewIndexIT
[INFO] Running org.apache.phoenix.end2end.TenantSpecificViewIndexSaltedIT
[INFO] Tests run: 10, Failures: 0, Errors: 0, Skipped: 0, Time elapsed: 90.419 s - in org.apache.phoenix.end2end.TenantSpecificViewIndexIT
[INFO] Tests run: 4, Failures: 0, Errors: 0, Skipped: 0, Time elapsed: 40.554 s - in org.apache.phoenix.end2end.TenantSpecificViewIndexSaltedIT
[INFO] Running org.apache.phoenix.end2end.index.ViewIndexIT
[WARNING] Tests run: 14, Failures: 0, Errors: 0, Skipped: 2, Time elapsed: 100.308 s - in org.apache.phoenix.end2end.index.ViewIndexIT
[INFO] Tests run: 104, Failures: 0, Errors: 0, Skipped: 0, Time elapsed: 804.082 s - in org.apache.phoenix.end2end.AlterTableWithViewsIT
[INFO] Running org.apache.phoenix.end2end.ViewIT
[ERROR] Tests run: 1, Failures: 0, Errors: 1, Skipped: 0, Time elapsed: 0.006 s <<< FAILURE! - in org.apache.phoenix.end2end.ViewIT
[ERROR] org.apache.phoenix.end2end.ViewIT Time elapsed: 0.006 s <<< ERROR!
org.apache.hadoop.hbase.exceptions.TimeoutIOException: java.util.concurrent.TimeoutException: The procedure 16 is still running
at org.apache.phoenix.end2end.ViewIT.doSetup(ViewIT.java:150)
Caused by: java.util.concurrent.TimeoutException: The procedure 16 is still running
at org.apache.phoenix.end2end.ViewIT.doSetup(ViewIT.java:150)
[INFO]
[INFO] Results:
[INFO]
[ERROR] Errors:
[ERROR] ViewIT.doSetup:150->SplitSystemCatalogIT.splitSystemCatalog:77->BaseTest.splitSystemCatalog:1893->BaseTest.splitTable:1822->BaseTest.splitRegion:1792 » TimeoutIO
[INFO]
[ERROR] Tests run: 146, Failures: 0, Errors: 1, Skipped: 2
[INFO]
[INFO]
[INFO] --- maven-failsafe-plugin:2.20:verify (ParallelStatsEnabledTest) @ phoenix-core ---
[INFO] ------------------------------------------------------------------------
[INFO] Reactor Summary:
[INFO]
[INFO] Apache Phoenix 4.14.0-HBase-1.3 .................... SUCCESS [ 5.558 s]
[INFO] Phoenix Core ....................................... FAILURE [ 04:03 h]
[INFO] Phoenix - Flume .................................... SKIPPED
[INFO] Phoenix - Kafka .................................... SKIPPED
[INFO] Phoenix - Pig ...................................... SKIPPED
[INFO] Phoenix Query Server Client ........................ SKIPPED
[INFO] Phoenix Query Server ............................... SKIPPED
[INFO] Phoenix - Pherf .................................... SKIPPED
[INFO] Phoenix - Spark .................................... SKIPPED
[INFO] Phoenix - Hive ..................................... SKIPPED
[INFO] Phoenix Client ..................................... SKIPPED
[INFO] Phoenix Server ..................................... SKIPPED
[INFO] Phoenix Load Balancer .............................. SKIPPED
[INFO] Phoenix Assembly ................................... SKIPPED
[INFO] Phoenix - Tracing Web Application 4.14.0-HBase-1.3 . SKIPPED
[INFO] ------------------------------------------------------------------------
[INFO] BUILD FAILURE
[INFO] ------------------------------------------------------------------------
[INFO] Total time: 04:03 h
[INFO] Finished at: 2018-11-01T02:09:25Z
[INFO] ------------------------------------------------------------------------
[ERROR] Failed to execute goal org.apache.maven.plugins:maven-failsafe-plugin:2.20:verify (ParallelStatsEnabledTest) on project phoenix-core: There are test failures.
[ERROR]
[ERROR] Please refer to <https://builds.apache.org/job/Phoenix-4.x-HBase-1.3/ws/phoenix-core/target/failsafe-reports> for the individual test results.
[ERROR] Please refer to dump files (if any exist) [date]-jvmRun[N].dump, [date].dumpstream and [date]-jvmRun[N].dumpstream.
[ERROR] org.apache.maven.surefire.booter.SurefireBooterForkException: ExecutionException The forked VM terminated without properly saying goodbye. VM crash or System.exit called?
[ERROR] Command was /bin/sh -c cd <https://builds.apache.org/job/Phoenix-4.x-HBase-1.3/ws/phoenix-core> && /usr/local/asfpackages/java/jdk1.8.0_172/jre/bin/java -enableassertions -Xmx2000m -XX:MaxPermSize=256m -Djava.security.egd=file:/dev/./urandom '-Djava.library.path=${hadoop.library.path}:/usr/java/packages/lib/amd64:/usr/lib64:/lib64:/lib:/usr/lib' -XX:+HeapDumpOnOutOfMemoryError -XX:HeapDumpPath=./target/ -jar <https://builds.apache.org/job/Phoenix-4.x-HBase-1.3/249/artifact/phoenix-core/target/surefire/surefirebooter1047649319373372892.jar> <https://builds.apache.org/job/Phoenix-4.x-HBase-1.3/ws/phoenix-core/target/surefire> 2018-10-31T22-08-56_829-jvmRun2 surefire8258104000506885442tmp surefire_1968152920669008706070tmp
[ERROR] Process Exit Code: 0
[ERROR] at org.apache.maven.plugin.surefire.booterclient.ForkStarter.awaitResultsDone(ForkStarter.java:494)
[ERROR] at org.apache.maven.plugin.surefire.booterclient.ForkStarter.runSuitesForkPerTestSet(ForkStarter.java:441)
[ERROR] at org.apache.maven.plugin.surefire.booterclient.ForkStarter.run(ForkStarter.java:292)
[ERROR] at org.apache.maven.plugin.surefire.booterclient.ForkStarter.run(ForkStarter.java:243)
[ERROR] at org.apache.maven.plugin.surefire.AbstractSurefireMojo.executeProvider(AbstractSurefireMojo.java:1077)
[ERROR] at org.apache.maven.plugin.surefire.AbstractSurefireMojo.executeAfterPreconditionsChecked(AbstractSurefireMojo.java:907)
[ERROR] at org.apache.maven.plugin.surefire.AbstractSurefireMojo.execute(AbstractSurefireMojo.java:785)
[ERROR] at org.apache.maven.plugin.DefaultBuildPluginManager.executeMojo(DefaultBuildPluginManager.java:137)
[ERROR] at org.apache.maven.lifecycle.internal.MojoExecutor.execute(MojoExecutor.java:208)
[ERROR] at org.apache.maven.lifecycle.internal.MojoExecutor.execute(MojoExecutor.java:154)
[ERROR] at org.apache.maven.lifecycle.internal.MojoExecutor.execute(MojoExecutor.java:146)
[ERROR] at org.apache.maven.lifecycle.internal.LifecycleModuleBuilder.buildProject(LifecycleModuleBuilder.java:117)
[ERROR] at org.apache.maven.lifecycle.internal.LifecycleModuleBuilder.buildProject(LifecycleModuleBuilder.java:81)
[ERROR] at org.apache.maven.lifecycle.internal.builder.singlethreaded.SingleThreadedBuilder.build(SingleThreadedBuilder.java:56)
[ERROR] at org.apache.maven.lifecycle.internal.LifecycleStarter.execute(LifecycleStarter.java:128)
[ERROR] at org.apache.maven.DefaultMaven.doExecute(DefaultMaven.java:305)
[ERROR] at org.apache.maven.DefaultMaven.doExecute(DefaultMaven.java:192)
[ERROR] at org.apache.maven.DefaultMaven.execute(DefaultMaven.java:105)
[ERROR] at org.apache.maven.cli.MavenCli.execute(MavenCli.java:954)
[ERROR] at org.apache.maven.cli.MavenCli.doMain(MavenCli.java:288)
[ERROR] at org.apache.maven.cli.MavenCli.main(MavenCli.java:192)
[ERROR] at sun.reflect.NativeMethodAccessorImpl.invoke0(Native Method)
[ERROR] at sun.reflect.NativeMethodAccessorImpl.invoke(NativeMethodAccessorImpl.java:62)
[ERROR] at sun.reflect.DelegatingMethodAccessorImpl.invoke(DelegatingMethodAccessorImpl.java:43)
[ERROR] at java.lang.reflect.Method.invoke(Method.java:498)
[ERROR] at org.codehaus.plexus.classworlds.launcher.Launcher.launchEnhanced(Launcher.java:289)
[ERROR] at org.codehaus.plexus.classworlds.launcher.Launcher.launch(Launcher.java:229)
[ERROR] at org.codehaus.plexus.classworlds.launcher.Launcher.mainWithExitCode(Launcher.java:415)
[ERROR] at org.codehaus.plexus.classworlds.launcher.Launcher.main(Launcher.java:356)
[ERROR] Caused by: org.apache.maven.surefire.booter.SurefireBooterForkException: The forked VM terminated without properly saying goodbye. VM crash or System.exit called?
[ERROR] Command was /bin/sh -c cd <https://builds.apache.org/job/Phoenix-4.x-HBase-1.3/ws/phoenix-core> && /usr/local/asfpackages/java/jdk1.8.0_172/jre/bin/java -enableassertions -Xmx2000m -XX:MaxPermSize=256m -Djava.security.egd=file:/dev/./urandom '-Djava.library.path=${hadoop.library.path}:/usr/java/packages/lib/amd64:/usr/lib64:/lib64:/lib:/usr/lib' -XX:+HeapDumpOnOutOfMemoryError -XX:HeapDumpPath=./target/ -jar <https://builds.apache.org/job/Phoenix-4.x-HBase-1.3/249/artifact/phoenix-core/target/surefire/surefirebooter1047649319373372892.jar> <https://builds.apache.org/job/Phoenix-4.x-HBase-1.3/ws/phoenix-core/target/surefire> 2018-10-31T22-08-56_829-jvmRun2 surefire8258104000506885442tmp surefire_1968152920669008706070tmp
[ERROR] Process Exit Code: 0
[ERROR] at org.apache.maven.plugin.surefire.booterclient.ForkStarter.fork(ForkStarter.java:679)
[ERROR] at org.apache.maven.plugin.surefire.booterclient.ForkStarter.fork(ForkStarter.java:533)
[ERROR] at org.apache.maven.plugin.surefire.booterclient.ForkStarter.access$600(ForkStarter.java:117)
[ERROR] at org.apache.maven.plugin.surefire.booterclient.ForkStarter$2.call(ForkStarter.java:429)
[ERROR] at org.apache.maven.plugin.surefire.booterclient.ForkStarter$2.call(ForkStarter.java:406)
[ERROR] at java.util.concurrent.FutureTask.run(FutureTask.java:266)
[ERROR] at java.util.concurrent.ThreadPoolExecutor.runWorker(ThreadPoolExecutor.java:1149)
[ERROR] at java.util.concurrent.ThreadPoolExecutor$Worker.run(ThreadPoolExecutor.java:624)
[ERROR] at java.lang.Thread.run(Thread.java:748)
[ERROR]
[ERROR] -> [Help 1]
[ERROR]
[ERROR] To see the full stack trace of the errors, re-run Maven with the -e switch.
[ERROR] Re-run Maven using the -X switch to enable full debug logging.
[ERROR]
[ERROR] For more information about the errors and possible solutions, please read the following articles:
[ERROR] [Help 1] http://cwiki.apache.org/confluence/display/MAVEN/MojoFailureException
[ERROR]
[ERROR] After correcting the problems, you can resume the build with the command
[ERROR] mvn <goals> -rf :phoenix-core
Build step 'Invoke top-level Maven targets' marked build as failure
Archiving artifacts
Recording test results