You are viewing a plain text version of this content. The canonical link for it is here.
Posted to commits@sling.apache.org by Apache Jenkins Server <je...@builds.apache.org> on 2016/10/31 09:00:36 UTC
Build failed in Jenkins:
sling-installer-factories-configuration-1.7 #2
See <https://builds.apache.org/job/sling-installer-factories-configuration-1.7/2/changes>
Changes:
[cziegeler] SLING-5779 : Packaged OSGi config intermittently do not get installed before bundle start
------------------------------------------
Started by an SCM change
[EnvInject] - Loading node environment variables.
Building remotely on ubuntu-6 (Ubuntu yahoo-not-h2 ubuntu docker) in workspace <https://builds.apache.org/job/sling-installer-factories-configuration-1.7/ws/>
Checking out a fresh workspace because there's no workspace at <https://builds.apache.org/job/sling-installer-factories-configuration-1.7/ws/>
Cleaning local Directory .
Checking out https://svn.apache.org/repos/asf/sling/trunk/installer/factories/configuration at revision '2016-10-31T08:55:02.102 +0000'
A src
A src/main
A src/main/java
A src/main/java/org
A src/main/java/org/apache
A src/main/java/org/apache/sling
A src/main/java/org/apache/sling/installer
A src/main/java/org/apache/sling/installer/factories
A src/main/java/org/apache/sling/installer/factories/configuration
A src/main/java/org/apache/sling/installer/factories/configuration/impl
AU src/main/java/org/apache/sling/installer/factories/configuration/impl/ConfigInstallTask.java
AU src/main/java/org/apache/sling/installer/factories/configuration/impl/ConfigUtil.java
AU src/main/java/org/apache/sling/installer/factories/configuration/impl/Coordinator.java
AU src/main/java/org/apache/sling/installer/factories/configuration/impl/ConfigRemoveTask.java
AU src/main/java/org/apache/sling/installer/factories/configuration/impl/ConfigTaskCreator.java
AU src/main/java/org/apache/sling/installer/factories/configuration/impl/ServicesListener.java
AU src/main/java/org/apache/sling/installer/factories/configuration/impl/AbstractConfigTask.java
AU src/main/java/org/apache/sling/installer/factories/configuration/impl/Activator.java
AU src/main/java/org/apache/sling/installer/factories/configuration/ConfigurationConstants.java
AU src/main/java/org/apache/sling/installer/factories/configuration/package-info.java
A src/test
A src/test/java
A src/test/java/org
A src/test/java/org/apache
A src/test/java/org/apache/sling
A src/test/java/org/apache/sling/installer
A src/test/java/org/apache/sling/installer/factories
A src/test/java/org/apache/sling/installer/factories/configuration
A src/test/java/org/apache/sling/installer/factories/configuration/impl
AU src/test/java/org/apache/sling/installer/factories/configuration/impl/ConfigUtilTest.java
AU pom.xml
U .
At revision 1767226
Parsing POMs
Modules changed, recalculating dependency graph
Established TCP socket on 37581
maven32-agent.jar already up to date
maven32-interceptor.jar already up to date
maven3-interceptor-commons.jar already up to date
[sling-installer-factories-configuration-1.7] $ /home/jenkins/tools/java/latest1.7/bin/java -Xmx2g -Xms256m -XX:MaxPermSize=512m -cp /home/jenkins/jenkins-slave/maven32-agent.jar:/home/jenkins/tools/maven/apache-maven-3.3.9/boot/plexus-classworlds-2.5.2.jar:/home/jenkins/tools/maven/apache-maven-3.3.9/conf/logging jenkins.maven3.agent.Maven32Main /home/jenkins/tools/maven/apache-maven-3.3.9 /home/jenkins/jenkins-slave/slave.jar /home/jenkins/jenkins-slave/maven32-interceptor.jar /home/jenkins/jenkins-slave/maven3-interceptor-commons.jar 37581
<===[JENKINS REMOTING CAPACITY]===> channel started
Executing Maven: -B -f <https://builds.apache.org/job/sling-installer-factories-configuration-1.7/ws/pom.xml> -Dmaven.repo.local=/home/jenkins/jenkins-slave/maven-repositories/1 -U clean deploy
[INFO] Scanning for projects...
[INFO]
[INFO] ------------------------------------------------------------------------
[INFO] Building Apache Sling Installer Configuration Admin Support 1.1.3-SNAPSHOT
[INFO] ------------------------------------------------------------------------
[INFO] Downloading: http://repository.apache.org/snapshots/org/apache/sling/org.apache.sling.installer.core/3.7.1-SNAPSHOT/maven-metadata.xml
[INFO] Downloaded: http://repository.apache.org/snapshots/org/apache/sling/org.apache.sling.installer.core/3.7.1-SNAPSHOT/maven-metadata.xml (1011 B at 1.6 KB/sec)
[INFO]
[INFO] --- maven-clean-plugin:3.0.0:clean (default-clean) @ org.apache.sling.installer.factory.configuration ---
[INFO]
[INFO] --- maven-enforcer-plugin:1.4.1:enforce (enforce-java) @ org.apache.sling.installer.factory.configuration ---
[INFO]
[INFO] --- maven-antrun-plugin:1.8:run (set-bundle-required-execution-environment) @ org.apache.sling.installer.factory.configuration ---
[INFO] Executing tasks
main:
Setting Bundle-RequiredExecutionEnvironment=JavaSE-1.7 from sling.java.version=7
[INFO] Executed tasks
[INFO]
[INFO] --- maven-remote-resources-plugin:1.5:process (process-resource-bundles) @ org.apache.sling.installer.factory.configuration ---
[INFO]
[INFO] --- maven-remote-resources-plugin:1.5:process (default) @ org.apache.sling.installer.factory.configuration ---
[INFO]
[INFO] --- maven-resources-plugin:2.7:resources (default-resources) @ org.apache.sling.installer.factory.configuration ---
[INFO] Using 'UTF-8' encoding to copy filtered resources.
[INFO] skip non existing resourceDirectory <https://builds.apache.org/job/sling-installer-factories-configuration-1.7/ws/src/main/resources>
[INFO] Copying 3 resources
[INFO] Copying 3 resources
[INFO]
[INFO] --- maven-compiler-plugin:3.5.1:compile (default-compile) @ org.apache.sling.installer.factory.configuration ---
[INFO] Changes detected - recompiling the module!
[INFO] Compiling 10 source files to <https://builds.apache.org/job/sling-installer-factories-configuration-1.7/ws/target/classes>
[INFO] -------------------------------------------------------------
[ERROR] COMPILATION ERROR :
[INFO] -------------------------------------------------------------
[ERROR] <https://builds.apache.org/job/sling-installer-factories-configuration-1.7/ws/src/main/java/org/apache/sling/installer/factories/configuration/impl/ServicesListener.java>:[78,45] cannot find symbol
symbol: variable NAME
location: interface org.apache.sling.installer.api.tasks.InstallTaskFactory
[ERROR] <https://builds.apache.org/job/sling-installer-factories-configuration-1.7/ws/src/main/java/org/apache/sling/installer/factories/configuration/impl/ServicesListener.java>:[79,46] cannot find symbol
symbol: variable NAME
location: interface org.apache.sling.installer.api.tasks.ResourceTransformer
[INFO] 2 errors
[INFO] -------------------------------------------------------------
[JENKINS] Archiving disabled
[JENKINS] Archiving disabled[INFO] ------------------------------------------------------------------------
[INFO] BUILD FAILURE
[INFO] ------------------------------------------------------------------------
[INFO] Total time: 31.208 s
[INFO] Finished at: 2016-10-31T08:57:50+00:00
[INFO] Final Memory: 23M/322M
[INFO] ------------------------------------------------------------------------
Waiting for Jenkins to finish collecting data
[ERROR] Failed to execute goal org.apache.maven.plugins:maven-compiler-plugin:3.5.1:compile (default-compile) on project org.apache.sling.installer.factory.configuration: Compilation failure: Compilation failure:
[ERROR] <https://builds.apache.org/job/sling-installer-factories-configuration-1.7/ws/src/main/java/org/apache/sling/installer/factories/configuration/impl/ServicesListener.java>:[78,45] cannot find symbol
[ERROR] symbol: variable NAME
[ERROR] location: interface org.apache.sling.installer.api.tasks.InstallTaskFactory
[ERROR] <https://builds.apache.org/job/sling-installer-factories-configuration-1.7/ws/src/main/java/org/apache/sling/installer/factories/configuration/impl/ServicesListener.java>:[79,46] cannot find symbol
[ERROR] symbol: variable NAME
[ERROR] location: interface org.apache.sling.installer.api.tasks.ResourceTransformer
[ERROR] -> [Help 1]
[ERROR]
[ERROR] To see the full stack trace of the errors, re-run Maven with the -e switch.
[ERROR] Re-run Maven using the -X switch to enable full debug logging.
[ERROR]
[ERROR] For more information about the errors and possible solutions, please read the following articles:
[ERROR] [Help 1] http://cwiki.apache.org/confluence/display/MAVEN/MojoFailureException
channel stopped
Recording test results
Jenkins build is back to normal :
sling-installer-factories-configuration-1.7 #3
Posted by Apache Jenkins Server <je...@builds.apache.org>.
See <https://builds.apache.org/job/sling-installer-factories-configuration-1.7/3/>