You are viewing a plain text version of this content. The canonical link for it is here.
Posted to builds@solr.apache.org by Policeman Jenkins Server via builds <bu...@solr.apache.org> on 2026/04/10 10:32:06 UTC
[JENKINS] Solr-main-Linux (64bit/hotspot/jdk-22.0.2) - Build # 32729 - Still Unstable!
Build: https://jenkins.thetaphi.de/job/Solr-main-Linux/32729/
Java: 64bit/hotspot/jdk-22.0.2 -XX:-UseCompressedOops -XX:+UseG1GC
2 tests failed.
FAILED: org.apache.solr.update.SolrIndexFingerprintTest.classMethod
Error Message:
java.lang.AssertionError: ObjectTracker found 1 object(s) that were not released!!! [MockDirectoryWrapper]
org.apache.lucene.tests.store.MockDirectoryWrapper:org.apache.solr.common.util.ObjectReleaseTracker$ObjectTrackerException: org.apache.lucene.tests.store.MockDirectoryWrapper@1882763278
at org.apache.solr.common.util.ObjectReleaseTracker.track(ObjectReleaseTracker.java:57)
at org.apache.solr.core.CachingDirectoryFactory.get(CachingDirectoryFactory.java:405)
at org.apache.solr.update.SolrIndexWriter.create(SolrIndexWriter.java:115)
at org.apache.solr.core.SolrCore.initIndex(SolrCore.java:913)
at org.apache.solr.core.SolrCore.<init>(SolrCore.java:1135)
at org.apache.solr.core.SolrCore.<init>(SolrCore.java:1063)
at org.apache.solr.core.CoreContainer.createFromDescriptor(CoreContainer.java:1676)
at org.apache.solr.core.CoreContainer.lambda$loadInternal$6(CoreContainer.java:995)
at org.apache.solr.util.stats.OtelInstrumentedExecutorService$InstrumentedRunnable.run(OtelInstrumentedExecutorService.java:256)
at org.apache.solr.common.util.ExecutorUtil$MDCAwareThreadPoolExecutor.lambda$execute$0(ExecutorUtil.java:381)
at java.base/java.util.concurrent.ThreadPoolExecutor.runWorker(ThreadPoolExecutor.java:1144)
at java.base/java.util.concurrent.ThreadPoolExecutor$Worker.run(ThreadPoolExecutor.java:642)
at java.base/java.lang.Thread.run(Thread.java:1570)
Caused by: java.lang.Exception: Submitter stack trace
at org.apache.solr.common.util.ExecutorUtil$MDCAwareThreadPoolExecutor.execute(ExecutorUtil.java:348)
at org.apache.solr.util.stats.OtelInstrumentedExecutorService.execute(OtelInstrumentedExecutorService.java:156)
at org.apache.solr.core.CoreContainer.loadInternal(CoreContainer.java:984)
at org.apache.solr.core.CoreContainer.load(CoreContainer.java:753)
at org.apache.solr.util.TestHarness.<init>(TestHarness.java:171)
at org.apache.solr.util.TestHarness.<init>(TestHarness.java:139)
at org.apache.solr.util.TestHarness.<init>(TestHarness.java:147)
at org.apache.solr.util.TestHarness.<init>(TestHarness.java:91)
at org.apache.solr.SolrTestCaseJ4.createCore(SolrTestCaseJ4.java:706)
at org.apache.solr.SolrTestCaseJ4.initCore(SolrTestCaseJ4.java:696)
at org.apache.solr.SolrTestCaseJ4.initCore(SolrTestCaseJ4.java:559)
at org.apache.solr.SolrTestCaseJ4.initCore(SolrTestCaseJ4.java:546)
at org.apache.solr.update.SolrIndexFingerprintTest.beforeTests(SolrIndexFingerprintTest.java:32)
at java.base/jdk.internal.reflect.DirectMethodHandleAccessor.invoke(DirectMethodHandleAccessor.java:103)
at java.base/java.lang.reflect.Method.invoke(Method.java:580)
at com.carrotsearch.randomizedtesting.RandomizedRunner.invoke(RandomizedRunner.java:1763)
at com.carrotsearch.randomizedtesting.RandomizedRunner$6.evaluate(RandomizedRunner.java:886)
at com.carrotsearch.randomizedtesting.RandomizedRunner$7.evaluate(RandomizedRunner.java:902)
at com.carrotsearch.randomizedtesting.rules.StatementAdapter.evaluate(StatementAdapter.java:36)
at com.carrotsearch.randomizedtesting.rules.StatementAdapter.evaluate(StatementAdapter.java:36)
at org.apache.lucene.tests.util.AbstractBeforeAfterRule$1.evaluate(AbstractBeforeAfterRule.java:43)
at com.carrotsearch.randomizedtesting.rules.SystemPropertiesRestoreRule$1.evaluate(SystemPropertiesRestoreRule.java:80)
at org.junit.rules.RunRules.evaluate(RunRules.java:20)
at org.apache.lucene.tests.util.AbstractBeforeAfterRule$1.evaluate(AbstractBeforeAfterRule.java:43)
at com.carrotsearch.randomizedtesting.rules.StatementAdapter.evaluate(StatementAdapter.java:36)
at org.apache.lucene.tests.util.TestRuleStoreClassName$1.evaluate(TestRuleStoreClassName.java:38)
at com.carrotsearch.randomizedtesting.rules.NoShadowingOrOverridesOnMethodsRule$1.evaluate(NoShadowingOrOverridesOnMethodsRule.java:40)
at com.carrotsearch.randomizedtesting.rules.NoShadowingOrOverridesOnMethodsRule$1.evaluate(NoShadowingOrOverridesOnMethodsRule.java:40)
at com.carrotsearch.randomizedtesting.rules.StatementAdapter.evaluate(StatementAdapter.java:36)
at com.carrotsearch.randomizedtesting.rules.StatementAdapter.evaluate(StatementAdapter.java:36)
at org.apache.lucene.tests.util.TestRuleAssertionsRequired$1.evaluate(TestRuleAssertionsRequired.java:53)
at org.apache.lucene.tests.util.AbstractBeforeAfterRule$1.evaluate(AbstractBeforeAfterRule.java:43)
at org.apache.lucene.tests.util.TestRuleMarkFailure$1.evaluate(TestRuleMarkFailure.java:44)
at org.apache.lucene.tests.util.TestRuleIgnoreAfterMaxFailures$1.evaluate(TestRuleIgnoreAfterMaxFailures.java:60)
at org.apache.lucene.tests.util.TestRuleIgnoreTestSuites$1.evaluate(TestRuleIgnoreTestSuites.java:47)
at org.junit.rules.RunRules.evaluate(RunRules.java:20)
at com.carrotsearch.randomizedtesting.rules.StatementAdapter.evaluate(StatementAdapter.java:36)
at com.carrotsearch.randomizedtesting.ThreadLeakControl$StatementRunner.run(ThreadLeakControl.java:390)
at com.carrotsearch.randomizedtesting.ThreadLeakControl.lambda$forkTimeoutingTask$0(ThreadLeakControl.java:850)
... 1 more
expected null, but was:<ObjectTracker found 1 object(s) that were not released!!! [MockDirectoryWrapper]
org.apache.lucene.tests.store.MockDirectoryWrapper:org.apache.solr.common.util.ObjectReleaseTracker$ObjectTrackerException: org.apache.lucene.tests.store.MockDirectoryWrapper@1882763278
at org.apache.solr.common.util.ObjectReleaseTracker.track(ObjectReleaseTracker.java:57)
at org.apache.solr.core.CachingDirectoryFactory.get(CachingDirectoryFactory.java:405)
at org.apache.solr.update.SolrIndexWriter.create(SolrIndexWriter.java:115)
at org.apache.solr.core.SolrCore.initIndex(SolrCore.java:913)
at org.apache.solr.core.SolrCore.<init>(SolrCore.java:1135)
at org.apache.solr.core.SolrCore.<init>(SolrCore.java:1063)
at org.apache.solr.core.CoreContainer.createFromDescriptor(CoreContainer.java:1676)
at org.apache.solr.core.CoreContainer.lambda$loadInternal$6(CoreContainer.java:995)
at org.apache.solr.util.stats.OtelInstrumentedExecutorService$InstrumentedRunnable.run(OtelInstrumentedExecutorService.java:256)
at org.apache.solr.common.util.ExecutorUtil$MDCAwareThreadPoolExecutor.lambda$execute$0(ExecutorUtil.java:381)
at java.base/java.util.concurrent.ThreadPoolExecutor.runWorker(ThreadPoolExecutor.java:1144)
at java.base/java.util.concurrent.ThreadPoolExecutor$Worker.run(ThreadPoolExecutor.java:642)
at java.base/java.lang.Thread.run(Thread.java:1570)
Caused by: java.lang.Exception: Submitter stack trace
at org.apache.solr.common.util.ExecutorUtil$MDCAwareThreadPoolExecutor.execute(ExecutorUtil.java:348)
at org.apache.solr.util.stats.OtelInstrumentedExecutorService.execute(OtelInstrumentedExecutorService.java:156)
at org.apache.solr.core.CoreContainer.loadInternal(CoreContainer.java:984)
at org.apache.solr.core.CoreContainer.load(CoreContainer.java:753)
at org.apache.solr.util.TestHarness.<init>(TestHarness.java:171)
at org.apache.solr.util.TestHarness.<init>(TestHarness.java:139)
at org.apache.solr.util.TestHarness.<init>(TestHarness.java:147)
at org.apache.solr.util.TestHarness.<init>(TestHarness.java:91)
at org.apache.solr.SolrTestCaseJ4.createCore(SolrTestCaseJ4.java:706)
at org.apache.solr.SolrTestCaseJ4.initCore(SolrTestCaseJ4.java:696)
at org.apache.solr.SolrTestCaseJ4.initCore(SolrTestCaseJ4.java:559)
at org.apache.solr.SolrTestCaseJ4.initCore(SolrTestCaseJ4.java:546)
at org.apache.solr.update.SolrIndexFingerprintTest.beforeTests(SolrIndexFingerprintTest.java:32)
at java.base/jdk.internal.reflect.DirectMethodHandleAccessor.invoke(DirectMethodHandleAccessor.java:103)
at java.base/java.lang.reflect.Method.invoke(Method.java:580)
at com.carrotsearch.randomizedtesting.RandomizedRunner.invoke(RandomizedRunner.java:1763)
at com.carrotsearch.randomizedtesting.RandomizedRunner$6.evaluate(RandomizedRunner.java:886)
at com.carrotsearch.randomizedtesting.RandomizedRunner$7.evaluate(RandomizedRunner.java:902)
at com.carrotsearch.randomizedtesting.rules.StatementAdapter.evaluate(StatementAdapter.java:36)
at com.carrotsearch.randomizedtesting.rules.StatementAdapter.evaluate(StatementAdapter.java:36)
at org.apache.lucene.tests.util.AbstractBeforeAfterRule$1.evaluate(AbstractBeforeAfterRule.java:43)
at com.carrotsearch.randomizedtesting.rules.SystemPropertiesRestoreRule$1.evaluate(SystemPropertiesRestoreRule.java:80)
at org.junit.rules.RunRules.evaluate(RunRules.java:20)
at org.apache.lucene.tests.util.AbstractBeforeAfterRule$1.evaluate(AbstractBeforeAfterRule.java:43)
at com.carrotsearch.randomizedtesting.rules.StatementAdapter.evaluate(StatementAdapter.java:36)
at org.apache.lucene.tests.util.TestRuleStoreClassName$1.evaluate(TestRuleStoreClassName.java:38)
at com.carrotsearch.randomizedtesting.rules.NoShadowingOrOverridesOnMethodsRule$1.evaluate(NoShadowingOrOverridesOnMethodsRule.java:40)
at com.carrotsearch.randomizedtesting.rules.NoShadowingOrOverridesOnMethodsRule$1.evaluate(NoShadowingOrOverridesOnMethodsRule.java:40)
at com.carrotsearch.randomizedtesting.rules.StatementAdapter.evaluate(StatementAdapter.java:36)
at com.carrotsearch.randomizedtesting.rules.StatementAdapter.evaluate(StatementAdapter.java:36)
at org.apache.lucene.tests.util.TestRuleAssertionsRequired$1.evaluate(TestRuleAssertionsRequired.java:53)
at org.apache.lucene.tests.util.AbstractBeforeAfterRule$1.evaluate(AbstractBeforeAfterRule.java:43)
at org.apache.lucene.tests.util.TestRuleMarkFailure$1.evaluate(TestRuleMarkFailure.java:44)
at org.apache.lucene.tests.util.TestRuleIgnoreAfterMaxFailures$1.evaluate(TestRuleIgnoreAfterMaxFailures.java:60)
at org.apache.lucene.tests.util.TestRuleIgnoreTestSuites$1.evaluate(TestRuleIgnoreTestSuites.java:47)
at org.junit.rules.RunRules.evaluate(RunRules.java:20)
at com.carrotsearch.randomizedtesting.rules.StatementAdapter.evaluate(StatementAdapter.java:36)
at com.carrotsearch.randomizedtesting.ThreadLeakControl$StatementRunner.run(ThreadLeakControl.java:390)
at com.carrotsearch.randomizedtesting.ThreadLeakControl.lambda$forkTimeoutingTask$0(ThreadLeakControl.java:850)
... 1 more
>
Stack Trace:
java.lang.AssertionError: ObjectTracker found 1 object(s) that were not released!!! [MockDirectoryWrapper]
org.apache.lucene.tests.store.MockDirectoryWrapper:org.apache.solr.common.util.ObjectReleaseTracker$ObjectTrackerException: org.apache.lucene.tests.store.MockDirectoryWrapper@1882763278
at org.apache.solr.common.util.ObjectReleaseTracker.track(ObjectReleaseTracker.java:57)
at org.apache.solr.core.CachingDirectoryFactory.get(CachingDirectoryFactory.java:405)
at org.apache.solr.update.SolrIndexWriter.create(SolrIndexWriter.java:115)
at org.apache.solr.core.SolrCore.initIndex(SolrCore.java:913)
at org.apache.solr.core.SolrCore.<init>(SolrCore.java:1135)
at org.apache.solr.core.SolrCore.<init>(SolrCore.java:1063)
at org.apache.solr.core.CoreContainer.createFromDescriptor(CoreContainer.java:1676)
at org.apache.solr.core.CoreContainer.lambda$loadInternal$6(CoreContainer.java:995)
at org.apache.solr.util.stats.OtelInstrumentedExecutorService$InstrumentedRunnable.run(OtelInstrumentedExecutorService.java:256)
at org.apache.solr.common.util.ExecutorUtil$MDCAwareThreadPoolExecutor.lambda$execute$0(ExecutorUtil.java:381)
at java.base/java.util.concurrent.ThreadPoolExecutor.runWorker(ThreadPoolExecutor.java:1144)
at java.base/java.util.concurrent.ThreadPoolExecutor$Worker.run(ThreadPoolExecutor.java:642)
at java.base/java.lang.Thread.run(Thread.java:1570)
Caused by: java.lang.Exception: Submitter stack trace
at org.apache.solr.common.util.ExecutorUtil$MDCAwareThreadPoolExecutor.execute(ExecutorUtil.java:348)
at org.apache.solr.util.stats.OtelInstrumentedExecutorService.execute(OtelInstrumentedExecutorService.java:156)
at org.apache.solr.core.CoreContainer.loadInternal(CoreContainer.java:984)
at org.apache.solr.core.CoreContainer.load(CoreContainer.java:753)
at org.apache.solr.util.TestHarness.<init>(TestHarness.java:171)
at org.apache.solr.util.TestHarness.<init>(TestHarness.java:139)
at org.apache.solr.util.TestHarness.<init>(TestHarness.java:147)
at org.apache.solr.util.TestHarness.<init>(TestHarness.java:91)
at org.apache.solr.SolrTestCaseJ4.createCore(SolrTestCaseJ4.java:706)
at org.apache.solr.SolrTestCaseJ4.initCore(SolrTestCaseJ4.java:696)
at org.apache.solr.SolrTestCaseJ4.initCore(SolrTestCaseJ4.java:559)
at org.apache.solr.SolrTestCaseJ4.initCore(SolrTestCaseJ4.java:546)
at org.apache.solr.update.SolrIndexFingerprintTest.beforeTests(SolrIndexFingerprintTest.java:32)
at java.base/jdk.internal.reflect.DirectMethodHandleAccessor.invoke(DirectMethodHandleAccessor.java:103)
at java.base/java.lang.reflect.Method.invoke(Method.java:580)
at com.carrotsearch.randomizedtesting.RandomizedRunner.invoke(RandomizedRunner.java:1763)
at com.carrotsearch.randomizedtesting.RandomizedRunner$6.evaluate(RandomizedRunner.java:886)
at com.carrotsearch.randomizedtesting.RandomizedRunner$7.evaluate(RandomizedRunner.java:902)
at com.carrotsearch.randomizedtesting.rules.StatementAdapter.evaluate(StatementAdapter.java:36)
at com.carrotsearch.randomizedtesting.rules.StatementAdapter.evaluate(StatementAdapter.java:36)
at org.apache.lucene.tests.util.AbstractBeforeAfterRule$1.evaluate(AbstractBeforeAfterRule.java:43)
at com.carrotsearch.randomizedtesting.rules.SystemPropertiesRestoreRule$1.evaluate(SystemPropertiesRestoreRule.java:80)
at org.junit.rules.RunRules.evaluate(RunRules.java:20)
at org.apache.lucene.tests.util.AbstractBeforeAfterRule$1.evaluate(AbstractBeforeAfterRule.java:43)
at com.carrotsearch.randomizedtesting.rules.StatementAdapter.evaluate(StatementAdapter.java:36)
at org.apache.lucene.tests.util.TestRuleStoreClassName$1.evaluate(TestRuleStoreClassName.java:38)
at com.carrotsearch.randomizedtesting.rules.NoShadowingOrOverridesOnMethodsRule$1.evaluate(NoShadowingOrOverridesOnMethodsRule.java:40)
at com.carrotsearch.randomizedtesting.rules.NoShadowingOrOverridesOnMethodsRule$1.evaluate(NoShadowingOrOverridesOnMethodsRule.java:40)
at com.carrotsearch.randomizedtesting.rules.StatementAdapter.evaluate(StatementAdapter.java:36)
at com.carrotsearch.randomizedtesting.rules.StatementAdapter.evaluate(StatementAdapter.java:36)
at org.apache.lucene.tests.util.TestRuleAssertionsRequired$1.evaluate(TestRuleAssertionsRequired.java:53)
at org.apache.lucene.tests.util.AbstractBeforeAfterRule$1.evaluate(AbstractBeforeAfterRule.java:43)
at org.apache.lucene.tests.util.TestRuleMarkFailure$1.evaluate(TestRuleMarkFailure.java:44)
at org.apache.lucene.tests.util.TestRuleIgnoreAfterMaxFailures$1.evaluate(TestRuleIgnoreAfterMaxFailures.java:60)
at org.apache.lucene.tests.util.TestRuleIgnoreTestSuites$1.evaluate(TestRuleIgnoreTestSuites.java:47)
at org.junit.rules.RunRules.evaluate(RunRules.java:20)
at com.carrotsearch.randomizedtesting.rules.StatementAdapter.evaluate(StatementAdapter.java:36)
at com.carrotsearch.randomizedtesting.ThreadLeakControl$StatementRunner.run(ThreadLeakControl.java:390)
at com.carrotsearch.randomizedtesting.ThreadLeakControl.lambda$forkTimeoutingTask$0(ThreadLeakControl.java:850)
... 1 more
expected null, but was:<ObjectTracker found 1 object(s) that were not released!!! [MockDirectoryWrapper]
org.apache.lucene.tests.store.MockDirectoryWrapper:org.apache.solr.common.util.ObjectReleaseTracker$ObjectTrackerException: org.apache.lucene.tests.store.MockDirectoryWrapper@1882763278
at org.apache.solr.common.util.ObjectReleaseTracker.track(ObjectReleaseTracker.java:57)
at org.apache.solr.core.CachingDirectoryFactory.get(CachingDirectoryFactory.java:405)
at org.apache.solr.update.SolrIndexWriter.create(SolrIndexWriter.java:115)
at org.apache.solr.core.SolrCore.initIndex(SolrCore.java:913)
at org.apache.solr.core.SolrCore.<init>(SolrCore.java:1135)
at org.apache.solr.core.SolrCore.<init>(SolrCore.java:1063)
at org.apache.solr.core.CoreContainer.createFromDescriptor(CoreContainer.java:1676)
at org.apache.solr.core.CoreContainer.lambda$loadInternal$6(CoreContainer.java:995)
at org.apache.solr.util.stats.OtelInstrumentedExecutorService$InstrumentedRunnable.run(OtelInstrumentedExecutorService.java:256)
at org.apache.solr.common.util.ExecutorUtil$MDCAwareThreadPoolExecutor.lambda$execute$0(ExecutorUtil.java:381)
at java.base/java.util.concurrent.ThreadPoolExecutor.runWorker(ThreadPoolExecutor.java:1144)
at java.base/java.util.concurrent.ThreadPoolExecutor$Worker.run(ThreadPoolExecutor.java:642)
at java.base/java.lang.Thread.run(Thread.java:1570)
Caused by: java.lang.Exception: Submitter stack trace
at org.apache.solr.common.util.ExecutorUtil$MDCAwareThreadPoolExecutor.execute(ExecutorUtil.java:348)
at org.apache.solr.util.stats.OtelInstrumentedExecutorService.execute(OtelInstrumentedExecutorService.java:156)
at org.apache.solr.core.CoreContainer.loadInternal(CoreContainer.java:984)
at org.apache.solr.core.CoreContainer.load(CoreContainer.java:753)
at org.apache.solr.util.TestHarness.<init>(TestHarness.java:171)
at org.apache.solr.util.TestHarness.<init>(TestHarness.java:139)
at org.apache.solr.util.TestHarness.<init>(TestHarness.java:147)
at org.apache.solr.util.TestHarness.<init>(TestHarness.java:91)
at org.apache.solr.SolrTestCaseJ4.createCore(SolrTestCaseJ4.java:706)
at org.apache.solr.SolrTestCaseJ4.initCore(SolrTestCaseJ4.java:696)
at org.apache.solr.SolrTestCaseJ4.initCore(SolrTestCaseJ4.java:559)
at org.apache.solr.SolrTestCaseJ4.initCore(SolrTestCaseJ4.java:546)
at org.apache.solr.update.SolrIndexFingerprintTest.beforeTests(SolrIndexFingerprintTest.java:32)
at java.base/jdk.internal.reflect.DirectMethodHandleAccessor.invoke(DirectMethodHandleAccessor.java:103)
at java.base/java.lang.reflect.Method.invoke(Method.java:580)
at com.carrotsearch.randomizedtesting.RandomizedRunner.invoke(RandomizedRunner.java:1763)
at com.carrotsearch.randomizedtesting.RandomizedRunner$6.evaluate(RandomizedRunner.java:886)
at com.carrotsearch.randomizedtesting.RandomizedRunner$7.evaluate(RandomizedRunner.java:902)
at com.carrotsearch.randomizedtesting.rules.StatementAdapter.evaluate(StatementAdapter.java:36)
at com.carrotsearch.randomizedtesting.rules.StatementAdapter.evaluate(StatementAdapter.java:36)
at org.apache.lucene.tests.util.AbstractBeforeAfterRule$1.evaluate(AbstractBeforeAfterRule.java:43)
at com.carrotsearch.randomizedtesting.rules.SystemPropertiesRestoreRule$1.evaluate(SystemPropertiesRestoreRule.java:80)
at org.junit.rules.RunRules.evaluate(RunRules.java:20)
at org.apache.lucene.tests.util.AbstractBeforeAfterRule$1.evaluate(AbstractBeforeAfterRule.java:43)
at com.carrotsearch.randomizedtesting.rules.StatementAdapter.evaluate(StatementAdapter.java:36)
at org.apache.lucene.tests.util.TestRuleStoreClassName$1.evaluate(TestRuleStoreClassName.java:38)
at com.carrotsearch.randomizedtesting.rules.NoShadowingOrOverridesOnMethodsRule$1.evaluate(NoShadowingOrOverridesOnMethodsRule.java:40)
at com.carrotsearch.randomizedtesting.rules.NoShadowingOrOverridesOnMethodsRule$1.evaluate(NoShadowingOrOverridesOnMethodsRule.java:40)
at com.carrotsearch.randomizedtesting.rules.StatementAdapter.evaluate(StatementAdapter.java:36)
at com.carrotsearch.randomizedtesting.rules.StatementAdapter.evaluate(StatementAdapter.java:36)
at org.apache.lucene.tests.util.TestRuleAssertionsRequired$1.evaluate(TestRuleAssertionsRequired.java:53)
at org.apache.lucene.tests.util.AbstractBeforeAfterRule$1.evaluate(AbstractBeforeAfterRule.java:43)
at org.apache.lucene.tests.util.TestRuleMarkFailure$1.evaluate(TestRuleMarkFailure.java:44)
at org.apache.lucene.tests.util.TestRuleIgnoreAfterMaxFailures$1.evaluate(TestRuleIgnoreAfterMaxFailures.java:60)
at org.apache.lucene.tests.util.TestRuleIgnoreTestSuites$1.evaluate(TestRuleIgnoreTestSuites.java:47)
at org.junit.rules.RunRules.evaluate(RunRules.java:20)
at com.carrotsearch.randomizedtesting.rules.StatementAdapter.evaluate(StatementAdapter.java:36)
at com.carrotsearch.randomizedtesting.ThreadLeakControl$StatementRunner.run(ThreadLeakControl.java:390)
at com.carrotsearch.randomizedtesting.ThreadLeakControl.lambda$forkTimeoutingTask$0(ThreadLeakControl.java:850)
... 1 more
>
at __randomizedtesting.SeedInfo.seed([CD130A9B6A1B7FD4]:0)
at org.junit.Assert.fail(Assert.java:89)
at org.junit.Assert.failNotNull(Assert.java:756)
at org.junit.Assert.assertNull(Assert.java:738)
at org.apache.solr.SolrTestCase$1.afterIfSuccessful(SolrTestCase.java:101)
at com.carrotsearch.randomizedtesting.rules.TestRuleAdapter$1.afterIfSuccessful(TestRuleAdapter.java:36)
at com.carrotsearch.randomizedtesting.rules.StatementAdapter.evaluate(StatementAdapter.java:37)
at com.carrotsearch.randomizedtesting.rules.StatementAdapter.evaluate(StatementAdapter.java:36)
at org.apache.lucene.tests.util.AbstractBeforeAfterRule$1.evaluate(AbstractBeforeAfterRule.java:43)
at com.carrotsearch.randomizedtesting.rules.SystemPropertiesRestoreRule$1.evaluate(SystemPropertiesRestoreRule.java:80)
at org.junit.rules.RunRules.evaluate(RunRules.java:20)
at org.apache.lucene.tests.util.AbstractBeforeAfterRule$1.evaluate(AbstractBeforeAfterRule.java:43)
at com.carrotsearch.randomizedtesting.rules.StatementAdapter.evaluate(StatementAdapter.java:36)
at org.apache.lucene.tests.util.TestRuleStoreClassName$1.evaluate(TestRuleStoreClassName.java:38)
at com.carrotsearch.randomizedtesting.rules.NoShadowingOrOverridesOnMethodsRule$1.evaluate(NoShadowingOrOverridesOnMethodsRule.java:40)
at com.carrotsearch.randomizedtesting.rules.NoShadowingOrOverridesOnMethodsRule$1.evaluate(NoShadowingOrOverridesOnMethodsRule.java:40)
at com.carrotsearch.randomizedtesting.rules.StatementAdapter.evaluate(StatementAdapter.java:36)
at com.carrotsearch.randomizedtesting.rules.StatementAdapter.evaluate(StatementAdapter.java:36)
at org.apache.lucene.tests.util.TestRuleAssertionsRequired$1.evaluate(TestRuleAssertionsRequired.java:53)
at org.apache.lucene.tests.util.AbstractBeforeAfterRule$1.evaluate(AbstractBeforeAfterRule.java:43)
at org.apache.lucene.tests.util.TestRuleMarkFailure$1.evaluate(TestRuleMarkFailure.java:44)
at org.apache.lucene.tests.util.TestRuleIgnoreAfterMaxFailures$1.evaluate(TestRuleIgnoreAfterMaxFailures.java:60)
at org.apache.lucene.tests.util.TestRuleIgnoreTestSuites$1.evaluate(TestRuleIgnoreTestSuites.java:47)
at org.junit.rules.RunRules.evaluate(RunRules.java:20)
at com.carrotsearch.randomizedtesting.rules.StatementAdapter.evaluate(StatementAdapter.java:36)
at com.carrotsearch.randomizedtesting.ThreadLeakControl$StatementRunner.run(ThreadLeakControl.java:390)
at com.carrotsearch.randomizedtesting.ThreadLeakControl.lambda$forkTimeoutingTask$0(ThreadLeakControl.java:850)
at java.base/java.lang.Thread.run(Thread.java:1570)
FAILED: org.apache.solr.update.SolrIndexFingerprintTest.testSequentialVsParallelFingerprint
Error Message:
java.lang.OutOfMemoryError: Java heap space
Stack Trace:
java.lang.OutOfMemoryError: Java heap space
at __randomizedtesting.SeedInfo.seed([CD130A9B6A1B7FD4:AD66291F3CA98DC9]:0)
at java.base/java.util.Arrays.asList(Arrays.java:4184)
at org.apache.lucene.index.FieldInfos.<init>(FieldInfos.java:159)
at org.apache.solr.uninverting.UninvertingReader.wrap(UninvertingReader.java:311)
at org.apache.solr.uninverting.UninvertingReader$UninvertingDirectoryReader$1.wrap(UninvertingReader.java:194)
at org.apache.lucene.index.FilterDirectoryReader$SubReaderWrapper.wrap(FilterDirectoryReader.java:62)
at org.apache.lucene.index.FilterDirectoryReader.<init>(FilterDirectoryReader.java:92)
at org.apache.solr.uninverting.UninvertingReader$UninvertingDirectoryReader.<init>(UninvertingReader.java:189)
at org.apache.solr.uninverting.UninvertingReader.wrap(UninvertingReader.java:181)
at org.apache.solr.search.SolrIndexSearcher.wrapReader(SolrIndexSearcher.java:233)
at org.apache.solr.search.SolrIndexSearcher.<init>(SolrIndexSearcher.java:393)
at org.apache.solr.core.SolrCore.openNewSearcher(SolrCore.java:2412)
at org.apache.solr.core.SolrCore.getSearcher(SolrCore.java:2621)
at org.apache.solr.core.SolrCore.getSearcher(SolrCore.java:2310)
at org.apache.solr.update.DirectUpdateHandler2.commit(DirectUpdateHandler2.java:900)
at org.apache.solr.update.processor.RunUpdateProcessorFactory$RunUpdateProcessor.processCommit(RunUpdateProcessorFactory.java:100)
at org.apache.solr.update.processor.UpdateRequestProcessor.processCommit(UpdateRequestProcessor.java:66)
at org.apache.solr.update.processor.UpdateRequestProcessor.processCommit(UpdateRequestProcessor.java:66)
at org.apache.solr.update.processor.DistributedUpdateProcessor.doLocalCommit(DistributedUpdateProcessor.java:1174)
at org.apache.solr.update.processor.DistributedUpdateProcessor.processCommit(DistributedUpdateProcessor.java:1160)
at org.apache.solr.update.processor.LogUpdateProcessorFactory$LogUpdateProcessor.processCommit(LogUpdateProcessorFactory.java:173)
at org.apache.solr.handler.loader.XMLLoader.processUpdate(XMLLoader.java:214)
at org.apache.solr.handler.loader.XMLLoader.load(XMLLoader.java:120)
at org.apache.solr.handler.UpdateRequestHandler$1.load(UpdateRequestHandler.java:101)
at org.apache.solr.handler.ContentStreamHandlerBase.handleRequestBody(ContentStreamHandlerBase.java:99)
at org.apache.solr.handler.RequestHandlerBase.handleRequest(RequestHandlerBase.java:251)
at org.apache.solr.core.SolrCore.execute(SolrCore.java:2927)
at org.apache.solr.client.solrj.embedded.EmbeddedSolrServer.request(EmbeddedSolrServer.java:227)
at org.apache.solr.client.solrj.SolrClient.request(SolrClient.java:1195)
at org.apache.solr.util.TestHarness.update(TestHarness.java:272)
at org.apache.solr.util.BaseTestHarness.checkUpdateStatus(BaseTestHarness.java:270)
at org.apache.solr.util.BaseTestHarness.validateUpdate(BaseTestHarness.java:238)
at org.apache.solr.SolrTestCaseJ4.checkUpdateU(SolrTestCaseJ4.java:841)
[JENKINS-EA] Solr-main-Linux (64bit/hotspot/jdk-27-ea+14) - Build # 32730 - Still Unstable!
Posted by Policeman Jenkins Server via builds <bu...@solr.apache.org>.
Build: https://jenkins.thetaphi.de/job/Solr-main-Linux/32730/
Java: 64bit/hotspot/jdk-27-ea+14 -XX:+UseCompressedOops -XX:+UseG1GC
4 tests failed.
FAILED: org.apache.solr.client.solrj.io.stream.StreamDecoratorTest.classMethod
Error Message:
java.lang.Exception: Suite timeout exceeded (>= 7200000 msec).
Stack Trace:
java.lang.Exception: Suite timeout exceeded (>= 7200000 msec).
at __randomizedtesting.SeedInfo.seed([7040E83478FBF087]:0)
FAILED: org.apache.solr.client.solrj.io.stream.StreamDecoratorTest.testParallelDaemonUpdateStream
Error Message:
java.lang.Exception: Test abandoned because suite timeout was reached.
Stack Trace:
java.lang.Exception: Test abandoned because suite timeout was reached.
at __randomizedtesting.SeedInfo.seed([7040E83478FBF087]:0)
FAILED: org.apache.solr.cloud.BasicDistributedZk2Test.test
Error Message:
java.lang.RuntimeException: Timeout waiting for pool org.apache.solr.common.util.ExecutorUtil$MDCAwareThreadPoolExecutor@4a2624ca[Shutting down, pool size = 1, active threads = 1, queued tasks = 0, completed tasks = 9] to shutdown.
Stack Trace:
java.lang.RuntimeException: Timeout waiting for pool org.apache.solr.common.util.ExecutorUtil$MDCAwareThreadPoolExecutor@4a2624ca[Shutting down, pool size = 1, active threads = 1, queued tasks = 0, completed tasks = 9] to shutdown.
at __randomizedtesting.SeedInfo.seed([7040E83478FBF087:F814D7EED6079D7F]:0)
at org.apache.solr.common.util.ExecutorUtil.awaitTermination(ExecutorUtil.java:166)
at org.apache.solr.common.util.ExecutorUtil.awaitTermination(ExecutorUtil.java:153)
at org.apache.solr.common.util.ExecutorUtil.shutdownAndAwaitTermination(ExecutorUtil.java:119)
at org.apache.solr.BaseDistributedSearchTestCase.destroyServers(BaseDistributedSearchTestCase.java:370)
at org.apache.solr.cloud.AbstractFullDistribZkTestBase.destroyServers(AbstractFullDistribZkTestBase.java:2269)
at org.apache.solr.BaseDistributedSearchTestCase$ShardsRepeatRule$ShardsFixedStatement.callStatement(BaseDistributedSearchTestCase.java:1064)
at org.apache.solr.BaseDistributedSearchTestCase$ShardsRepeatRule$ShardsStatement.evaluate(BaseDistributedSearchTestCase.java:1033)
at com.carrotsearch.randomizedtesting.rules.SystemPropertiesRestoreRule$1.evaluate(SystemPropertiesRestoreRule.java:80)
at org.junit.rules.RunRules.evaluate(RunRules.java:20)
at org.apache.lucene.tests.util.TestRuleSetupTeardownChained$1.evaluate(TestRuleSetupTeardownChained.java:48)
at org.apache.lucene.tests.util.AbstractBeforeAfterRule$1.evaluate(AbstractBeforeAfterRule.java:43)
at org.apache.lucene.tests.util.TestRuleThreadAndTestName$1.evaluate(TestRuleThreadAndTestName.java:45)
at org.apache.lucene.tests.util.TestRuleIgnoreAfterMaxFailures$1.evaluate(TestRuleIgnoreAfterMaxFailures.java:60)
at org.apache.lucene.tests.util.TestRuleMarkFailure$1.evaluate(TestRuleMarkFailure.java:44)
at org.junit.rules.RunRules.evaluate(RunRules.java:20)
at com.carrotsearch.randomizedtesting.rules.StatementAdapter.evaluate(StatementAdapter.java:36)
at com.carrotsearch.randomizedtesting.ThreadLeakControl$StatementRunner.run(ThreadLeakControl.java:390)
at com.carrotsearch.randomizedtesting.ThreadLeakControl.forkTimeoutingTask(ThreadLeakControl.java:843)
at com.carrotsearch.randomizedtesting.ThreadLeakControl$3.evaluate(ThreadLeakControl.java:490)
at com.carrotsearch.randomizedtesting.RandomizedRunner.runSingleTest(RandomizedRunner.java:955)
at com.carrotsearch.randomizedtesting.RandomizedRunner$5.evaluate(RandomizedRunner.java:840)
at com.carrotsearch.randomizedtesting.RandomizedRunner$6.evaluate(RandomizedRunner.java:891)
at com.carrotsearch.randomizedtesting.RandomizedRunner$7.evaluate(RandomizedRunner.java:902)
at com.carrotsearch.randomizedtesting.rules.StatementAdapter.evaluate(StatementAdapter.java:36)
at com.carrotsearch.randomizedtesting.rules.StatementAdapter.evaluate(StatementAdapter.java:36)
at org.apache.lucene.tests.util.AbstractBeforeAfterRule$1.evaluate(AbstractBeforeAfterRule.java:43)
at com.carrotsearch.randomizedtesting.rules.SystemPropertiesRestoreRule$1.evaluate(SystemPropertiesRestoreRule.java:80)
at org.junit.rules.RunRules.evaluate(RunRules.java:20)
at org.apache.lucene.tests.util.AbstractBeforeAfterRule$1.evaluate(AbstractBeforeAfterRule.java:43)
at com.carrotsearch.randomizedtesting.rules.StatementAdapter.evaluate(StatementAdapter.java:36)
at org.apache.lucene.tests.util.TestRuleStoreClassName$1.evaluate(TestRuleStoreClassName.java:38)
at com.carrotsearch.randomizedtesting.rules.NoShadowingOrOverridesOnMethodsRule$1.evaluate(NoShadowingOrOverridesOnMethodsRule.java:40)
at com.carrotsearch.randomizedtesting.rules.NoShadowingOrOverridesOnMethodsRule$1.evaluate(NoShadowingOrOverridesOnMethodsRule.java:40)
at com.carrotsearch.randomizedtesting.rules.StatementAdapter.evaluate(StatementAdapter.java:36)
at com.carrotsearch.randomizedtesting.rules.StatementAdapter.evaluate(StatementAdapter.java:36)
at org.apache.lucene.tests.util.TestRuleAssertionsRequired$1.evaluate(TestRuleAssertionsRequired.java:53)
at org.apache.lucene.tests.util.AbstractBeforeAfterRule$1.evaluate(AbstractBeforeAfterRule.java:43)
at org.apache.lucene.tests.util.TestRuleMarkFailure$1.evaluate(TestRuleMarkFailure.java:44)
at org.apache.lucene.tests.util.TestRuleIgnoreAfterMaxFailures$1.evaluate(TestRuleIgnoreAfterMaxFailures.java:60)
at org.apache.lucene.tests.util.TestRuleIgnoreTestSuites$1.evaluate(TestRuleIgnoreTestSuites.java:47)
at org.junit.rules.RunRules.evaluate(RunRules.java:20)
at com.carrotsearch.randomizedtesting.rules.StatementAdapter.evaluate(StatementAdapter.java:36)
at com.carrotsearch.randomizedtesting.ThreadLeakControl$StatementRunner.run(ThreadLeakControl.java:390)
at com.carrotsearch.randomizedtesting.ThreadLeakControl.lambda$forkTimeoutingTask$0(ThreadLeakControl.java:850)
at java.base/java.lang.Thread.run(Thread.java:1527)
FAILED: org.apache.solr.cloud.BasicDistributedZkTest.test
Error Message:
java.lang.RuntimeException: Timeout waiting for pool org.apache.solr.common.util.ExecutorUtil$MDCAwareThreadPoolExecutor@474182fd[Shutting down, pool size = 2, active threads = 2, queued tasks = 0, completed tasks = 8] to shutdown.
Stack Trace:
java.lang.RuntimeException: Timeout waiting for pool org.apache.solr.common.util.ExecutorUtil$MDCAwareThreadPoolExecutor@474182fd[Shutting down, pool size = 2, active threads = 2, queued tasks = 0, completed tasks = 8] to shutdown.
at __randomizedtesting.SeedInfo.seed([7040E83478FBF087:F814D7EED6079D7F]:0)
at org.apache.solr.common.util.ExecutorUtil.awaitTermination(ExecutorUtil.java:166)
at org.apache.solr.common.util.ExecutorUtil.awaitTermination(ExecutorUtil.java:153)
at org.apache.solr.common.util.ExecutorUtil.shutdownAndAwaitTermination(ExecutorUtil.java:119)
at org.apache.solr.BaseDistributedSearchTestCase.destroyServers(BaseDistributedSearchTestCase.java:370)
at org.apache.solr.cloud.AbstractFullDistribZkTestBase.destroyServers(AbstractFullDistribZkTestBase.java:2269)
at org.apache.solr.BaseDistributedSearchTestCase$ShardsRepeatRule$ShardsFixedStatement.callStatement(BaseDistributedSearchTestCase.java:1064)
at org.apache.solr.BaseDistributedSearchTestCase$ShardsRepeatRule$ShardsStatement.evaluate(BaseDistributedSearchTestCase.java:1033)
at com.carrotsearch.randomizedtesting.rules.SystemPropertiesRestoreRule$1.evaluate(SystemPropertiesRestoreRule.java:80)
at org.junit.rules.RunRules.evaluate(RunRules.java:20)
at org.apache.lucene.tests.util.TestRuleSetupTeardownChained$1.evaluate(TestRuleSetupTeardownChained.java:48)
at org.apache.lucene.tests.util.AbstractBeforeAfterRule$1.evaluate(AbstractBeforeAfterRule.java:43)
at org.apache.lucene.tests.util.TestRuleThreadAndTestName$1.evaluate(TestRuleThreadAndTestName.java:45)
at org.apache.lucene.tests.util.TestRuleIgnoreAfterMaxFailures$1.evaluate(TestRuleIgnoreAfterMaxFailures.java:60)
at org.apache.lucene.tests.util.TestRuleMarkFailure$1.evaluate(TestRuleMarkFailure.java:44)
at org.junit.rules.RunRules.evaluate(RunRules.java:20)
at com.carrotsearch.randomizedtesting.rules.StatementAdapter.evaluate(StatementAdapter.java:36)
at com.carrotsearch.randomizedtesting.ThreadLeakControl$StatementRunner.run(ThreadLeakControl.java:390)
at com.carrotsearch.randomizedtesting.ThreadLeakControl.forkTimeoutingTask(ThreadLeakControl.java:843)
at com.carrotsearch.randomizedtesting.ThreadLeakControl$3.evaluate(ThreadLeakControl.java:490)
at com.carrotsearch.randomizedtesting.RandomizedRunner.runSingleTest(RandomizedRunner.java:955)
at com.carrotsearch.randomizedtesting.RandomizedRunner$5.evaluate(RandomizedRunner.java:840)
at com.carrotsearch.randomizedtesting.RandomizedRunner$6.evaluate(RandomizedRunner.java:891)
at com.carrotsearch.randomizedtesting.RandomizedRunner$7.evaluate(RandomizedRunner.java:902)
at com.carrotsearch.randomizedtesting.rules.StatementAdapter.evaluate(StatementAdapter.java:36)
at com.carrotsearch.randomizedtesting.rules.StatementAdapter.evaluate(StatementAdapter.java:36)
at org.apache.lucene.tests.util.AbstractBeforeAfterRule$1.evaluate(AbstractBeforeAfterRule.java:43)
at com.carrotsearch.randomizedtesting.rules.SystemPropertiesRestoreRule$1.evaluate(SystemPropertiesRestoreRule.java:80)
at org.junit.rules.RunRules.evaluate(RunRules.java:20)
at org.apache.lucene.tests.util.AbstractBeforeAfterRule$1.evaluate(AbstractBeforeAfterRule.java:43)
at com.carrotsearch.randomizedtesting.rules.StatementAdapter.evaluate(StatementAdapter.java:36)
at org.apache.lucene.tests.util.TestRuleStoreClassName$1.evaluate(TestRuleStoreClassName.java:38)
at com.carrotsearch.randomizedtesting.rules.NoShadowingOrOverridesOnMethodsRule$1.evaluate(NoShadowingOrOverridesOnMethodsRule.java:40)
at com.carrotsearch.randomizedtesting.rules.NoShadowingOrOverridesOnMethodsRule$1.evaluate(NoShadowingOrOverridesOnMethodsRule.java:40)
at com.carrotsearch.randomizedtesting.rules.StatementAdapter.evaluate(StatementAdapter.java:36)
at com.carrotsearch.randomizedtesting.rules.StatementAdapter.evaluate(StatementAdapter.java:36)
at org.apache.lucene.tests.util.TestRuleAssertionsRequired$1.evaluate(TestRuleAssertionsRequired.java:53)
at org.apache.lucene.tests.util.AbstractBeforeAfterRule$1.evaluate(AbstractBeforeAfterRule.java:43)
at org.apache.lucene.tests.util.TestRuleMarkFailure$1.evaluate(TestRuleMarkFailure.java:44)
at org.apache.lucene.tests.util.TestRuleIgnoreAfterMaxFailures$1.evaluate(TestRuleIgnoreAfterMaxFailures.java:60)
at org.apache.lucene.tests.util.TestRuleIgnoreTestSuites$1.evaluate(TestRuleIgnoreTestSuites.java:47)
at org.junit.rules.RunRules.evaluate(RunRules.java:20)
at com.carrotsearch.randomizedtesting.rules.StatementAdapter.evaluate(StatementAdapter.java:36)
at com.carrotsearch.randomizedtesting.ThreadLeakControl$StatementRunner.run(ThreadLeakControl.java:390)
at com.carrotsearch.randomizedtesting.ThreadLeakControl.lambda$forkTimeoutingTask$0(ThreadLeakControl.java:850)
at java.base/java.lang.Thread.run(Thread.java:1527)