You are viewing a plain text version of this content. The canonical link for it is here.
Posted to builds@beam.apache.org by Apache Jenkins Server <je...@builds.apache.org> on 2021/10/28 18:37:46 UTC

Build failed in Jenkins: beam_PostCommit_XVR_Samza #400

See <https://ci-beam.apache.org/job/beam_PostCommit_XVR_Samza/400/display/redirect?page=changes>

Changes:

[daria.malkova] fix executor tests

[mmack] [BEAM-13138] Update code to retrieve container endpoint

[noreply] Merge pull request #15709 from [BEAM-12967] [Playground] Create Example

[noreply] Merge pull request #15294 from [BEAM-11986] Spanner write metric

[noreply] [BEAM-13130] Remove persistent references to stateKeyReaders (#15815)


------------------------------------------
[...truncated 169.52 KB...]
      capabilities: "beam:version:sdk_base:go"
      capabilities: "beam:coder:bytes:v1"
      capabilities: "beam:coder:bool:v1"
      capabilities: "beam:coder:varint:v1"
      capabilities: "beam:coder:double:v1"
      capabilities: "beam:coder:string_utf8:v1"
      capabilities: "beam:coder:length_prefix:v1"
      capabilities: "beam:coder:kv:v1"
      capabilities: "beam:coder:iterable:v1"
      capabilities: "beam:coder:state_backed_iterable:v1"
      capabilities: "beam:coder:windowed_value:v1"
      capabilities: "beam:coder:global_window:v1"
      capabilities: "beam:coder:interval_window:v1"
      capabilities: "beam:coder:row:v1"
      dependencies: <
        type_urn: "beam:artifact:type:go_worker_binary:v1"
        role_urn: "beam:artifact:role:staging_to:v1"
        role_payload: "\n\006worker"
      >
    >
  >
>
root_transform_ids: "s1"
    ptest.go:98: Failed to execute job: 	connecting to job service
        failed to dial server at localhost:42089
        	caused by:
        context deadline exceeded
--- FAIL: TestKafkaIO_BasicReadWrite (122.52s)
FAIL
FAIL	github.com/apache/beam/sdks/v2/go/test/integration/io/xlang/kafka	125.595s
FAIL

> Task :runners:samza:job-server:validatesCrossLanguageRunnerGoUsingJava FAILED

> Task :runners:samza:job-server:validatesCrossLanguageRunnerJavaUsingJava

org.apache.beam.runners.core.construction.ValidateRunnerXlangTest > combineGloballyTest FAILED
    org.apache.beam.vendor.grpc.v1p36p0.io.grpc.StatusRuntimeException at ValidateRunnerXlangTest.java:257
        Caused by: org.apache.beam.vendor.grpc.v1p36p0.io.netty.channel.AbstractChannel$AnnotatedConnectException
            Caused by: java.net.ConnectException at Errors.java:124
    java.lang.NullPointerException at ValidateRunnerXlangTest.java:123

org.apache.beam.runners.core.construction.ValidateRunnerXlangTest > partitionTest FAILED
    org.apache.beam.vendor.grpc.v1p36p0.io.grpc.StatusRuntimeException at ValidateRunnerXlangTest.java:314
        Caused by: org.apache.beam.vendor.grpc.v1p36p0.io.netty.channel.AbstractChannel$AnnotatedConnectException
            Caused by: java.net.ConnectException at Errors.java:124
    java.lang.NullPointerException at ValidateRunnerXlangTest.java:123

org.apache.beam.runners.core.construction.ValidateRunnerXlangTest > coGroupByKeyTest FAILED
    org.apache.beam.vendor.grpc.v1p36p0.io.grpc.StatusRuntimeException at ValidateRunnerXlangTest.java:230
        Caused by: org.apache.beam.vendor.grpc.v1p36p0.io.netty.channel.AbstractChannel$AnnotatedConnectException
            Caused by: java.net.ConnectException at Errors.java:124
    java.lang.NullPointerException at ValidateRunnerXlangTest.java:123

org.apache.beam.runners.core.construction.ValidateRunnerXlangTest > groupByKeyTest FAILED
    org.apache.beam.vendor.grpc.v1p36p0.io.grpc.StatusRuntimeException at ValidateRunnerXlangTest.java:198
        Caused by: org.apache.beam.vendor.grpc.v1p36p0.io.netty.channel.AbstractChannel$AnnotatedConnectException
            Caused by: java.net.ConnectException at Errors.java:124
    java.lang.NullPointerException at ValidateRunnerXlangTest.java:123

org.apache.beam.runners.core.construction.ValidateRunnerXlangTest > combinePerKeyTest FAILED
    org.apache.beam.vendor.grpc.v1p36p0.io.grpc.StatusRuntimeException at ValidateRunnerXlangTest.java:275
        Caused by: org.apache.beam.vendor.grpc.v1p36p0.io.netty.channel.AbstractChannel$AnnotatedConnectException
            Caused by: java.net.ConnectException at Errors.java:124
    java.lang.NullPointerException at ValidateRunnerXlangTest.java:123

org.apache.beam.runners.core.construction.ValidateRunnerXlangTest > flattenTest FAILED
    org.apache.beam.vendor.grpc.v1p36p0.io.grpc.StatusRuntimeException at ValidateRunnerXlangTest.java:295
        Caused by: org.apache.beam.vendor.grpc.v1p36p0.io.netty.channel.AbstractChannel$AnnotatedConnectException
            Caused by: java.net.ConnectException at Errors.java:124
    java.lang.NullPointerException at ValidateRunnerXlangTest.java:123

org.apache.beam.runners.core.construction.ValidateRunnerXlangTest > singleInputOutputTest FAILED
    org.apache.beam.vendor.grpc.v1p36p0.io.grpc.StatusRuntimeException at ValidateRunnerXlangTest.java:156
        Caused by: org.apache.beam.vendor.grpc.v1p36p0.io.netty.channel.AbstractChannel$AnnotatedConnectException
            Caused by: java.net.ConnectException at Errors.java:124
    java.lang.NullPointerException at ValidateRunnerXlangTest.java:123

org.apache.beam.runners.core.construction.ValidateRunnerXlangTest > multiInputOutputWithSideInputTest FAILED
    org.apache.beam.vendor.grpc.v1p36p0.io.grpc.StatusRuntimeException at ValidateRunnerXlangTest.java:178
        Caused by: org.apache.beam.vendor.grpc.v1p36p0.io.netty.channel.AbstractChannel$AnnotatedConnectException
            Caused by: java.net.ConnectException at Errors.java:124
    java.lang.NullPointerException at ValidateRunnerXlangTest.java:123

8 tests completed, 8 failed

> Task :runners:samza:job-server:validatesCrossLanguageRunnerJavaUsingJava FAILED

> Task :runners:samza:job-server:validatesCrossLanguageRunnerJavaUsingPython

org.apache.beam.runners.core.construction.ValidateRunnerXlangTest > combineGloballyTest FAILED
    org.apache.beam.vendor.grpc.v1p36p0.io.grpc.StatusRuntimeException at ValidateRunnerXlangTest.java:257
        Caused by: org.apache.beam.vendor.grpc.v1p36p0.io.netty.channel.AbstractChannel$AnnotatedConnectException
            Caused by: java.net.ConnectException at Errors.java:124
    java.lang.NullPointerException at ValidateRunnerXlangTest.java:123

org.apache.beam.runners.core.construction.ValidateRunnerXlangTest > partitionTest FAILED
    org.apache.beam.vendor.grpc.v1p36p0.io.grpc.StatusRuntimeException at ValidateRunnerXlangTest.java:314
        Caused by: org.apache.beam.vendor.grpc.v1p36p0.io.netty.channel.AbstractChannel$AnnotatedConnectException
            Caused by: java.net.ConnectException at Errors.java:124
    java.lang.NullPointerException at ValidateRunnerXlangTest.java:123

org.apache.beam.runners.core.construction.ValidateRunnerXlangTest > coGroupByKeyTest FAILED
    org.apache.beam.vendor.grpc.v1p36p0.io.grpc.StatusRuntimeException at ValidateRunnerXlangTest.java:230
        Caused by: org.apache.beam.vendor.grpc.v1p36p0.io.netty.channel.AbstractChannel$AnnotatedConnectException
            Caused by: java.net.ConnectException at Errors.java:124
    java.lang.NullPointerException at ValidateRunnerXlangTest.java:123

org.apache.beam.runners.core.construction.ValidateRunnerXlangTest > groupByKeyTest FAILED
    org.apache.beam.vendor.grpc.v1p36p0.io.grpc.StatusRuntimeException at ValidateRunnerXlangTest.java:198
        Caused by: org.apache.beam.vendor.grpc.v1p36p0.io.netty.channel.AbstractChannel$AnnotatedConnectException
            Caused by: java.net.ConnectException at Errors.java:124
    java.lang.NullPointerException at ValidateRunnerXlangTest.java:123

org.apache.beam.runners.core.construction.ValidateRunnerXlangTest > combinePerKeyTest FAILED
    org.apache.beam.vendor.grpc.v1p36p0.io.grpc.StatusRuntimeException at ValidateRunnerXlangTest.java:275
        Caused by: org.apache.beam.vendor.grpc.v1p36p0.io.netty.channel.AbstractChannel$AnnotatedConnectException
            Caused by: java.net.ConnectException at Errors.java:124
    java.lang.NullPointerException at ValidateRunnerXlangTest.java:123

org.apache.beam.runners.core.construction.ValidateRunnerXlangTest > flattenTest FAILED
    org.apache.beam.vendor.grpc.v1p36p0.io.grpc.StatusRuntimeException at ValidateRunnerXlangTest.java:295
        Caused by: org.apache.beam.vendor.grpc.v1p36p0.io.netty.channel.AbstractChannel$AnnotatedConnectException
            Caused by: java.net.ConnectException at Errors.java:124
    java.lang.NullPointerException at ValidateRunnerXlangTest.java:123

org.apache.beam.runners.core.construction.ValidateRunnerXlangTest > singleInputOutputTest FAILED
    org.apache.beam.vendor.grpc.v1p36p0.io.grpc.StatusRuntimeException at ValidateRunnerXlangTest.java:156
        Caused by: org.apache.beam.vendor.grpc.v1p36p0.io.netty.channel.AbstractChannel$AnnotatedConnectException
            Caused by: java.net.ConnectException at Errors.java:124
    java.lang.NullPointerException at ValidateRunnerXlangTest.java:123

org.apache.beam.runners.core.construction.ValidateRunnerXlangTest > multiInputOutputWithSideInputTest FAILED
    org.apache.beam.vendor.grpc.v1p36p0.io.grpc.StatusRuntimeException at ValidateRunnerXlangTest.java:178
        Caused by: org.apache.beam.vendor.grpc.v1p36p0.io.netty.channel.AbstractChannel$AnnotatedConnectException
            Caused by: java.net.ConnectException at Errors.java:124
    java.lang.NullPointerException at ValidateRunnerXlangTest.java:123

8 tests completed, 8 failed

> Task :runners:samza:job-server:validatesCrossLanguageRunnerJavaUsingPython FAILED

> Task :runners:samza:job-server:validatesCrossLanguageRunnerJavaUsingPythonOnly

org.apache.beam.runners.core.construction.ValidateRunnerXlangTest > pythonDependenciesTest FAILED
    org.apache.beam.vendor.grpc.v1p36p0.io.grpc.StatusRuntimeException at ValidateRunnerXlangTest.java:338
        Caused by: org.apache.beam.vendor.grpc.v1p36p0.io.netty.channel.AbstractChannel$AnnotatedConnectException
            Caused by: java.net.ConnectException at Errors.java:124
    java.lang.NullPointerException at ValidateRunnerXlangTest.java:123

1 test completed, 1 failed

> Task :runners:samza:job-server:validatesCrossLanguageRunnerJavaUsingPythonOnly FAILED
> Task :runners:samza:job-server:validatesCrossLanguageRunnerPythonUsingJava FAILED
> Task :runners:samza:job-server:validatesCrossLanguageRunnerPythonUsingPython FAILED
> Task :runners:samza:job-server:validatesCrossLanguageRunnerPythonUsingSql
> Task :runners:samza:job-server:validatesCrossLanguageRunnerPythonUsingSql FAILED
> Task :runners:samza:job-server:validatesCrossLanguageRunnerCleanup
> Task :runners:samza:job-server:samzaJobServerCleanup

FAILURE: Build completed with 7 failures.

1: Task failed with an exception.
-----------
* Where:
Build file '<https://ci-beam.apache.org/job/beam_PostCommit_XVR_Samza/ws/src/sdks/go/test/build.gradle'> line: 212

* What went wrong:
Execution failed for task ':runners:samza:job-server:validatesCrossLanguageRunnerGoUsingJava'.
> Process 'command 'sh'' finished with non-zero exit value 1

* Try:
Run with --stacktrace option to get the stack trace. Run with --info or --debug option to get more log output. Run with --scan to get full insights.
==============================================================================

2: Task failed with an exception.
-----------
* What went wrong:
Execution failed for task ':runners:samza:job-server:validatesCrossLanguageRunnerJavaUsingJava'.
> There were failing tests. See the report at: file://<https://ci-beam.apache.org/job/beam_PostCommit_XVR_Samza/ws/src/runners/samza/job-server/build/reports/tests/validatesCrossLanguageRunnerJavaUsingJava/index.html>

* Try:
Run with --stacktrace option to get the stack trace. Run with --info or --debug option to get more log output. Run with --scan to get full insights.
==============================================================================

3: Task failed with an exception.
-----------
* What went wrong:
Execution failed for task ':runners:samza:job-server:validatesCrossLanguageRunnerJavaUsingPython'.
> There were failing tests. See the report at: file://<https://ci-beam.apache.org/job/beam_PostCommit_XVR_Samza/ws/src/runners/samza/job-server/build/reports/tests/validatesCrossLanguageRunnerJavaUsingPython/index.html>

* Try:
Run with --stacktrace option to get the stack trace. Run with --info or --debug option to get more log output. Run with --scan to get full insights.
==============================================================================

4: Task failed with an exception.
-----------
* What went wrong:
Execution failed for task ':runners:samza:job-server:validatesCrossLanguageRunnerJavaUsingPythonOnly'.
> There were failing tests. See the report at: file://<https://ci-beam.apache.org/job/beam_PostCommit_XVR_Samza/ws/src/runners/samza/job-server/build/reports/tests/validatesCrossLanguageRunnerJavaUsingPythonOnly/index.html>

* Try:
Run with --stacktrace option to get the stack trace. Run with --info or --debug option to get more log output. Run with --scan to get full insights.
==============================================================================

5: Task failed with an exception.
-----------
* What went wrong:
Execution failed for task ':runners:samza:job-server:validatesCrossLanguageRunnerPythonUsingJava'.
> Process 'command 'sh'' finished with non-zero exit value 1

* Try:
Run with --stacktrace option to get the stack trace. Run with --info or --debug option to get more log output. Run with --scan to get full insights.
==============================================================================

6: Task failed with an exception.
-----------
* What went wrong:
Execution failed for task ':runners:samza:job-server:validatesCrossLanguageRunnerPythonUsingPython'.
> Process 'command 'sh'' finished with non-zero exit value 1

* Try:
Run with --stacktrace option to get the stack trace. Run with --info or --debug option to get more log output. Run with --scan to get full insights.
==============================================================================

7: Task failed with an exception.
-----------
* What went wrong:
Execution failed for task ':runners:samza:job-server:validatesCrossLanguageRunnerPythonUsingSql'.
> Process 'command 'sh'' finished with non-zero exit value 1

* Try:
Run with --stacktrace option to get the stack trace. Run with --info or --debug option to get more log output. Run with --scan to get full insights.
==============================================================================

* Get more help at https://help.gradle.org

Deprecated Gradle features were used in this build, making it incompatible with Gradle 7.0.
Use '--warning-mode all' to show the individual deprecation warnings.
See https://docs.gradle.org/6.9.1/userguide/command_line_interface.html#sec:command_line_warnings

BUILD FAILED in 32m 43s
212 actionable tasks: 159 executed, 46 from cache, 7 up-to-date

Publishing build scan...
https://gradle.com/s/gitzmqjmcj6mc

Build step 'Invoke Gradle script' changed build result to FAILURE
Build step 'Invoke Gradle script' marked build as failure

---------------------------------------------------------------------
To unsubscribe, e-mail: builds-unsubscribe@beam.apache.org
For additional commands, e-mail: builds-help@beam.apache.org


Jenkins build is back to normal : beam_PostCommit_XVR_Samza #402

Posted by Apache Jenkins Server <je...@builds.apache.org>.
See <https://ci-beam.apache.org/job/beam_PostCommit_XVR_Samza/402/display/redirect?page=changes>


---------------------------------------------------------------------
To unsubscribe, e-mail: builds-unsubscribe@beam.apache.org
For additional commands, e-mail: builds-help@beam.apache.org


Build failed in Jenkins: beam_PostCommit_XVR_Samza #401

Posted by Apache Jenkins Server <je...@builds.apache.org>.
See <https://ci-beam.apache.org/job/beam_PostCommit_XVR_Samza/401/display/redirect?page=changes>

Changes:

[Brian Hulette] [BEAM-13099] Replace call to RelNode.metadata with BeamRelMetadataQuery

[Brian Hulette] [BEAM-13099] Update all rels to use BeamRelMetadataQuery


------------------------------------------
[...truncated 647.86 KB...]
WARNING:root:Make sure that locally built Python SDK docker image has Python 3.6 interpreter.
WARNING:root:Make sure that locally built Python SDK docker image has Python 3.6 interpreter.
------------------------------ Captured log call -------------------------------
WARNING  root:environments.py:374 Make sure that locally built Python SDK docker image has Python 3.6 interpreter.
WARNING  root:environments.py:374 Make sure that locally built Python SDK docker image has Python 3.6 interpreter.
______________________ SqlTransformTest.test_tagged_join _______________________

self = <apache_beam.transforms.sql_test.SqlTransformTest testMethod=test_tagged_join>

    def test_tagged_join(self):
      with TestPipeline() as p:
        enrich = (
            p | "Create enrich" >> beam.Create(
                [Enrich(1, "a"), Enrich(2, "b"), Enrich(26, "z")]))
        simple = (
            p | "Create simple" >> beam.Create([
                SimpleRow(1, "foo", 3.14),
                SimpleRow(26, "bar", 1.11),
                SimpleRow(1, "baz", 2.34)
            ]))
        out = ({
            'simple': simple, 'enrich': enrich
        }
               | SqlTransform(
                   """
                SELECT
                  simple.`id` AS `id`,
                  enrich.metadata AS metadata
                FROM simple
                JOIN enrich
                ON simple.`id` = enrich.`id`"""))
>       assert_that(out, equal_to([(1, "a"), (26, "z"), (1, "a")]))

apache_beam/transforms/sql_test.py:141: 
_ _ _ _ _ _ _ _ _ _ _ _ _ _ _ _ _ _ _ _ _ _ _ _ _ _ _ _ _ _ _ _ _ _ _ _ _ _ _ _ 
apache_beam/pipeline.py:596: in __exit__
    self.result = self.run()
apache_beam/testing/test_pipeline.py:114: in run
    False if self.not_use_test_runner_api else test_runner_api))
apache_beam/pipeline.py:573: in run
    return self.runner.run_pipeline(self, self._options)
apache_beam/runners/portability/portable_runner.py:438: in run_pipeline
    job_service_handle = self.create_job_service(options)
apache_beam/runners/portability/portable_runner.py:317: in create_job_service
    return self.create_job_service_handle(server.start(), options)
apache_beam/runners/portability/job_server.py:54: in start
    grpc.channel_ready_future(channel).result(timeout=self._timeout)
../../build/gradleenv/1922375555/lib/python3.6/site-packages/grpc/_utilities.py:139: in result
    self._block(timeout)
_ _ _ _ _ _ _ _ _ _ _ _ _ _ _ _ _ _ _ _ _ _ _ _ _ _ _ _ _ _ _ _ _ _ _ _ _ _ _ _ 

self = <grpc._utilities._ChannelReadyFuture object at 0x7f0f7a930828>
timeout = 60

    def _block(self, timeout):
        until = None if timeout is None else time.time() + timeout
        with self._condition:
            while True:
                if self._cancelled:
                    raise grpc.FutureCancelledError()
                elif self._matured:
                    return
                else:
                    if until is None:
                        self._condition.wait()
                    else:
                        remaining = until - time.time()
                        if remaining < 0:
>                           raise grpc.FutureTimeoutError()
E                           grpc.FutureTimeoutError

../../build/gradleenv/1922375555/lib/python3.6/site-packages/grpc/_utilities.py:85: FutureTimeoutError
----------------------------- Captured stderr call -----------------------------
WARNING:root:Make sure that locally built Python SDK docker image has Python 3.6 interpreter.
WARNING:root:Make sure that locally built Python SDK docker image has Python 3.6 interpreter.
------------------------------ Captured log call -------------------------------
WARNING  root:environments.py:374 Make sure that locally built Python SDK docker image has Python 3.6 interpreter.
WARNING  root:environments.py:374 Make sure that locally built Python SDK docker image has Python 3.6 interpreter.
__________________ SqlTransformTest.test_windowing_before_sql __________________

self = <apache_beam.transforms.sql_test.SqlTransformTest testMethod=test_windowing_before_sql>

    def test_windowing_before_sql(self):
      with TestPipeline() as p:
        out = (
            p | beam.Create([
                SimpleRow(5, "foo", 1.),
                SimpleRow(15, "bar", 2.),
                SimpleRow(25, "baz", 3.)
            ])
            | beam.Map(lambda v: beam.window.TimestampedValue(v, v.id)).
            with_output_types(SimpleRow)
            | beam.WindowInto(
                beam.window.FixedWindows(10)).with_output_types(SimpleRow)
            | SqlTransform("SELECT COUNT(*) as `count` FROM PCOLLECTION"))
>       assert_that(out, equal_to([(1, ), (1, ), (1, )]))

apache_beam/transforms/sql_test.py:175: 
_ _ _ _ _ _ _ _ _ _ _ _ _ _ _ _ _ _ _ _ _ _ _ _ _ _ _ _ _ _ _ _ _ _ _ _ _ _ _ _ 
apache_beam/pipeline.py:596: in __exit__
    self.result = self.run()
apache_beam/testing/test_pipeline.py:114: in run
    False if self.not_use_test_runner_api else test_runner_api))
apache_beam/pipeline.py:573: in run
    return self.runner.run_pipeline(self, self._options)
apache_beam/runners/portability/portable_runner.py:438: in run_pipeline
    job_service_handle = self.create_job_service(options)
apache_beam/runners/portability/portable_runner.py:317: in create_job_service
    return self.create_job_service_handle(server.start(), options)
apache_beam/runners/portability/job_server.py:54: in start
    grpc.channel_ready_future(channel).result(timeout=self._timeout)
../../build/gradleenv/1922375555/lib/python3.6/site-packages/grpc/_utilities.py:139: in result
    self._block(timeout)
_ _ _ _ _ _ _ _ _ _ _ _ _ _ _ _ _ _ _ _ _ _ _ _ _ _ _ _ _ _ _ _ _ _ _ _ _ _ _ _ 

self = <grpc._utilities._ChannelReadyFuture object at 0x7f0f744b7080>
timeout = 60

    def _block(self, timeout):
        until = None if timeout is None else time.time() + timeout
        with self._condition:
            while True:
                if self._cancelled:
                    raise grpc.FutureCancelledError()
                elif self._matured:
                    return
                else:
                    if until is None:
                        self._condition.wait()
                    else:
                        remaining = until - time.time()
                        if remaining < 0:
>                           raise grpc.FutureTimeoutError()
E                           grpc.FutureTimeoutError

../../build/gradleenv/1922375555/lib/python3.6/site-packages/grpc/_utilities.py:85: FutureTimeoutError
----------------------------- Captured stderr call -----------------------------
WARNING:root:Make sure that locally built Python SDK docker image has Python 3.6 interpreter.
WARNING:root:Make sure that locally built Python SDK docker image has Python 3.6 interpreter.
------------------------------ Captured log call -------------------------------
WARNING  root:environments.py:374 Make sure that locally built Python SDK docker image has Python 3.6 interpreter.
WARNING  root:environments.py:374 Make sure that locally built Python SDK docker image has Python 3.6 interpreter.
_________________ SqlTransformTest.test_zetasql_generate_data __________________

self = <apache_beam.transforms.sql_test.SqlTransformTest testMethod=test_zetasql_generate_data>

    def test_zetasql_generate_data(self):
      with TestPipeline() as p:
        out = p | SqlTransform(
            """SELECT
              CAST(1 AS INT64) AS `int`,
              CAST('foo' AS STRING) AS `str`,
              CAST(3.14  AS FLOAT64) AS `flt`""",
            dialect="zetasql")
>       assert_that(out, equal_to([(1, "foo", 3.14)]))

apache_beam/transforms/sql_test.py:160: 
_ _ _ _ _ _ _ _ _ _ _ _ _ _ _ _ _ _ _ _ _ _ _ _ _ _ _ _ _ _ _ _ _ _ _ _ _ _ _ _ 
apache_beam/pipeline.py:596: in __exit__
    self.result = self.run()
apache_beam/testing/test_pipeline.py:114: in run
    False if self.not_use_test_runner_api else test_runner_api))
apache_beam/pipeline.py:573: in run
    return self.runner.run_pipeline(self, self._options)
apache_beam/runners/portability/portable_runner.py:438: in run_pipeline
    job_service_handle = self.create_job_service(options)
apache_beam/runners/portability/portable_runner.py:317: in create_job_service
    return self.create_job_service_handle(server.start(), options)
apache_beam/runners/portability/job_server.py:54: in start
    grpc.channel_ready_future(channel).result(timeout=self._timeout)
../../build/gradleenv/1922375555/lib/python3.6/site-packages/grpc/_utilities.py:139: in result
    self._block(timeout)
_ _ _ _ _ _ _ _ _ _ _ _ _ _ _ _ _ _ _ _ _ _ _ _ _ _ _ _ _ _ _ _ _ _ _ _ _ _ _ _ 

self = <grpc._utilities._ChannelReadyFuture object at 0x7f0f7599e748>
timeout = 60

    def _block(self, timeout):
        until = None if timeout is None else time.time() + timeout
        with self._condition:
            while True:
                if self._cancelled:
                    raise grpc.FutureCancelledError()
                elif self._matured:
                    return
                else:
                    if until is None:
                        self._condition.wait()
                    else:
                        remaining = until - time.time()
                        if remaining < 0:
>                           raise grpc.FutureTimeoutError()
E                           grpc.FutureTimeoutError

../../build/gradleenv/1922375555/lib/python3.6/site-packages/grpc/_utilities.py:85: FutureTimeoutError
----------------------------- Captured stderr call -----------------------------
WARNING:root:Make sure that locally built Python SDK docker image has Python 3.6 interpreter.
WARNING:root:Make sure that locally built Python SDK docker image has Python 3.6 interpreter.
------------------------------ Captured log call -------------------------------
WARNING  root:environments.py:374 Make sure that locally built Python SDK docker image has Python 3.6 interpreter.
WARNING  root:environments.py:374 Make sure that locally built Python SDK docker image has Python 3.6 interpreter.
- generated xml file: <https://ci-beam.apache.org/job/beam_PostCommit_XVR_Samza/ws/src/sdks/python/pytest_xlangSqlValidateRunner.xml> -
============ 5 failed, 4 passed, 5098 deselected in 391.56 seconds =============
Exception in thread wait_until_finish_read:
Traceback (most recent call last):
  File "/usr/lib/python3.6/threading.py", line 916, in _bootstrap_inner
    self.run()
  File "/usr/lib/python3.6/threading.py", line 864, in run
    self._target(*self._args, **self._kwargs)
  File "<https://ci-beam.apache.org/job/beam_PostCommit_XVR_Samza/ws/src/sdks/python/apache_beam/runners/portability/portable_runner.py",> line 565, in read_messages
    for message in self._message_stream:
  File "<https://ci-beam.apache.org/job/beam_PostCommit_XVR_Samza/ws/src/build/gradleenv/1922375555/lib/python3.6/site-packages/grpc/_channel.py",> line 426, in __next__
    return self._next()
  File "<https://ci-beam.apache.org/job/beam_PostCommit_XVR_Samza/ws/src/build/gradleenv/1922375555/lib/python3.6/site-packages/grpc/_channel.py",> line 826, in _next
    raise self
grpc._channel._MultiThreadedRendezvous: <_MultiThreadedRendezvous of RPC that terminated with:
	status = StatusCode.UNAVAILABLE
	details = "Socket closed"
	debug_error_string = "{"created":"@1635467661.409876168","description":"Error received from peer ipv4:127.0.0.1:46183","file":"src/core/lib/surface/call.cc","file_line":1069,"grpc_message":"Socket closed","grpc_status":14}"
>


> Task :runners:samza:job-server:validatesCrossLanguageRunnerPythonUsingSql FAILED
> Task :runners:samza:job-server:validatesCrossLanguageRunnerCleanup
> Task :runners:samza:job-server:samzaJobServerCleanup

FAILURE: Build failed with an exception.

* What went wrong:
Execution failed for task ':runners:samza:job-server:validatesCrossLanguageRunnerPythonUsingSql'.
> Process 'command 'sh'' finished with non-zero exit value 1

* Try:
Run with --stacktrace option to get the stack trace. Run with --info or --debug option to get more log output. Run with --scan to get full insights.

* Get more help at https://help.gradle.org

Deprecated Gradle features were used in this build, making it incompatible with Gradle 7.0.
Use '--warning-mode all' to show the individual deprecation warnings.
See https://docs.gradle.org/6.9.1/userguide/command_line_interface.html#sec:command_line_warnings

BUILD FAILED in 36m 16s
212 actionable tasks: 157 executed, 48 from cache, 7 up-to-date

Publishing build scan...
https://gradle.com/s/y3cvrhsa4h6ic

Build step 'Invoke Gradle script' changed build result to FAILURE
Build step 'Invoke Gradle script' marked build as failure

---------------------------------------------------------------------
To unsubscribe, e-mail: builds-unsubscribe@beam.apache.org
For additional commands, e-mail: builds-help@beam.apache.org