You are viewing a plain text version of this content. The canonical link for it is here.
Posted to dev@atlas.apache.org by Apache Jenkins Server <je...@builds.apache.org> on 2018/05/17 06:42:52 UTC
Build failed in Jenkins: PreCommit-ATLAS-Build-Test
#418-master-0001-ATLAS-2697-V2-Notifications-Propagated-classificatio.patch
See <https://builds.apache.org/job/PreCommit-ATLAS-Build-Test/418/display/redirect?page=changes>
Changes:
[ssubramanian] ATLAS-2695: Entity deletion fails if a term was/is associated to it.
------------------------------------------
[...truncated 500.94 KB...]
[INFO] --- maven-jar-plugin:2.5:jar (default-jar) @ hive-bridge ---
[INFO] Building jar: <https://builds.apache.org/job/PreCommit-ATLAS-Build-Test/ws/addons/hive-bridge/target/hive-bridge-1.0.0-SNAPSHOT.jar>
[INFO]
[INFO] --- maven-site-plugin:3.7:attach-descriptor (attach-descriptor) @ hive-bridge ---
[INFO] Skipping because packaging 'jar' is not pom.
[INFO]
[INFO] >>> jetty-maven-plugin:9.3.14.v20161028:deploy-war (start-jetty) > validate @ hive-bridge >>>
[INFO]
[INFO] --- maven-enforcer-plugin:3.0.0-M1:enforce (enforce-versions) @ hive-bridge ---
[INFO]
[INFO] --- buildnumber-maven-plugin:1.4:create (default) @ hive-bridge ---
[INFO] Executing: /bin/sh -c cd '<https://builds.apache.org/job/PreCommit-ATLAS-Build-Test/ws/addons/hive-bridge'> && 'git' 'rev-parse' '--verify' 'HEAD'
[INFO] Working directory: <https://builds.apache.org/job/PreCommit-ATLAS-Build-Test/ws/addons/hive-bridge>
[INFO] Storing buildNumber: c2d927e0b1a5fb8203d6fea4ded653060cd8acf3 at timestamp: 1526539298171
[INFO] Storing buildScmBranch: master
[INFO]
[INFO] --- apache-rat-plugin:0.12:check (rat-check) @ hive-bridge ---
[INFO] Enabled default license matchers.
[INFO] Will parse SCM ignores for exclusions...
[INFO] Finished adding exclusions from SCM ignore files.
[INFO] 61 implicit excludes (use -debug for more details).
[INFO] Exclude: **/antlr4/**
[INFO] Exclude: **/dependency-reduced-pom.xml
[INFO] Exclude: **/javax.script.ScriptEngineFactory
[INFO] Exclude: .reviewboardrc
[INFO] Exclude: 3party-licenses/**
[INFO] Exclude: **/.cache
[INFO] Exclude: **/.cache-main
[INFO] Exclude: **/.cache-tests
[INFO] Exclude: **/.checkstyle
[INFO] Exclude: **/*.txt
[INFO] Exclude: **/*.json
[INFO] Exclude: .pc/**
[INFO] Exclude: debian/**
[INFO] Exclude: .svn/**
[INFO] Exclude: .git/**
[INFO] Exclude: .gitignore
[INFO] Exclude: **/.idea/**
[INFO] Exclude: **/*.twiki
[INFO] Exclude: **/*.iml
[INFO] Exclude: **/*.json
[INFO] Exclude: **/*.log
[INFO] Exclude: **/target/**
[INFO] Exclude: **/target*/**
[INFO] Exclude: **/build/**
[INFO] Exclude: **/*.patch
[INFO] Exclude: derby.log
[INFO] Exclude: **/logs/**
[INFO] Exclude: **/.classpath
[INFO] Exclude: **/.project
[INFO] Exclude: **/.settings/**
[INFO] Exclude: **/test-output/**
[INFO] Exclude: **/mock/**
[INFO] Exclude: **/data/**
[INFO] Exclude: **/maven-eclipse.xml
[INFO] Exclude: **/.externalToolBuilders/**
[INFO] Exclude: **/build.log
[INFO] Exclude: **/.bowerrc
[INFO] Exclude: *.json
[INFO] Exclude: **/overlays/**
[INFO] Exclude: dev-support/**
[INFO] Exclude: **/users-credentials.properties
[INFO] Exclude: **/public/css/animate.min.css
[INFO] Exclude: **/public/css/bootstrap-sidebar.css
[INFO] Exclude: **/public/js/external_lib/**
[INFO] Exclude: **/node_modules/**
[INFO] Exclude: **/public/js/libs/**
[INFO] Exclude: **/atlas.data/**
[INFO] Exclude: **/${sys:atlas.data}/**
[INFO] Exclude: **/policy-store.txt
[INFO] Exclude: **/*rebel*.xml
[INFO] Exclude: **/*rebel*.xml.bak
[INFO] Exclude: **/test/resources/**
[INFO] 22 resources included (use -debug for more details)
[INFO] Rat check: Summary over all files. Unapproved: 0, unknown: 0, generated: 0, approved: 22 licenses.
[INFO]
[INFO] --- maven-resources-plugin:2.7:copy-resources (copy-resources) @ hive-bridge ---
[INFO] Using 'UTF-8' encoding to copy filtered resources.
[INFO] Copying 14 resources
[INFO]
[INFO] --- maven-resources-plugin:2.7:copy-resources (copy-solr-resources) @ hive-bridge ---
[INFO] Using 'UTF-8' encoding to copy filtered resources.
[INFO] Copying 9 resources
[INFO]
[INFO] <<< jetty-maven-plugin:9.3.14.v20161028:deploy-war (start-jetty) < validate @ hive-bridge <<<
[INFO]
[INFO]
[INFO] --- jetty-maven-plugin:9.3.14.v20161028:deploy-war (start-jetty) @ hive-bridge ---
[INFO] Configuring Jetty for project: Apache Atlas Hive Bridge
[INFO] Context path = /
[INFO] Tmp directory = <https://builds.apache.org/job/PreCommit-ATLAS-Build-Test/ws/addons/hive-bridge/target/tmp>
[INFO] Web defaults = org/eclipse/jetty/webapp/webdefault.xml
[INFO] Web overrides = none
[INFO] jetty-9.3.14.v20161028
[INFO] Scanning elapsed time=6701ms
[INFO] No Spring WebApplicationInitializer types detected on classpath
[WARNING] Using @Deprecated Class org.springframework.web.util.Log4jConfigListener
[INFO] Set web app root system property: 'webapp.root' = [<https://builds.apache.org/job/PreCommit-ATLAS-Build-Test/ws/webapp/target/atlas-webapp-1.0.0-SNAPSHOT]>
log4j:WARN No such property [maxFileSize] in org.apache.log4j.PatternLayout.
log4j:WARN No such property [maxBackupIndex] in org.apache.log4j.PatternLayout.
log4j:WARN No such property [maxFileSize] in org.apache.log4j.PatternLayout.
log4j:WARN No such property [maxBackupIndex] in org.apache.log4j.PatternLayout.
log4j:WARN No such property [maxFileSize] in org.apache.log4j.PatternLayout.
[INFO] Initializing Spring root WebApplicationContext
[INFO] jetty-9.3.14.v20161028
[INFO] Started o.e.j.s.ServletContextHandler@782d49d2{/solr,null,AVAILABLE}
[INFO] Started ServerConnector@4255b735{HTTP/1.1,[http/1.1]}{0.0.0.0:34335}
[INFO] Started @1192015ms
May 17, 2018 6:42:20 AM com.sun.jersey.spi.spring.container.servlet.SpringServlet getContext
INFO: Using default applicationContext
May 17, 2018 6:42:20 AM com.sun.jersey.spi.spring.container.SpringComponentProviderFactory registerSpringBeans
INFO: Registering Spring bean, atlasJsonProvider, of type org.apache.atlas.web.util.AtlasJsonProvider as a provider class
May 17, 2018 6:42:20 AM com.sun.jersey.spi.spring.container.SpringComponentProviderFactory registerSpringBeans
INFO: Registering Spring bean, lineageREST, of type org.apache.atlas.web.rest.LineageREST as a root resource class
May 17, 2018 6:42:20 AM com.sun.jersey.spi.spring.container.SpringComponentProviderFactory registerSpringBeans
INFO: Registering Spring bean, glossaryREST, of type org.apache.atlas.web.rest.GlossaryREST as a root resource class
May 17, 2018 6:42:20 AM com.sun.jersey.spi.spring.container.SpringComponentProviderFactory registerSpringBeans
INFO: Registering Spring bean, entityREST, of type org.apache.atlas.web.rest.EntityREST as a root resource class
May 17, 2018 6:42:20 AM com.sun.jersey.spi.spring.container.SpringComponentProviderFactory registerSpringBeans
INFO: Registering Spring bean, typesREST, of type org.apache.atlas.web.rest.TypesREST as a root resource class
May 17, 2018 6:42:20 AM com.sun.jersey.spi.spring.container.SpringComponentProviderFactory registerSpringBeans
INFO: Registering Spring bean, discoveryREST, of type org.apache.atlas.web.rest.DiscoveryREST as a root resource class
May 17, 2018 6:42:20 AM com.sun.jersey.spi.spring.container.SpringComponentProviderFactory registerSpringBeans
INFO: Registering Spring bean, relationshipREST, of type org.apache.atlas.web.rest.RelationshipREST as a root resource class
May 17, 2018 6:42:20 AM com.sun.jersey.spi.spring.container.SpringComponentProviderFactory registerSpringBeans
INFO: Registering Spring bean, notFoundExceptionMapper, of type org.apache.atlas.web.errors.NotFoundExceptionMapper as a provider class
May 17, 2018 6:42:20 AM com.sun.jersey.spi.spring.container.SpringComponentProviderFactory registerSpringBeans
INFO: Registering Spring bean, allExceptionMapper, of type org.apache.atlas.web.errors.AllExceptionMapper as a provider class
May 17, 2018 6:42:20 AM com.sun.jersey.spi.spring.container.SpringComponentProviderFactory registerSpringBeans
INFO: Registering Spring bean, atlasBaseExceptionMapper, of type org.apache.atlas.web.errors.AtlasBaseExceptionMapper as a provider class
May 17, 2018 6:42:20 AM com.sun.jersey.spi.spring.container.SpringComponentProviderFactory registerSpringBeans
INFO: Registering Spring bean, metadataDiscoveryResource, of type org.apache.atlas.web.resources.MetadataDiscoveryResource as a root resource class
May 17, 2018 6:42:20 AM com.sun.jersey.spi.spring.container.SpringComponentProviderFactory registerSpringBeans
INFO: Registering Spring bean, adminResource, of type org.apache.atlas.web.resources.AdminResource as a root resource class
May 17, 2018 6:42:20 AM com.sun.jersey.spi.spring.container.SpringComponentProviderFactory registerSpringBeans
INFO: Registering Spring bean, typesResource, of type org.apache.atlas.web.resources.TypesResource as a root resource class
May 17, 2018 6:42:20 AM com.sun.jersey.spi.spring.container.SpringComponentProviderFactory registerSpringBeans
INFO: Registering Spring bean, dataSetLineageResource, of type org.apache.atlas.web.resources.DataSetLineageResource as a root resource class
May 17, 2018 6:42:20 AM com.sun.jersey.spi.spring.container.SpringComponentProviderFactory registerSpringBeans
INFO: Registering Spring bean, entityResource, of type org.apache.atlas.web.resources.EntityResource as a root resource class
May 17, 2018 6:42:20 AM com.sun.jersey.spi.spring.container.SpringComponentProviderFactory registerSpringBeans
INFO: Registering Spring bean, lineageResource, of type org.apache.atlas.web.resources.LineageResource as a root resource class
May 17, 2018 6:42:20 AM com.sun.jersey.server.impl.application.WebApplicationImpl _initiate
INFO: Initiating Jersey application, version 'Jersey: 1.19 02/11/2015 03:25 AM'
[INFO] Started o.e.j.m.p.JettyWebAppContext@76ef56af{/,file://<https://builds.apache.org/job/PreCommit-ATLAS-Build-Test/ws/webapp/target/atlas-webapp-1.0.0-SNAPSHOT/,AVAILABLE}{/home/jenkins/jenkins-slave/workspace/PreCommit-ATLAS-Build-Test/webapp/target/atlas-webapp-1.0.0-SNAPSHOT.war}>
[INFO] ------------------------------------------------------------------------
[INFO] Reactor Summary:
[INFO]
[INFO] Apache Atlas Server Build Tools .................... SUCCESS [ 0.713 s]
[INFO] apache-atlas ....................................... SUCCESS [ 3.448 s]
[INFO] Apache Atlas Test Utility Tools .................... SUCCESS [ 5.119 s]
[INFO] Open Connector Framework (OCF) ..................... SUCCESS [ 2.034 s]
[INFO] Open Metadata Repository Services (OMRS) ........... SUCCESS [ 5.865 s]
[INFO] Open Metadata and Governance (OMAG) Server APIs .... SUCCESS [ 0.986 s]
[INFO] Connected Asset Open Metadata Access Service (OMAS) SUCCESS [ 1.308 s]
[INFO] Asset Consumer Open Metadata Access Service (OMAS) . SUCCESS [ 1.044 s]
[INFO] Open Metadata and Governance (OMAG) Server ......... SUCCESS [ 1.305 s]
[INFO] Apache Atlas Integration ........................... SUCCESS [ 38.328 s]
[INFO] Apache Atlas Common ................................ SUCCESS [ 2.477 s]
[INFO] Apache Atlas Client ................................ SUCCESS [ 0.149 s]
[INFO] atlas-client-common ................................ SUCCESS [ 0.690 s]
[INFO] atlas-client-v1 .................................... SUCCESS [ 2.549 s]
[INFO] Apache Atlas Server API ............................ SUCCESS [ 0.757 s]
[INFO] Apache Atlas Notification .......................... SUCCESS [ 16.950 s]
[INFO] atlas-client-v2 .................................... SUCCESS [ 0.748 s]
[INFO] Apache Atlas Graph Database Projects ............... SUCCESS [ 0.089 s]
[INFO] Apache Atlas Graph Database API .................... SUCCESS [ 1.198 s]
[INFO] Graph Database Common Code ......................... SUCCESS [ 0.763 s]
[INFO] Apache Atlas JanusGraph DB Impl .................... SUCCESS [02:34 min]
[INFO] Apache Atlas Graph Database Implementation Dependencies SUCCESS [ 1.831 s]
[INFO] Shaded version of Apache hbase client .............. SUCCESS [ 7.849 s]
[INFO] Shaded version of Apache hbase server .............. SUCCESS [ 20.736 s]
[INFO] Apache Atlas Authorization ......................... SUCCESS [ 2.361 s]
[INFO] Apache Atlas Repository ............................ SUCCESS [03:03 min]
[INFO] Apache Atlas UI .................................... SUCCESS [01:48 min]
[INFO] Apache Atlas Web Application ....................... SUCCESS [09:36 min]
[INFO] Apache Atlas Documentation ......................... SUCCESS [ 3.299 s]
[INFO] Apache Atlas FileSystem Model ...................... SUCCESS [ 2.886 s]
[INFO] Apache Atlas Plugin Classloader .................... SUCCESS [ 1.765 s]
[INFO] Apache Atlas Hive Bridge Shim ...................... SUCCESS [ 1.054 s]
[INFO] Apache Atlas Hive Bridge ........................... FAILURE [01:09 min]
[INFO] Apache Atlas Falcon Bridge Shim .................... SKIPPED
[INFO] Apache Atlas Falcon Bridge ......................... SKIPPED
[INFO] Apache Atlas Sqoop Bridge Shim ..................... SKIPPED
[INFO] Apache Atlas Sqoop Bridge .......................... SKIPPED
[INFO] Apache Atlas Storm Bridge Shim ..................... SKIPPED
[INFO] Apache Atlas Storm Bridge .......................... SKIPPED
[INFO] Apache Atlas Hbase Bridge Shim ..................... SKIPPED
[INFO] Apache Atlas Hbase Bridge .......................... SKIPPED
[INFO] Apache Atlas Kafka Bridge .......................... SKIPPED
[INFO] Apache Atlas Distribution .......................... SKIPPED
[INFO] ------------------------------------------------------------------------
[INFO] BUILD FAILURE
[INFO] ------------------------------------------------------------------------
[INFO] Total time: 20:23 min
[INFO] Finished at: 2018-05-17T06:42:21Z
[INFO] Final Memory: 579M/2196M
[INFO] ------------------------------------------------------------------------
[ERROR] Failed to execute goal org.eclipse.jetty:jetty-maven-plugin:9.3.14.v20161028:deploy-war (start-jetty) on project hive-bridge: Failure: Address already in use -> [Help 1]
[ERROR]
[ERROR] To see the full stack trace of the errors, re-run Maven with the -e switch.
[ERROR] Re-run Maven using the -X switch to enable full debug logging.
[ERROR]
[ERROR] For more information about the errors and possible solutions, please read the following articles:
[ERROR] [Help 1] http://cwiki.apache.org/confluence/display/MAVEN/MojoExecutionException
[ERROR]
[ERROR] After correcting the problems, you can resume the build with the command
[ERROR] mvn <goals> -rf :hive-bridge
[INFO] Stopped ServerConnector@4255b735{HTTP/1.1,[http/1.1]}{0.0.0.0:0}
{color:red}-1 overall{color}.
{color:green}+1 @author{color}. The patch does not contain any @author tags.
Console output: https://builds.apache.org/job/PreCommit-ATLAS-Build-Test/418//console
This message is automatically generated.
======================================================================
======================================================================
Adding comment to Jira.
======================================================================
======================================================================
======================================================================
======================================================================
Finished build.
======================================================================
======================================================================
+ EXIT_CODE=1
+ '[' -d <https://builds.apache.org/job/PreCommit-ATLAS-Build-Test/ws/../atlas_patchprocess_10121> ']'
+ '[' -d <https://builds.apache.org/job/PreCommit-ATLAS-Build-Test/ws/atlas_patchprocess_10121> ']'
+ mv <https://builds.apache.org/job/PreCommit-ATLAS-Build-Test/ws/atlas_patchprocess_10121> <https://builds.apache.org/job/PreCommit-ATLAS-Build-Test/ws/patchprocess>
+ rm -f <https://builds.apache.org/job/PreCommit-ATLAS-Build-Test/ws/../atlas_patchprocess_10121>
+ exit 1
Build step 'Execute shell' marked build as failure
Set build name.
New build name is '#418-master-0001-ATLAS-2697-V2-Notifications-Propagated-classificatio.patch'
Archiving artifacts
[Fast Archiver] Compressed 165.73 MB of artifacts by 84.4% relative to #417
Jenkins build is back to normal : PreCommit-ATLAS-Build-Test
#419-branch-1.0-0001-ATLAS-2697-V2-Notifications-Propagated-classificatio.patch
Posted by Apache Jenkins Server <je...@builds.apache.org>.
See <https://builds.apache.org/job/PreCommit-ATLAS-Build-Test/419/display/redirect>