You are viewing a plain text version of this content. The canonical link for it is here.
Posted to builds@beam.apache.org by Apache Jenkins Server <je...@builds.apache.org> on 2023/09/06 17:29:10 UTC
Build failed in Jenkins: beam_PostCommit_Java_VR_Dataflow_V2 #4060
See <https://ci-beam.apache.org/job/beam_PostCommit_Java_VR_Dataflow_V2/4060/display/redirect?page=changes>
Changes:
[noreply] Fix Java 11 Example PreCommit GItHub Action (#28291)
------------------------------------------
[...truncated 63.61 KB...]
> Task :runners:google-cloud-dataflow-java:testJar
> Task :sdks:java:container:pullLicenses
INFO:root:pull_licenses_java.py succeed. It took 1.80274 seconds with 16 threads.
Copying licenses from <https://ci-beam.apache.org/job/beam_PostCommit_Java_VR_Dataflow_V2/ws/src/sdks/java/container/build/target/java_third_party_licenses> to <https://ci-beam.apache.org/job/beam_PostCommit_Java_VR_Dataflow_V2/ws/src/sdks/java/container/build/target/third_party_licenses.>
Finished license_scripts.sh
> Task :sdks:java:container:java8:copyJavaThirdPartyLicenses
> Task :sdks:java:container:downloadCloudProfilerAgent
% Total % Received % Xferd Average Speed Time Time Time Current
Dload Upload Total Spent Left Speed
0 0 0 0 0 0 0 0 --:--:-- --:--:-- --:--:-- 0version.txt
NOTICES
profiler_java_agent.so
70 4183k 70 2950k 0 0 9643k 0 --:--:-- --:--:-- --:--:-- 9611k100 4183k 100 4183k 0 0 8806k 0 --:--:-- --:--:-- --:--:-- 8788k
> Task :sdks:java:container:goPrepare UP-TO-DATE
> Task :release:go-licenses:java:dockerRun
+ rm -rf '/output/*'
+ go get github.com/apache/beam/sdks/v2/java/container
go: downloading github.com/apache/beam/sdks/v2 v2.50.0
go: downloading github.com/apache/beam v2.50.0+incompatible
> Task :sdks:java:container:goBuild
/home/jenkins/go/bin/go1.21.0 build -o ./build/target/linux_amd64/boot boot.go boot_test.go pathingjar.go pathingjar_test.go
> Task :release:go-licenses:java:dockerRun
go: downloading github.com/golang/protobuf v1.5.3
go: downloading google.golang.org/grpc v1.57.0
go: downloading google.golang.org/protobuf v1.31.0
go: downloading golang.org/x/sys v0.11.0
> Task :sdks:java:container:java8:copySdkHarnessLauncher
Execution optimizations have been disabled for task ':sdks:java:container:java8:copySdkHarnessLauncher' to ensure correctness due to the following reasons:
- Gradle detected a problem with the following location: '<https://ci-beam.apache.org/job/beam_PostCommit_Java_VR_Dataflow_V2/ws/src/sdks/java/container/build/target'.> Reason: Task ':sdks:java:container:java8:copySdkHarnessLauncher' uses this output of task ':sdks:java:container:pullLicenses' without declaring an explicit or implicit dependency. This can lead to incorrect results being produced, depending on what order the tasks are executed. Please refer to https://docs.gradle.org/7.6.2/userguide/validation_problems.html#implicit_dependency for more details about this problem.
> Task :release:go-licenses:java:dockerRun
go: downloading golang.org/x/net v0.14.0
go: downloading google.golang.org/genproto/googleapis/rpc v0.0.0-20230726155614-23370e0ffb3e
go: downloading google.golang.org/genproto v0.0.0-20230706204954-ccb25ca9f130
go: downloading golang.org/x/text v0.12.0
go: added github.com/apache/beam/sdks/v2 v2.50.0
go: added github.com/golang/protobuf v1.5.3
go: added golang.org/x/net v0.14.0
go: added golang.org/x/sys v0.11.0
go: added golang.org/x/text v0.12.0
go: added google.golang.org/genproto/googleapis/rpc v0.0.0-20230726155614-23370e0ffb3e
go: added google.golang.org/grpc v1.57.0
go: added google.golang.org/protobuf v1.31.0
+ go-licenses save github.com/apache/beam/sdks/v2/java/container --save_path=/output/licenses
W0906 17:27:05.720938 37 library.go:101] "golang.org/x/sys/unix" contains non-Go code that can't be inspected for further dependencies:
/go/pkg/mod/golang.org/x/sys@v0.11.0/unix/asm_linux_amd64.s
+ go-licenses csv github.com/apache/beam/sdks/v2/java/container
+ tee /output/licenses/list.csv
W0906 17:27:11.853346 81 library.go:101] "golang.org/x/sys/unix" contains non-Go code that can't be inspected for further dependencies:
/go/pkg/mod/golang.org/x/sys@v0.11.0/unix/asm_linux_amd64.s
github.com/apache/beam/sdks/v2/go,https://github.com/apache/beam/blob/sdks/v2.50.0/sdks/go/README.md,Apache-2.0
github.com/apache/beam/sdks/v2/java/container,https://github.com/apache/beam/blob/sdks/v2.50.0/sdks/LICENSE,Apache-2.0
github.com/golang/protobuf,https://github.com/golang/protobuf/blob/v1.5.3/LICENSE,BSD-3-Clause
golang.org/x/net,https://cs.opensource.google/go/x/net/+/v0.14.0:LICENSE,BSD-3-Clause
golang.org/x/sys/unix,https://cs.opensource.google/go/x/sys/+/v0.11.0:LICENSE,BSD-3-Clause
golang.org/x/text,https://cs.opensource.google/go/x/text/+/v0.12.0:LICENSE,BSD-3-Clause
google.golang.org/genproto/googleapis/rpc/status,https://github.com/googleapis/go-genproto/blob/23370e0ffb3e/googleapis/rpc/LICENSE,Apache-2.0
google.golang.org/grpc,https://github.com/grpc/grpc-go/blob/v1.57.0/LICENSE,Apache-2.0
google.golang.org/protobuf,https://github.com/protocolbuffers/protobuf-go/blob/v1.31.0/LICENSE,BSD-3-Clause
+ chmod -R a+w /output/licenses
> Task :release:go-licenses:java:createLicenses
> Task :sdks:java:container:java8:copyGolangLicenses
> Task :sdks:java:container:java8:dockerPrepare
> Task :sdks:java:container:java8:docker
#1 [internal] load build definition from Dockerfile
#1 transferring dockerfile: 2.58kB done
#1 DONE 0.0s
#2 [internal] load .dockerignore
#2 transferring context: 2B done
#2 DONE 0.0s
#3 [internal] load metadata for docker.io/library/eclipse-temurin:8
#3 DONE 0.3s
#4 [ 1/16] FROM docker.io/library/eclipse-temurin:8@sha256:a239363b3c5f06ce52fd2cfd50c6d092c33400ba827842e49f206c72e5a7b287
#4 CACHED
#5 [internal] load build context
#5 transferring context: 47.19MB 0.5s done
#5 DONE 0.5s
#6 [ 2/16] ADD target/slf4j-api.jar /opt/apache/beam/jars/
#6 DONE 3.8s
#7 [ 3/16] ADD target/slf4j-jdk14.jar /opt/apache/beam/jars/
#7 DONE 0.1s
#8 [ 4/16] ADD target/jcl-over-slf4j.jar /opt/apache/beam/jars/
#8 DONE 0.1s
#9 [ 5/16] ADD target/log4j-over-slf4j.jar /opt/apache/beam/jars/
#9 DONE 0.1s
#10 [ 6/16] ADD target/log4j-to-slf4j.jar /opt/apache/beam/jars/
#10 DONE 0.1s
#11 [ 7/16] ADD target/beam-sdks-java-harness.jar /opt/apache/beam/jars/
#11 DONE 0.1s
#12 [ 8/16] COPY target/jamm.jar target/open-module-agent*.jar /opt/apache/beam/jars/
#12 DONE 0.1s
#13 [ 9/16] COPY target/linux_amd64/boot /opt/apache/beam/
#13 DONE 0.3s
#14 [10/16] COPY target/LICENSE /opt/apache/beam/
#14 DONE 0.1s
#15 [11/16] COPY target/NOTICE /opt/apache/beam/
#15 DONE 0.2s
#16 [12/16] ADD target/third_party_licenses /opt/apache/beam/third_party_licenses/
#16 DONE 0.4s
#17 [13/16] COPY target/LICENSE target/options/* /opt/apache/beam/options/
#17 DONE 0.2s
#18 [14/16] COPY target/go-licenses/* /opt/apache/beam/third_party_licenses/golang/
#18 DONE 0.1s
#19 [15/16] RUN if [ "true" = "false" ] ; then rm -rf /opt/apache/beam/third_party_licenses ; fi
#19 DONE 0.5s
#20 [16/16] COPY target/profiler/* /opt/google_cloud_profiler/
#20 DONE 0.2s
#21 exporting to image
#21 exporting layers
#21 exporting layers 0.3s done
#21 writing image sha256:c6f7abc7a91005708b1e1b707f04fcdbf3019f55a2a9ccfda7d85e5b667e43a6 done
#21 naming to docker.io/apache/beam_java8_sdk:2.51.0.dev done
#21 DONE 0.3s
> Task :runners:google-cloud-dataflow-java:buildAndPushDockerJavaContainer
WARNING: `gcloud docker` will not be supported for Docker client versions above 18.03.
As an alternative, use `gcloud auth configure-docker` to configure `docker` to
use `gcloud` as a credential helper, then use `docker` as you would for non-GCR
registries, e.g. `docker pull gcr.io/project-id/my-image`. Add
`--verbosity=error` to silence this warning: `gcloud docker
--verbosity=error -- pull gcr.io/project-id/my-image`.
See: https://cloud.google.com/container-registry/docs/support/deprecation-notices#gcloud-docker
The push refers to repository [us.gcr.io/apache-beam-testing/java-postcommit-it/java]
8f8926ef2865: Preparing
5f70bf18a086: Preparing
4f80354b19cc: Preparing
f3372b5b8d7f: Preparing
87b6ff69dbc4: Preparing
2845d4b37b6f: Preparing
a5d6e139c845: Preparing
dd6b59710f30: Preparing
68f6a9b04fe0: Preparing
19140df07fa7: Preparing
49e0424bc1ba: Preparing
a0e05a226f77: Preparing
572a91f0f161: Preparing
6b58c4588f08: Preparing
2845d4b37b6f: Waiting
da04f1c7618f: Preparing
cc64ed2782c8: Preparing
75d91765f4e2: Preparing
a5d6e139c845: Waiting
a31fc5e5e9a2: Preparing
2f3ff0b4cbda: Preparing
dd6b59710f30: Waiting
dc0585a4b8b7: Preparing
68f6a9b04fe0: Waiting
49e0424bc1ba: Waiting
da04f1c7618f: Waiting
a0e05a226f77: Waiting
cc64ed2782c8: Waiting
75d91765f4e2: Waiting
572a91f0f161: Waiting
a31fc5e5e9a2: Waiting
6b58c4588f08: Waiting
2f3ff0b4cbda: Waiting
dc0585a4b8b7: Waiting
5f70bf18a086: Layer already exists
f3372b5b8d7f: Pushed
4f80354b19cc: Pushed
2845d4b37b6f: Pushed
87b6ff69dbc4: Pushed
a5d6e139c845: Pushed
68f6a9b04fe0: Pushed
dd6b59710f30: Pushed
19140df07fa7: Pushed
49e0424bc1ba: Pushed
a0e05a226f77: Pushed
8f8926ef2865: Pushed
cc64ed2782c8: Layer already exists
75d91765f4e2: Layer already exists
a31fc5e5e9a2: Layer already exists
2f3ff0b4cbda: Layer already exists
dc0585a4b8b7: Layer already exists
572a91f0f161: Pushed
6b58c4588f08: Pushed
da04f1c7618f: Pushed
20230906172548: digest: sha256:47b58cd1279d013abb7f7c945e3efdbfe19b6cc43d9b397726dc11080804bcfc size: 4504
> Task :runners:google-cloud-dataflow-java:validatesRunnerV2Test
> Task :runners:google-cloud-dataflow-java:validatesRunnerV2Test FAILED
FAILURE: Build failed with an exception.
* What went wrong:
Execution failed for task ':runners:google-cloud-dataflow-java:validatesRunnerV2Test'.
> Failed to load cache entry 7a681b5918ab858f3631bb1cfc86fdd8 for task ':runners:google-cloud-dataflow-java:validatesRunnerV2Test': Could not load from local cache: Timeout waiting to lock Build cache (/home/jenkins/.gradle/caches/build-cache-1). It is currently in use by another Gradle instance.
Owner PID: 2331361
Our PID: 2333108
Owner Operation:
Our operation:
Lock file: /home/jenkins/.gradle/caches/build-cache-1/build-cache-1.lock
* Try:
> Run with --stacktrace option to get the stack trace.
> Run with --info or --debug option to get more log output.
* Get more help at https://help.gradle.org
Deprecated Gradle features were used in this build, making it incompatible with Gradle 8.0.
You can use '--warning-mode all' to show the individual deprecation warnings and determine if they come from your own scripts or plugins.
See https://docs.gradle.org/7.6.2/userguide/command_line_interface.html#sec:command_line_warnings
Execution optimizations have been disabled for 1 invalid unit(s) of work during this build to ensure correctness.
Please consult deprecation warnings for more details.
BUILD FAILED in 3m 59s
152 actionable tasks: 94 executed, 54 from cache, 4 up-to-date
Publishing build scan...
https://ge.apache.org/s/2a6qf6mszw2eg
Build step 'Invoke Gradle script' changed build result to FAILURE
Build step 'Invoke Gradle script' marked build as failure
---------------------------------------------------------------------
To unsubscribe, e-mail: builds-unsubscribe@beam.apache.org
For additional commands, e-mail: builds-help@beam.apache.org
Jenkins build is back to normal : beam_PostCommit_Java_VR_Dataflow_V2 #4061
Posted by Apache Jenkins Server <je...@builds.apache.org>.
See <https://ci-beam.apache.org/job/beam_PostCommit_Java_VR_Dataflow_V2/4061/display/redirect>
---------------------------------------------------------------------
To unsubscribe, e-mail: builds-unsubscribe@beam.apache.org
For additional commands, e-mail: builds-help@beam.apache.org