You are viewing a plain text version of this content. The canonical link for it is here.
Posted to notifications@maven.apache.org by Apache Jenkins Server <je...@builds.apache.org> on 2018/07/20 18:37:49 UTC

Build failed in Jenkins: Maven TLP » maven-help-plugin » master #40

See https://builds.apache.org/job/maven-box/job/maven-help-plugin/job/master/40/

Changes:

* Add jenkinsEnv#nodeSelection to globally finetune node selection
* Try another expression
* INFRA-16749, INFRA-16768  - Trying to keep workspace clean
* INFRA-16749, INFRA-16768  - Followup
* INFRA-16749, INFRA-16768  - Followup temporarily failFast = false.
* Used the wrong comment style.
* Exclude ubuntu-eu2 due to lack of disk space
* Apply jenkinsEnv.nodeSelection

All tests passed

Build log:
[...truncated 1.82 MB...]
[windows-jdk7]        	at org.apache.maven.plugins.help.EvaluateMojo.getEvaluator(EvaluateMojo.java:247)
[windows-jdk7]        	at org.apache.maven.plugins.help.EvaluateMojo.handleResponse(EvaluateMojo.java:283)
[windows-jdk7]        	at org.apache.maven.plugins.help.EvaluateMojo.execute(EvaluateMojo.java:214)
[windows-jdk7]        	at org.apache.maven.plugin.DefaultBuildPluginManager.executeMojo(DefaultBuildPluginManager.java:134)
[windows-jdk7]        	at org.apache.maven.lifecycle.internal.MojoExecutor.execute(MojoExecutor.java:208)
[windows-jdk7]        	at org.apache.maven.lifecycle.internal.MojoExecutor.execute(MojoExecutor.java:154)
[windows-jdk7]        	at org.apache.maven.lifecycle.internal.MojoExecutor.execute(MojoExecutor.java:146)
[windows-jdk7]        	at org.apache.maven.lifecycle.internal.LifecycleModuleBuilder.buildProject(LifecycleModuleBuilder.java:117)
[windows-jdk7]        	at org.apache.maven.lifecycle.internal.LifecycleModuleBuilder.buildProject(LifecycleModuleBuilder.java:81)
[windows-jdk7]        	at org.apache.maven.lifecycle.internal.builder.singlethreaded.SingleThreadedBuilder.build(SingleThreadedBuilder.java:51)
[windows-jdk7]        	at org.apache.maven.lifecycle.internal.LifecycleStarter.execute(LifecycleStarter.java:128)
[windows-jdk7]        	at org.apache.maven.DefaultMaven.doExecute(DefaultMaven.java:309)
[windows-jdk7]        	at org.apache.maven.DefaultMaven.doExecute(DefaultMaven.java:194)
[windows-jdk7]        	at org.apache.maven.DefaultMaven.execute(DefaultMaven.java:107)
[windows-jdk7]        	at org.apache.maven.cli.MavenCli.execute(MavenCli.java:993)
[windows-jdk7]        	at org.apache.maven.cli.MavenCli.doMain(MavenCli.java:345)
[windows-jdk7]        	at org.apache.maven.cli.MavenCli.main(MavenCli.java:191)
[windows-jdk7]        	at sun.reflect.NativeMethodAccessorImpl.invoke0(Native Method)
[windows-jdk7]        	at sun.reflect.NativeMethodAccessorImpl.invoke(NativeMethodAccessorImpl.java:57)
[windows-jdk7]        	at sun.reflect.DelegatingMethodAccessorImpl.invoke(DelegatingMethodAccessorImpl.java:43)
[windows-jdk7]        	at java.lang.reflect.Method.invoke(Method.java:606)
[windows-jdk7]        	at org.codehaus.plexus.classworlds.launcher.Launcher.launchEnhanced(Launcher.java:289)
[windows-jdk7]        	at org.codehaus.plexus.classworlds.launcher.Launcher.launch(Launcher.java:229)
[windows-jdk7]        	at org.codehaus.plexus.classworlds.launcher.Launcher.mainWithExitCode(Launcher.java:415)
[windows-jdk7]        	at org.codehaus.plexus.classworlds.launcher.Launcher.main(Launcher.java:356)
[windows-jdk7]        [DEBUG] Could not find metadata org.codehaus.mojo/maven-metadata.xml in local (F:\jenkins\jenkins-slave\workspace\ox_maven-help-plugin_master-U66QJWH3TRYC4M2J55DEV6AO7VQ2JW77H5GHKBUOBKZTW32WDTTA\m\target\local-repo)
[windows-jdk7]        [DEBUG] Skipped remote request for org.codehaus.mojo/maven-metadata.xml, already updated during this session.
[windows-jdk7]        [WARNING] Failure to transfer org.codehaus.mojo/maven-metadata.xml from https://repo.maven.apache.org/maven2 was cached in the local repository, resolution will not be reattempted until the update interval of central has elapsed or updates are forced. Original error: Could not transfer metadata org.codehaus.mojo/maven-metadata.xml from/to central (https://repo.maven.apache.org/maven2): Received fatal alert: protocol_version
[windows-jdk7]        org.eclipse.aether.transfer.MetadataTransferException: Failure to transfer org.codehaus.mojo/maven-metadata.xml from https://repo.maven.apache.org/maven2 was cached in the local repository, resolution will not be reattempted until the update interval of central has elapsed or updates are forced. Original error: Could not transfer metadata org.codehaus.mojo/maven-metadata.xml from/to central (https://repo.maven.apache.org/maven2): Received fatal alert: protocol_version
[windows-jdk7]        	at org.eclipse.aether.internal.impl.DefaultUpdateCheckManager.newException(DefaultUpdateCheckManager.java:372)
[windows-jdk7]        	at org.eclipse.aether.internal.impl.DefaultUpdateCheckManager.checkMetadata(DefaultUpdateCheckManager.java:329)
[windows-jdk7]        	at org.eclipse.aether.internal.impl.DefaultMetadataResolver.resolve(DefaultMetadataResolver.java:341)
[windows-jdk7]        	at org.eclipse.aether.internal.impl.DefaultMetadataResolver.resolveMetadata(DefaultMetadataResolver.java:214)
[windows-jdk7]        	at org.eclipse.aether.internal.impl.DefaultRepositorySystem.resolveMetadata(DefaultRepositorySystem.java:318)
[windows-jdk7]        	at org.apache.maven.plugin.prefix.internal.DefaultPluginPrefixResolver.resolveFromRepository(DefaultPluginPrefixResolver.java:202)
[windows-jdk7]        	at org.apache.maven.plugin.prefix.internal.DefaultPluginPrefixResolver.resolve(DefaultPluginPrefixResolver.java:89)
[windows-jdk7]        	at org.apache.maven.lifecycle.internal.MojoDescriptorCreator.findPluginForPrefix(MojoDescriptorCreator.java:266)
[windows-jdk7]        	at org.apache.maven.lifecycle.internal.MojoDescriptorCreator.getMojoDescriptor(MojoDescriptorCreator.java:220)
[windows-jdk7]        	at org.apache.maven.plugins.help.EvaluateMojo.getEvaluator(EvaluateMojo.java:247)
[windows-jdk7]        	at org.apache.maven.plugins.help.EvaluateMojo.handleResponse(EvaluateMojo.java:283)
[windows-jdk7]        	at org.apache.maven.plugins.help.EvaluateMojo.execute(EvaluateMojo.java:214)
[windows-jdk7]        	at org.apache.maven.plugin.DefaultBuildPluginManager.executeMojo(DefaultBuildPluginManager.java:134)
[windows-jdk7]        	at org.apache.maven.lifecycle.internal.MojoExecutor.execute(MojoExecutor.java:208)
[windows-jdk7]        	at org.apache.maven.lifecycle.internal.MojoExecutor.execute(MojoExecutor.java:154)
[windows-jdk7]        	at org.apache.maven.lifecycle.internal.MojoExecutor.execute(MojoExecutor.java:146)
[windows-jdk7]        	at org.apache.maven.lifecycle.internal.LifecycleModuleBuilder.buildProject(LifecycleModuleBuilder.java:117)
[windows-jdk7]        	at org.apache.maven.lifecycle.internal.LifecycleModuleBuilder.buildProject(LifecycleModuleBuilder.java:81)
[windows-jdk7]        	at org.apache.maven.lifecycle.internal.builder.singlethreaded.SingleThreadedBuilder.build(SingleThreadedBuilder.java:51)
[windows-jdk7]        	at org.apache.maven.lifecycle.internal.LifecycleStarter.execute(LifecycleStarter.java:128)
[windows-jdk7]        	at org.apache.maven.DefaultMaven.doExecute(DefaultMaven.java:309)
[windows-jdk7]        	at org.apache.maven.DefaultMaven.doExecute(DefaultMaven.java:194)
[windows-jdk7]        	at org.apache.maven.DefaultMaven.execute(DefaultMaven.java:107)
[windows-jdk7]        	at org.apache.maven.cli.MavenCli.execute(MavenCli.java:993)
[windows-jdk7]        	at org.apache.maven.cli.MavenCli.doMain(MavenCli.java:345)
[windows-jdk7]        	at org.apache.maven.cli.MavenCli.main(MavenCli.java:191)
[windows-jdk7]        	at sun.reflect.NativeMethodAccessorImpl.invoke0(Native Method)
[windows-jdk7]        	at sun.reflect.NativeMethodAccessorImpl.invoke(NativeMethodAccessorImpl.java:57)
[windows-jdk7]        	at sun.reflect.DelegatingMethodAccessorImpl.invoke(DelegatingMethodAccessorImpl.java:43)
[windows-jdk7]        	at java.lang.reflect.Method.invoke(Method.java:606)
[windows-jdk7]        	at org.codehaus.plexus.classworlds.launcher.Launcher.launchEnhanced(Launcher.java:289)
[windows-jdk7]        	at org.codehaus.plexus.classworlds.launcher.Launcher.launch(Launcher.java:229)
[windows-jdk7]        	at org.codehaus.plexus.classworlds.launcher.Launcher.mainWithExitCode(Launcher.java:415)
[windows-jdk7]        	at org.codehaus.plexus.classworlds.launcher.Launcher.main(Launcher.java:356)
[windows-jdk7]        [DEBUG] Using transporter WagonTransporter with priority -1.0 for file:///f:/jenkins/jenkins-slave/workspace/ox_maven-help-plugin_master-U66QJWH3TRYC4M2J55DEV6AO7VQ2JW77H5GHKBUOBKZTW32WDTTA/.repository
[windows-jdk7]        [DEBUG] Using connector BasicRepositoryConnector with priority 0.0 for file:///f:/jenkins/jenkins-slave/workspace/ox_maven-help-plugin_master-U66QJWH3TRYC4M2J55DEV6AO7VQ2JW77H5GHKBUOBKZTW32WDTTA/.repository
[windows-jdk7]        [INFO] Downloading: file:///f:/jenkins/jenkins-slave/workspace/ox_maven-help-plugin_master-U66QJWH3TRYC4M2J55DEV6AO7VQ2JW77H5GHKBUOBKZTW32WDTTA/.repository/org/apache/maven/plugins/maven-metadata.xml
[windows-jdk7]        [DEBUG] Writing tracking file F:\jenkins\jenkins-slave\workspace\ox_maven-help-plugin_master-U66QJWH3TRYC4M2J55DEV6AO7VQ2JW77H5GHKBUOBKZTW32WDTTA\m\target\local-repo\org\apache\maven\plugins\resolver-status.properties
[windows-jdk7]        [DEBUG] Using transporter WagonTransporter with priority -1.0 for file:///f:/jenkins/jenkins-slave/workspace/ox_maven-help-plugin_master-U66QJWH3TRYC4M2J55DEV6AO7VQ2JW77H5GHKBUOBKZTW32WDTTA/.repository
[windows-jdk7]        [DEBUG] Using connector BasicRepositoryConnector with priority 0.0 for file:///f:/jenkins/jenkins-slave/workspace/ox_maven-help-plugin_master-U66QJWH3TRYC4M2J55DEV6AO7VQ2JW77H5GHKBUOBKZTW32WDTTA/.repository
[windows-jdk7]        [INFO] Downloading: file:///f:/jenkins/jenkins-slave/workspace/ox_maven-help-plugin_master-U66QJWH3TRYC4M2J55DEV6AO7VQ2JW77H5GHKBUOBKZTW32WDTTA/.repository/org/codehaus/mojo/maven-metadata.xml
[windows-jdk7]        [DEBUG] Writing tracking file F:\jenkins\jenkins-slave\workspace\ox_maven-help-plugin_master-U66QJWH3TRYC4M2J55DEV6AO7VQ2JW77H5GHKBUOBKZTW32WDTTA\m\target\local-repo\org\codehaus\mojo\resolver-status.properties
[windows-jdk7]        [DEBUG] Could not find metadata org.apache.maven.plugins/maven-metadata.xml in local.central (file:///f:/jenkins/jenkins-slave/workspace/ox_maven-help-plugin_master-U66QJWH3TRYC4M2J55DEV6AO7VQ2JW77H5GHKBUOBKZTW32WDTTA/.repository)
[windows-jdk7]        [DEBUG] Could not find metadata org.codehaus.mojo/maven-metadata.xml in local.central (file:///f:/jenkins/jenkins-slave/workspace/ox_maven-help-plugin_master-U66QJWH3TRYC4M2J55DEV6AO7VQ2JW77H5GHKBUOBKZTW32WDTTA/.repository)
[windows-jdk7]        [INFO] ------------------------------------------------------------------------
[windows-jdk7]        [INFO] BUILD FAILURE
[windows-jdk7]        [INFO] ------------------------------------------------------------------------
[windows-jdk7]        [INFO] Total time: 2.629 s
[windows-jdk7]        [INFO] Finished at: 2018-07-20T18:37:21Z
[windows-jdk7]        [INFO] Final Memory: 16M/232M
[windows-jdk7]        [INFO] ------------------------------------------------------------------------
[windows-jdk7]        [ERROR] Failed to execute goal org.apache.maven.plugins:maven-help-plugin:3.1.1-SNAPSHOT:evaluate (default-cli) on project test: Failure while evaluating. No plugin found for prefix 'help' in the current project and in the plugin groups [org.apache.maven.plugins, org.codehaus.mojo] available from the repositories [local (F:\jenkins\jenkins-slave\workspace\ox_maven-help-plugin_master-U66QJWH3TRYC4M2J55DEV6AO7VQ2JW77H5GHKBUOBKZTW32WDTTA\m\target\local-repo), local.central (file:///f:/jenkins/jenkins-slave/workspace/ox_maven-help-plugin_master-U66QJWH3TRYC4M2J55DEV6AO7VQ2JW77H5GHKBUOBKZTW32WDTTA/.repository), central (https://repo.maven.apache.org/maven2)] -> [Help 1]
[windows-jdk7]        org.apache.maven.lifecycle.LifecycleExecutionException: Failed to execute goal org.apache.maven.plugins:maven-help-plugin:3.1.1-SNAPSHOT:evaluate (default-cli) on project test: Failure while evaluating.
[windows-jdk7]        	at org.apache.maven.lifecycle.internal.MojoExecutor.execute(MojoExecutor.java:213)
[windows-jdk7]        	at org.apache.maven.lifecycle.internal.MojoExecutor.execute(MojoExecutor.java:154)
[windows-jdk7]        	at org.apache.maven.lifecycle.internal.MojoExecutor.execute(MojoExecutor.java:146)
[windows-jdk7]        	at org.apache.maven.lifecycle.internal.LifecycleModuleBuilder.buildProject(LifecycleModuleBuilder.java:117)
[windows-jdk7]        	at org.apache.maven.lifecycle.internal.LifecycleModuleBuilder.buildProject(LifecycleModuleBuilder.java:81)
[windows-jdk7]        	at org.apache.maven.lifecycle.internal.builder.singlethreaded.SingleThreadedBuilder.build(SingleThreadedBuilder.java:51)
[windows-jdk7]        	at org.apache.maven.lifecycle.internal.LifecycleStarter.execute(LifecycleStarter.java:128)
[windows-jdk7]        	at org.apache.maven.DefaultMaven.doExecute(DefaultMaven.java:309)
[windows-jdk7]        	at org.apache.maven.DefaultMaven.doExecute(DefaultMaven.java:194)
[windows-jdk7]        	at org.apache.maven.DefaultMaven.execute(DefaultMaven.java:107)
[windows-jdk7]        	at org.apache.maven.cli.MavenCli.execute(MavenCli.java:993)
[windows-jdk7]        	at org.apache.maven.cli.MavenCli.doMain(MavenCli.java:345)
[windows-jdk7]        	at org.apache.maven.cli.MavenCli.main(MavenCli.java:191)
[windows-jdk7]        	at sun.reflect.NativeMethodAccessorImpl.invoke0(Native Method)
[windows-jdk7]        	at sun.reflect.NativeMethodAccessorImpl.invoke(NativeMethodAccessorImpl.java:57)
[windows-jdk7]        	at sun.reflect.DelegatingMethodAccessorImpl.invoke(DelegatingMethodAccessorImpl.java:43)
[windows-jdk7]        	at java.lang.reflect.Method.invoke(Method.java:606)
[windows-jdk7]        	at org.codehaus.plexus.classworlds.launcher.Launcher.launchEnhanced(Launcher.java:289)
[windows-jdk7]        	at org.codehaus.plexus.classworlds.launcher.Launcher.launch(Launcher.java:229)
[windows-jdk7]        	at org.codehaus.plexus.classworlds.launcher.Launcher.mainWithExitCode(Launcher.java:415)
[windows-jdk7]        	at org.codehaus.plexus.classworlds.launcher.Launcher.main(Launcher.java:356)
[windows-jdk7]        Caused by: org.apache.maven.plugin.MojoFailureException: Failure while evaluating.
[windows-jdk7]        	at org.apache.maven.plugins.help.EvaluateMojo.getEvaluator(EvaluateMojo.java:251)
[windows-jdk7]        	at org.apache.maven.plugins.help.EvaluateMojo.handleResponse(EvaluateMojo.java:283)
[windows-jdk7]        	at org.apache.maven.plugins.help.EvaluateMojo.execute(EvaluateMojo.java:214)
[windows-jdk7]        	at org.apache.maven.plugin.DefaultBuildPluginManager.executeMojo(DefaultBuildPluginManager.java:134)
[windows-jdk7]        	at org.apache.maven.lifecycle.internal.MojoExecutor.execute(MojoExecutor.java:208)
[windows-jdk7]        	... 20 more
[windows-jdk7]        Caused by: org.apache.maven.plugin.prefix.NoPluginFoundForPrefixException: No plugin found for prefix 'help' in the current project and in the plugin groups [org.apache.maven.plugins, org.codehaus.mojo] available from the repositories [local (F:\jenkins\jenkins-slave\workspace\ox_maven-help-plugin_master-U66QJWH3TRYC4M2J55DEV6AO7VQ2JW77H5GHKBUOBKZTW32WDTTA\m\target\local-repo), local.central (file:///f:/jenkins/jenkins-slave/workspace/ox_maven-help-plugin_master-U66QJWH3TRYC4M2J55DEV6AO7VQ2JW77H5GHKBUOBKZTW32WDTTA/.repository), central (https://repo.maven.apache.org/maven2)]
[windows-jdk7]        	at org.apache.maven.plugin.prefix.internal.DefaultPluginPrefixResolver.resolve(DefaultPluginPrefixResolver.java:93)
[windows-jdk7]        	at org.apache.maven.lifecycle.internal.MojoDescriptorCreator.findPluginForPrefix(MojoDescriptorCreator.java:266)
[windows-jdk7]        	at org.apache.maven.lifecycle.internal.MojoDescriptorCreator.getMojoDescriptor(MojoDescriptorCreator.java:220)
[windows-jdk7]        	at org.apache.maven.plugins.help.EvaluateMojo.getEvaluator(EvaluateMojo.java:247)
[windows-jdk7]        	... 24 more
[windows-jdk7]        [ERROR] 
[windows-jdk7]        [ERROR] 
[windows-jdk7]        [ERROR] For more information about the errors and possible solutions, please read the following articles:
[windows-jdk7]        [ERROR] [Help 1] http://cwiki.apache.org/confluence/display/MAVEN/MojoFailureException
[windows-jdk7]        Picked up JAVA_TOOL_OPTIONS: -Dmaven.ext.class.path="f:\jenkins\jenkins-slave\workspace\ox_maven-help-plugin_master-U66QJWH3TRYC4M2J55DEV6AO7VQ2JW77H5GHKBUOBKZTW32WDTTA@tmp\withMavena3bdea1b\pipeline-maven-spy.jar" -Dorg.jenkinsci.plugins.pipeline.maven.reportsFolder="f:\jenkins\jenkins-slave\workspace\ox_maven-help-plugin_master-U66QJWH3TRYC4M2J55DEV6AO7VQ2JW77H5GHKBUOBKZTW32WDTTA@tmp\withMavena3bdea1b" 
[windows-jdk7]        Running post-build script: f:\jenkins\jenkins-slave\workspace\ox_maven-help-plugin_master-U66QJWH3TRYC4M2J55DEV6AO7VQ2JW77H5GHKBUOBKZTW32WDTTA\m\target\it\evaluate\verify.groovy
[windows-jdk7] [INFO] Building: evaluate-artifact-with-expression-with-output\pom.xml
[windows-jdk7] [INFO] run post-build script verify.groovy
[windows-jdk7] [INFO]           evaluate-artifact-with-expression-with-output\pom.xml FAILED (4.9 s)
[windows-jdk7] [INFO]   The post-build script did not succeed. f:\jenkins\jenkins-slave\workspace\ox_maven-help-plugin_master-U66QJWH3TRYC4M2J55DEV6AO7VQ2JW77H5GHKBUOBKZTW32WDTTA\m\target\it\evaluate-artifact-with-expression-with-output\result.txt (The system cannot find the file specified)
[windows-jdk7] [INFO] Building: evaluate-settings-servers\pom.xml
[windows-jdk7] [INFO] run post-build script verify.groovy
[windows-jdk7] [INFO]           evaluate-settings-servers\pom.xml ................ FAILED (5.7 s)
[windows-jdk7] [INFO]   The post-build script did not succeed. f:\jenkins\jenkins-slave\workspace\ox_maven-help-plugin_master-U66QJWH3TRYC4M2J55DEV6AO7VQ2JW77H5GHKBUOBKZTW32WDTTA\m\target\it\evaluate-settings-servers\result.txt (The system cannot find the file specified)
[windows-jdk7] [INFO] Building: evaluate-with-expression-with-output\pom.xml
[windows-jdk7] [INFO] run post-build script verify.groovy
[windows-jdk7] [INFO]           evaluate-with-expression-with-output\pom.xml ..... FAILED (5.3 s)
[windows-jdk7] [INFO]   The post-build script did not succeed. f:\jenkins\jenkins-slave\workspace\ox_maven-help-plugin_master-U66QJWH3TRYC4M2J55DEV6AO7VQ2JW77H5GHKBUOBKZTW32WDTTA\m\target\it\evaluate-with-expression-with-output\result.txt (The system cannot find the file specified)
[windows-jdk7] [INFO] Building: system\pom.xml
[windows-jdk7] [INFO]           system\pom.xml ................................... SUCCESS (4.1 s)
[windows-jdk7] [INFO] 
[windows-jdk7] [INFO] --- maven-checkstyle-plugin:3.0.0:check (checkstyle-check) @ maven-help-plugin ---
[windows-jdk7] [INFO] Downloading: https://repo.maven.apache.org/maven2/org/apache/maven/shared/maven-shared-resources/2/maven-shared-resources-2.pom
[windows-jdk7] [INFO] Downloaded: https://repo.maven.apache.org/maven2/org/apache/maven/shared/maven-shared-resources/2/maven-shared-resources-2.pom (3.0 kB at 328 kB/s)
[windows-jdk7] [INFO] Downloading: https://repo.maven.apache.org/maven2/org/codehaus/plexus/plexus-utils/3.0.10/plexus-utils-3.0.10.pom
[windows-jdk7] [INFO] Downloaded: https://repo.maven.apache.org/maven2/org/codehaus/plexus/plexus-utils/3.0.10/plexus-utils-3.0.10.pom (3.1 kB at 449 kB/s)
[windows-jdk7] [INFO] Downloading: https://repo.maven.apache.org/maven2/org/codehaus/plexus/plexus/3.3/plexus-3.3.pom
[windows-jdk7] [INFO] Downloaded: https://repo.maven.apache.org/maven2/org/codehaus/plexus/plexus/3.3/plexus-3.3.pom (20 kB at 2.8 MB/s)
[windows-jdk7] [INFO] Downloading: https://repo.maven.apache.org/maven2/org/apache/maven/doxia/doxia-integration-tools/1.6/doxia-integration-tools-1.6.pom
[windows-jdk7] [INFO] Downloaded: https://repo.maven.apache.org/maven2/org/apache/maven/doxia/doxia-integration-tools/1.6/doxia-integration-tools-1.6.pom (7.0 kB at 994 kB/s)
[windows-jdk7] [INFO] Downloading: https://repo.maven.apache.org/maven2/org/apache/maven/doxia/doxia-tools/3/doxia-tools-3.pom
[windows-jdk7] [INFO] Downloaded: https://repo.maven.apache.org/maven2/org/apache/maven/doxia/doxia-tools/3/doxia-tools-3.pom (9.9 kB at 1.2 MB/s)
[windows-jdk7] [INFO] Downloading: https://repo.maven.apache.org/maven2/org/codehaus/plexus/plexus-resources/1.1.0/plexus-resources-1.1.0.pom
[windows-jdk7] [INFO] Downloaded: https://repo.maven.apache.org/maven2/org/codehaus/plexus/plexus-resources/1.1.0/plexus-resources-1.1.0.pom (3.2 kB at 353 kB/s)
[windows-jdk7] [INFO] Downloading: https://repo.maven.apache.org/maven2/com/puppycrawl/tools/checkstyle/6.18/checkstyle-6.18.pom
[windows-jdk7] [INFO] Downloaded: https://repo.maven.apache.org/maven2/com/puppycrawl/tools/checkstyle/6.18/checkstyle-6.18.pom (71 kB at 5.5 MB/s)
[windows-jdk7] [INFO] Downloading: https://repo.maven.apache.org/maven2/antlr/antlr/2.7.7/antlr-2.7.7.pom
[windows-jdk7] [INFO] Downloaded: https://repo.maven.apache.org/maven2/antlr/antlr/2.7.7/antlr-2.7.7.pom (632 B at 79 kB/s)
[windows-jdk7] [INFO] Downloading: https://repo.maven.apache.org/maven2/org/antlr/antlr4-runtime/4.5.3/antlr4-runtime-4.5.3.pom
[windows-jdk7] [INFO] Downloaded: https://repo.maven.apache.org/maven2/org/antlr/antlr4-runtime/4.5.3/antlr4-runtime-4.5.3.pom (2.3 kB at 289 kB/s)
[windows-jdk7] [INFO] Downloading: https://repo.maven.apache.org/maven2/org/antlr/antlr4-master/4.5.3/antlr4-master-4.5.3.pom
[windows-jdk7] [INFO] Downloaded: https://repo.maven.apache.org/maven2/org/antlr/antlr4-master/4.5.3/antlr4-master-4.5.3.pom (3.7 kB at 409 kB/s)
[windows-jdk7] [INFO] Downloading: https://repo.maven.apache.org/maven2/commons-beanutils/commons-beanutils/1.9.2/commons-beanutils-1.9.2.pom
[windows-jdk7] [INFO] Downloaded: https://repo.maven.apache.org/maven2/commons-beanutils/commons-beanutils/1.9.2/commons-beanutils-1.9.2.pom (14 kB at 1.6 MB/s)
[windows-jdk7] [INFO] Downloading: https://repo.maven.apache.org/maven2/org/apache/commons/commons-parent/33/commons-parent-33.pom
[windows-jdk7] [INFO] Downloaded: https://repo.maven.apache.org/maven2/org/apache/commons/commons-parent/33/commons-parent-33.pom (53 kB at 4.8 MB/s)
[windows-jdk7] [INFO] Downloading: https://repo.maven.apache.org/maven2/commons-cli/commons-cli/1.3.1/commons-cli-1.3.1.pom
[windows-jdk7] [INFO] Downloaded: https://repo.maven.apache.org/maven2/commons-cli/commons-cli/1.3.1/commons-cli-1.3.1.pom (10 kB at 1.3 MB/s)
[windows-jdk7] [INFO] Downloading: https://repo.maven.apache.org/maven2/com/google/guava/guava/19.0/guava-19.0.pom
[windows-jdk7] [INFO] Downloaded: https://repo.maven.apache.org/maven2/com/google/guava/guava/19.0/guava-19.0.pom (6.8 kB at 485 kB/s)
[windows-jdk7] [INFO] Downloading: https://repo.maven.apache.org/maven2/com/google/guava/guava-parent/19.0/guava-parent-19.0.pom
[windows-jdk7] [INFO] Downloaded: https://repo.maven.apache.org/maven2/com/google/guava/guava-parent/19.0/guava-parent-19.0.pom (9.9 kB at 898 kB/s)
[windows-jdk7] [INFO] Downloading: https://repo.maven.apache.org/maven2/org/sonatype/oss/oss-parent/7/oss-parent-7.pom
[windows-jdk7] [INFO] Downloaded: https://repo.maven.apache.org/maven2/org/sonatype/oss/oss-parent/7/oss-parent-7.pom (4.8 kB at 689 kB/s)
[windows-jdk7] [INFO] Downloading: https://repo.maven.apache.org/maven2/org/apache/maven/shared/maven-shared-resources/2/maven-shared-resources-2.jar
[windows-jdk7] [INFO] Downloading: https://repo.maven.apache.org/maven2/org/apache/maven/doxia/doxia-core/1.2/doxia-core-1.2.jar
[windows-jdk7] [INFO] Downloading: https://repo.maven.apache.org/maven2/commons-digester/commons-digester/1.6/commons-digester-1.6.jar
[windows-jdk7] [INFO] Downloading: https://repo.maven.apache.org/maven2/commons-logging/commons-logging/1.0.4/commons-logging-1.0.4.jar
[windows-jdk7] [INFO] Downloading: https://repo.maven.apache.org/maven2/org/apache/maven/doxia/doxia-integration-tools/1.6/doxia-integration-tools-1.6.jar
[windows-jdk7] [INFO] Downloaded: https://repo.maven.apache.org/maven2/commons-logging/commons-logging/1.0.4/commons-logging-1.0.4.jar (38 kB at 2.4 MB/s)
[windows-jdk7] [INFO] Downloading: https://repo.maven.apache.org/maven2/commons-io/commons-io/1.4/commons-io-1.4.jar
[windows-jdk7] [INFO] Downloaded: https://repo.maven.apache.org/maven2/org/apache/maven/doxia/doxia-core/1.2/doxia-core-1.2.jar (154 kB at 8.6 MB/s)
[windows-jdk7] [INFO] Downloading: https://repo.maven.apache.org/maven2/org/codehaus/plexus/plexus-resources/1.1.0/plexus-resources-1.1.0.jar
[windows-jdk7] [INFO] Downloaded: https://repo.maven.apache.org/maven2/org/apache/maven/shared/maven-shared-resources/2/maven-shared-resources-2.jar (13 kB at 725 kB/s)
[windows-jdk7] [INFO] Downloading: https://repo.maven.apache.org/maven2/com/puppycrawl/tools/checkstyle/6.18/checkstyle-6.18.jar
[windows-jdk7] [INFO] Downloaded: https://repo.maven.apache.org/maven2/org/apache/maven/doxia/doxia-integration-tools/1.6/doxia-integration-tools-1.6.jar (45 kB at 2.3 MB/s)
[windows-jdk7] [INFO] Downloading: https://repo.maven.apache.org/maven2/antlr/antlr/2.7.7/antlr-2.7.7.jar
[windows-jdk7] [INFO] Downloaded: https://repo.maven.apache.org/maven2/commons-digester/commons-digester/1.6/commons-digester-1.6.jar (168 kB at 7.3 MB/s)
[windows-jdk7] [INFO] Downloading: https://repo.maven.apache.org/maven2/org/antlr/antlr4-runtime/4.5.3/antlr4-runtime-4.5.3.jar
[windows-jdk7] [INFO] Downloaded: https://repo.maven.apache.org/maven2/org/codehaus/plexus/plexus-resources/1.1.0/plexus-resources-1.1.0.jar (23 kB at 860 kB/s)
[windows-jdk7] [INFO] Downloading: https://repo.maven.apache.org/maven2/commons-beanutils/commons-beanutils/1.9.2/commons-beanutils-1.9.2.jar
[windows-jdk7] [INFO] Downloaded: https://repo.maven.apache.org/maven2/commons-io/commons-io/1.4/commons-io-1.4.jar (109 kB at 3.1 MB/s)
[windows-jdk7] [INFO] Downloading: https://repo.maven.apache.org/maven2/commons-cli/commons-cli/1.3.1/commons-cli-1.3.1.jar
[windows-jdk7] [INFO] Downloaded: https://repo.maven.apache.org/maven2/antlr/antlr/2.7.7/antlr-2.7.7.jar (445 kB at 10 MB/s)
[windows-jdk7] [INFO] Downloading: https://repo.maven.apache.org/maven2/com/google/guava/guava/19.0/guava-19.0.jar
[windows-jdk7] [INFO] Downloaded: https://repo.maven.apache.org/maven2/commons-cli/commons-cli/1.3.1/commons-cli-1.3.1.jar (53 kB at 1.2 MB/s)
[windows-jdk7] [INFO] Downloading: https://repo.maven.apache.org/maven2/commons-lang/commons-lang/2.1/commons-lang-2.1.jar
[windows-jdk7] [INFO] Downloaded: https://repo.maven.apache.org/maven2/commons-beanutils/commons-beanutils/1.9.2/commons-beanutils-1.9.2.jar (234 kB at 5.0 MB/s)
[windows-jdk7] [INFO] Downloaded: https://repo.maven.apache.org/maven2/org/antlr/antlr4-runtime/4.5.3/antlr4-runtime-4.5.3.jar (302 kB at 5.8 MB/s)
[windows-jdk7] [INFO] Downloaded: https://repo.maven.apache.org/maven2/com/puppycrawl/tools/checkstyle/6.18/checkstyle-6.18.jar (1.2 MB at 18 MB/s)
[windows-jdk7] [INFO] Downloaded: https://repo.maven.apache.org/maven2/commons-lang/commons-lang/2.1/commons-lang-2.1.jar (208 kB at 2.6 MB/s)
[windows-jdk7] [INFO] Downloaded: https://repo.maven.apache.org/maven2/com/google/guava/guava/19.0/guava-19.0.jar (2.3 MB at 19 MB/s)
[windows-jdk7] [INFO] 
[windows-jdk7] [INFO] --- maven-invoker-plugin:3.0.1:verify (integration-test) @ maven-help-plugin ---
[windows-jdk7] [INFO] -------------------------------------------------
[windows-jdk7] [INFO] Build Summary:
[windows-jdk7] [INFO]   Passed: 18, Failed: 11, Errors: 0, Skipped: 0
[windows-jdk7] [INFO] -------------------------------------------------
[windows-jdk7] [WARNING] The following builds failed:
[windows-jdk7] [WARNING] *  describe-cmd-with-goal-report\pom.xml
[windows-jdk7] [WARNING] *  describe-cmd-with-goal\pom.xml
[windows-jdk7] [WARNING] *  describe-gav\pom.xml
[windows-jdk7] [WARNING] *  describe-plugin-in-plugin-management\pom.xml
[windows-jdk7] [WARNING] *  describe-plugin-without-name\pom.xml
[windows-jdk7] [WARNING] *  describe-prefix-and-mojo\pom.xml
[windows-jdk7] [WARNING] *  describe-prefix\pom.xml
[windows-jdk7] [WARNING] *  evaluate-artifact-with-expression-with-output\pom.xml
[windows-jdk7] [WARNING] *  evaluate-settings-servers\pom.xml
[windows-jdk7] [WARNING] *  evaluate-with-expression-with-output\pom.xml
[windows-jdk7] [WARNING] *  evaluate\pom.xml
[windows-jdk7] [INFO] -------------------------------------------------
[windows-jdk7] [WARNING] Ignoring that 11 builds failed.
[windows-jdk7] [INFO] ------------------------------------------------------------------------
[windows-jdk7] [INFO] BUILD SUCCESS
[windows-jdk7] [INFO] ------------------------------------------------------------------------
[windows-jdk7] [INFO] Total time: 03:27 min
[windows-jdk7] [INFO] Finished at: 2018-07-20T18:37:44Z
[windows-jdk7] [INFO] Final Memory: 54M/605M
[windows-jdk7] [INFO] ------------------------------------------------------------------------
[windows-jdk7] [INFO] [jenkins-event-spy] Generated F:\jenkins\jenkins-slave\workspace\ox_maven-help-plugin_master-U66QJWH3TRYC4M2J55DEV6AO7VQ2JW77H5GHKBUOBKZTW32WDTTA@tmp\withMavena3bdea1b\maven-spy-20180720-183417-1018847629644145922355.log
[windows-jdk7] Picked up JAVA_TOOL_OPTIONS: -Dmaven.ext.class.path="f:\jenkins\jenkins-slave\workspace\ox_maven-help-plugin_master-U66QJWH3TRYC4M2J55DEV6AO7VQ2JW77H5GHKBUOBKZTW32WDTTA@tmp\withMavena3bdea1b\pipeline-maven-spy.jar" -Dorg.jenkinsci.plugins.pipeline.maven.reportsFolder="f:\jenkins\jenkins-slave\workspace\ox_maven-help-plugin_master-U66QJWH3TRYC4M2J55DEV6AO7VQ2JW77H5GHKBUOBKZTW32WDTTA@tmp\withMavena3bdea1b" 
[Pipeline] [windows-jdk7] }
[Pipeline] [windows-jdk7] // dir
[Pipeline] [windows-jdk7] }
[windows-jdk7] [withMaven] invokerPublisher - Archive invoker results for Maven artifact MavenArtifact{org.apache.maven.plugins:maven-help-plugin::3.1.1-SNAPSHOT(version: 3.1.1-SNAPSHOT, snapshot:false) } generated by PluginInvocation{org.apache.maven.plugins:maven-invoker-plugin:3.0.1@integration-test  integration-test}: m\target\invoker-reports\*.xml
[windows-jdk7] performing MavenInvokerRecorder, reportsFilenamePattern:'**/m\target\invoker-reports/BUILD*.xml', invokerBuildDir:'**/m\target\it'
[windows-jdk7] Found reports:[f:\jenkins\jenkins-slave\workspace\ox_maven-help-plugin_master-U66QJWH3TRYC4M2J55DEV6AO7VQ2JW77H5GHKBUOBKZTW32WDTTA\m\target\invoker-reports\BUILD-active-profiles.xml, f:\jenkins\jenkins-slave\workspace\ox_maven-help-plugin_master-U66QJWH3TRYC4M2J55DEV6AO7VQ2JW77H5GHKBUOBKZTW32WDTTA\m\target\invoker-reports\BUILD-active-profiles_multimodule.xml, f:\jenkins\jenkins-slave\workspace\ox_maven-help-plugin_master-U66QJWH3TRYC4M2J55DEV6AO7VQ2JW77H5GHKBUOBKZTW32WDTTA\m\target\invoker-reports\BUILD-all-profiles-parent-pom.xml, f:\jenkins\jenkins-slave\workspace\ox_maven-help-plugin_master-U66QJWH3TRYC4M2J55DEV6AO7VQ2JW77H5GHKBUOBKZTW32WDTTA\m\target\invoker-reports\BUILD-all-profiles.xml, f:\jenkins\jenkins-slave\workspace\ox_maven-help-plugin_master-U66QJWH3TRYC4M2J55DEV6AO7VQ2JW77H5GHKBUOBKZTW32WDTTA\m\target\invoker-reports\BUILD-describe-cmd-invalid.xml, f:\jenkins\jenkins-slave\workspace\ox_maven-help-plugin_master-U66QJWH3TRYC4M2J55DEV6AO7VQ2JW77H5GHKBUOBKZTW32WDTTA\m\target\invoker-reports\BUILD-describe-cmd-with-goal-invalid.xml, f:\jenkins\jenkins-slave\workspace\ox_maven-help-plugin_master-U66QJWH3TRYC4M2J55DEV6AO7VQ2JW77H5GHKBUOBKZTW32WDTTA\m\target\invoker-reports\BUILD-describe-cmd-with-goal-report.xml, f:\jenkins\jenkins-slave\workspace\ox_maven-help-plugin_master-U66QJWH3TRYC4M2J55DEV6AO7VQ2JW77H5GHKBUOBKZTW32WDTTA\m\target\invoker-reports\BUILD-describe-cmd-with-goal.xml, f:\jenkins\jenkins-slave\workspace\ox_maven-help-plugin_master-U66QJWH3TRYC4M2J55DEV6AO7VQ2JW77H5GHKBUOBKZTW32WDTTA\m\target\invoker-reports\BUILD-describe-cmd.xml, f:\jenkins\jenkins-slave\workspace\ox_maven-help-plugin_master-U66QJWH3TRYC4M2J55DEV6AO7VQ2JW77H5GHKBUOBKZTW32WDTTA\m\target\invoker-reports\BUILD-describe-ga.xml, f:\jenkins\jenkins-slave\workspace\ox_maven-help-plugin_master-U66QJWH3TRYC4M2J55DEV6AO7VQ2JW77H5GHKBUOBKZTW32WDTTA\m\target\invoker-reports\BUILD-describe-gav.xml, f:\jenkins\jenkins-slave\workspace\ox_maven-help-plugin_master-U66QJWH3TRYC4M2J55DEV6AO7VQ2JW77H5GHKBUOBKZTW32WDTTA\m\target\invoker-reports\BUILD-describe-plugin-in-plugin-management.xml, f:\jenkins\jenkins-slave\workspace\ox_maven-help-plugin_master-U66QJWH3TRYC4M2J55DEV6AO7VQ2JW77H5GHKBUOBKZTW32WDTTA\m\target\invoker-reports\BUILD-describe-plugin-without-name.xml, f:\jenkins\jenkins-slave\workspace\ox_maven-help-plugin_master-U66QJWH3TRYC4M2J55DEV6AO7VQ2JW77H5GHKBUOBKZTW32WDTTA\m\target\invoker-reports\BUILD-describe-prefix-and-invalid-mojo.xml, f:\jenkins\jenkins-slave\workspace\ox_maven-help-plugin_master-U66QJWH3TRYC4M2J55DEV6AO7VQ2JW77H5GHKBUOBKZTW32WDTTA\m\target\invoker-reports\BUILD-describe-prefix-and-mojo.xml, f:\jenkins\jenkins-slave\workspace\ox_maven-help-plugin_master-U66QJWH3TRYC4M2J55DEV6AO7VQ2JW77H5GHKBUOBKZTW32WDTTA\m\target\invoker-reports\BUILD-describe-prefix.xml, f:\jenkins\jenkins-slave\workspace\ox_maven-help-plugin_master-U66QJWH3TRYC4M2J55DEV6AO7VQ2JW77H5GHKBUOBKZTW32WDTTA\m\target\invoker-reports\BUILD-effective-pom-artifact.xml, f:\jenkins\jenkins-slave\workspace\ox_maven-help-plugin_master-U66QJWH3TRYC4M2J55DEV6AO7VQ2JW77H5GHKBUOBKZTW32WDTTA\m\target\invoker-reports\BUILD-effective-pom-from-lifecycle.xml, f:\jenkins\jenkins-slave\workspace\ox_maven-help-plugin_master-U66QJWH3TRYC4M2J55DEV6AO7VQ2JW77H5GHKBUOBKZTW32WDTTA\m\target\invoker-reports\BUILD-effective-pom-multimodule-unlink-parent.xml, f:\jenkins\jenkins-slave\workspace\ox_maven-help-plugin_master-U66QJWH3TRYC4M2J55DEV6AO7VQ2JW77H5GHKBUOBKZTW32WDTTA\m\target\invoker-reports\BUILD-effective-pom-multimodule.xml, f:\jenkins\jenkins-slave\workspace\ox_maven-help-plugin_master-U66QJWH3TRYC4M2J55DEV6AO7VQ2JW77H5GHKBUOBKZTW32WDTTA\m\target\invoker-reports\BUILD-effective-pom.xml, f:\jenkins\jenkins-slave\workspace\ox_maven-help-plugin_master-U66QJWH3TRYC4M2J55DEV6AO7VQ2JW77H5GHKBUOBKZTW32WDTTA\m\target\invoker-reports\BUILD-effective-pom_properties.xml, f:\jenkins\jenkins-slave\workspace\ox_maven-help-plugin_master-U66QJWH3TRYC4M2J55DEV6AO7VQ2JW77H5GHKBUOBKZTW32WDTTA\m\target\invoker-reports\BUILD-effective-settings.xml, f:\jenkins\jenkins-slave\workspace\ox_maven-help-plugin_master-U66QJWH3TRYC4M2J55DEV6AO7VQ2JW77H5GHKBUOBKZTW32WDTTA\m\target\invoker-reports\BUILD-effective-settings_deep-clone.xml, f:\jenkins\jenkins-slave\workspace\ox_maven-help-plugin_master-U66QJWH3TRYC4M2J55DEV6AO7VQ2JW77H5GHKBUOBKZTW32WDTTA\m\target\invoker-reports\BUILD-evaluate-artifact-with-expression-with-output.xml, f:\jenkins\jenkins-slave\workspace\ox_maven-help-plugin_master-U66QJWH3TRYC4M2J55DEV6AO7VQ2JW77H5GHKBUOBKZTW32WDTTA\m\target\invoker-reports\BUILD-evaluate-settings-servers.xml, f:\jenkins\jenkins-slave\workspace\ox_maven-help-plugin_master-U66QJWH3TRYC4M2J55DEV6AO7VQ2JW77H5GHKBUOBKZTW32WDTTA\m\target\invoker-reports\BUILD-evaluate-with-expression-with-output.xml, f:\jenkins\jenkins-slave\workspace\ox_maven-help-plugin_master-U66QJWH3TRYC4M2J55DEV6AO7VQ2JW77H5GHKBUOBKZTW32WDTTA\m\target\invoker-reports\BUILD-evaluate.xml, f:\jenkins\jenkins-slave\workspace\ox_maven-help-plugin_master-U66QJWH3TRYC4M2J55DEV6AO7VQ2JW77H5GHKBUOBKZTW32WDTTA\m\target\invoker-reports\BUILD-system.xml]
[windows-jdk7] Found logs:[f:\jenkins\jenkins-slave\workspace\ox_maven-help-plugin_master-U66QJWH3TRYC4M2J55DEV6AO7VQ2JW77H5GHKBUOBKZTW32WDTTA\m\target\it\active-profiles\build.log, f:\jenkins\jenkins-slave\workspace\ox_maven-help-plugin_master-U66QJWH3TRYC4M2J55DEV6AO7VQ2JW77H5GHKBUOBKZTW32WDTTA\m\target\it\active-profiles_multimodule\build.log, f:\jenkins\jenkins-slave\workspace\ox_maven-help-plugin_master-U66QJWH3TRYC4M2J55DEV6AO7VQ2JW77H5GHKBUOBKZTW32WDTTA\m\target\it\all-profiles-parent-pom\build.log, f:\jenkins\jenkins-slave\workspace\ox_maven-help-plugin_master-U66QJWH3TRYC4M2J55DEV6AO7VQ2JW77H5GHKBUOBKZTW32WDTTA\m\target\it\all-profiles\build.log, f:\jenkins\jenkins-slave\workspace\ox_maven-help-plugin_master-U66QJWH3TRYC4M2J55DEV6AO7VQ2JW77H5GHKBUOBKZTW32WDTTA\m\target\it\describe-cmd-invalid\build.log, f:\jenkins\jenkins-slave\workspace\ox_maven-help-plugin_master-U66QJWH3TRYC4M2J55DEV6AO7VQ2JW77H5GHKBUOBKZTW32WDTTA\m\target\it\describe-cmd-with-goal-invalid\build.log, f:\jenkins\jenkins-slave\workspace\ox_maven-help-plugin_master-U66QJWH3TRYC4M2J55DEV6AO7VQ2JW77H5GHKBUOBKZTW32WDTTA\m\target\it\describe-cmd-with-goal-report\build.log, f:\jenkins\jenkins-slave\workspace\ox_maven-help-plugin_master-U66QJWH3TRYC4M2J55DEV6AO7VQ2JW77H5GHKBUOBKZTW32WDTTA\m\target\it\describe-cmd-with-goal\build.log, f:\jenkins\jenkins-slave\workspace\ox_maven-help-plugin_master-U66QJWH3TRYC4M2J55DEV6AO7VQ2JW77H5GHKBUOBKZTW32WDTTA\m\target\it\describe-cmd\build.log, f:\jenkins\jenkins-slave\workspace\ox_maven-help-plugin_master-U66QJWH3TRYC4M2J55DEV6AO7VQ2JW77H5GHKBUOBKZTW32WDTTA\m\target\it\describe-ga\build.log, f:\jenkins\jenkins-slave\workspace\ox_maven-help-plugin_master-U66QJWH3TRYC4M2J55DEV6AO7VQ2JW77H5GHKBUOBKZTW32WDTTA\m\target\it\describe-gav\build.log, f:\jenkins\jenkins-slave\workspace\ox_maven-help-plugin_master-U66QJWH3TRYC4M2J55DEV6AO7VQ2JW77H5GHKBUOBKZTW32WDTTA\m\target\it\describe-plugin-in-plugin-management\build.log, f:\jenkins\jenkins-slave\workspace\ox_maven-help-plugin_master-U66QJWH3TRYC4M2J55DEV6AO7VQ2JW77H5GHKBUOBKZTW32WDTTA\m\target\it\describe-plugin-without-name\build.log, f:\jenkins\jenkins-slave\workspace\ox_maven-help-plugin_master-U66QJWH3TRYC4M2J55DEV6AO7VQ2JW77H5GHKBUOBKZTW32WDTTA\m\target\it\describe-prefix-and-invalid-mojo\build.log, f:\jenkins\jenkins-slave\workspace\ox_maven-help-plugin_master-U66QJWH3TRYC4M2J55DEV6AO7VQ2JW77H5GHKBUOBKZTW32WDTTA\m\target\it\describe-prefix-and-mojo\build.log, f:\jenkins\jenkins-slave\workspace\ox_maven-help-plugin_master-U66QJWH3TRYC4M2J55DEV6AO7VQ2JW77H5GHKBUOBKZTW32WDTTA\m\target\it\describe-prefix\build.log, f:\jenkins\jenkins-slave\workspace\ox_maven-help-plugin_master-U66QJWH3TRYC4M2J55DEV6AO7VQ2JW77H5GHKBUOBKZTW32WDTTA\m\target\it\effective-pom-artifact\build.log, f:\jenkins\jenkins-slave\workspace\ox_maven-help-plugin_master-U66QJWH3TRYC4M2J55DEV6AO7VQ2JW77H5GHKBUOBKZTW32WDTTA\m\target\it\effective-pom-from-lifecycle\build.log, f:\jenkins\jenkins-slave\workspace\ox_maven-help-plugin_master-U66QJWH3TRYC4M2J55DEV6AO7VQ2JW77H5GHKBUOBKZTW32WDTTA\m\target\it\effective-pom-multimodule-unlink-parent\build.log, f:\jenkins\jenkins-slave\workspace\ox_maven-help-plugin_master-U66QJWH3TRYC4M2J55DEV6AO7VQ2JW77H5GHKBUOBKZTW32WDTTA\m\target\it\effective-pom-multimodule\build.log, f:\jenkins\jenkins-slave\workspace\ox_maven-help-plugin_master-U66QJWH3TRYC4M2J55DEV6AO7VQ2JW77H5GHKBUOBKZTW32WDTTA\m\target\it\effective-pom\build.log, f:\jenkins\jenkins-slave\workspace\ox_maven-help-plugin_master-U66QJWH3TRYC4M2J55DEV6AO7VQ2JW77H5GHKBUOBKZTW32WDTTA\m\target\it\effective-pom_properties\build.log, f:\jenkins\jenkins-slave\workspace\ox_maven-help-plugin_master-U66QJWH3TRYC4M2J55DEV6AO7VQ2JW77H5GHKBUOBKZTW32WDTTA\m\target\it\effective-settings\build.log, f:\jenkins\jenkins-slave\workspace\ox_maven-help-plugin_master-U66QJWH3TRYC4M2J55DEV6AO7VQ2JW77H5GHKBUOBKZTW32WDTTA\m\target\it\effective-settings_deep-clone\build.log, f:\jenkins\jenkins-slave\workspace\ox_maven-help-plugin_master-U66QJWH3TRYC4M2J55DEV6AO7VQ2JW77H5GHKBUOBKZTW32WDTTA\m\target\it\evaluate-artifact-with-expression-with-output\build.log, f:\jenkins\jenkins-slave\workspace\ox_maven-help-plugin_master-U66QJWH3TRYC4M2J55DEV6AO7VQ2JW77H5GHKBUOBKZTW32WDTTA\m\target\it\evaluate-settings-servers\build.log, f:\jenkins\jenkins-slave\workspace\ox_maven-help-plugin_master-U66QJWH3TRYC4M2J55DEV6AO7VQ2JW77H5GHKBUOBKZTW32WDTTA\m\target\it\evaluate-with-expression-with-output\build.log, f:\jenkins\jenkins-slave\workspace\ox_maven-help-plugin_master-U66QJWH3TRYC4M2J55DEV6AO7VQ2JW77H5GHKBUOBKZTW32WDTTA\m\target\it\evaluate\build.log, f:\jenkins\jenkins-slave\workspace\ox_maven-help-plugin_master-U66QJWH3TRYC4M2J55DEV6AO7VQ2JW77H5GHKBUOBKZTW32WDTTA\m\target\it\system\build.log]
[windows-jdk7] Finished parsing Maven Invoker results (found 29)
[windows-jdk7] [withMaven] junitPublisher - Archive test results for Maven artifact org.apache.maven.plugins:maven-help-plugin:3.1.1-SNAPSHOT generated by maven-surefire-plugin:test (default-test): m\target\surefire-reports\*.xml
[windows-jdk7] Recording test results
[Pipeline] [windows-jdk7] // withMaven
[Pipeline] [windows-jdk7] }
[Pipeline] [windows-jdk7] // stage
[Pipeline] [windows-jdk7] }
[Pipeline] [windows-jdk7] // node
[Pipeline] [windows-jdk7] }
[Pipeline] // parallel
[Pipeline] stage
[Pipeline] { (Notifications)
[Pipeline] echo
Build result: FAILURE
[Pipeline] jiraIssueSelector

Build succeeded in Jenkins: Maven TLP » maven-help-plugin » master #43

Posted by Apache Jenkins Server <je...@builds.apache.org>.
See https://builds.apache.org/job/maven-box/job/maven-help-plugin/job/master/43/

Changes:

* [MPH-153] - Upgrade maven-plugins parent to version 32
* [MPH-153] - Upgrade maven-plugins parent to version 32
* [MPH-153] - Upgrade maven-plugins parent to version 32
* [MPH-153] - Upgrade maven-plugins parent to version 32

All tests passed

Build unstable in Jenkins: Maven TLP » maven-help-plugin » master #42

Posted by Apache Jenkins Server <je...@builds.apache.org>.
See https://builds.apache.org/job/maven-box/job/maven-help-plugin/job/master/42/

Changes:

* INFRA-16749, INFRA-16768  - Followup cleanup under all circumstances.
* INFRA-16749, INFRA-16768  - Followup cleanup under all circumstances.
* ubunut-eu2 is back online.
* Fixed link to mailing lists.
* Fixed link to mailing lists.
* Fixed link to mailing lists.
* Fixed link to mailing lists.

All tests passed

Build log:
[...truncated 3.80 MB...]
[windows-jdk9] [INFO] Building: effective-settings_deep-clone\pom.xml
[windows-jdk10] [INFO] run post-build script verify.groovy
[windows-jdk10] [INFO]           effective-pom_properties\pom.xml ................. SUCCESS (4.3 s)
[windows-jdk10] [INFO] Building: effective-settings\pom.xml
[windows-jdk9] [INFO] run post-build script verify.groovy
[windows-jdk9] [INFO]           effective-settings_deep-clone\pom.xml ............ SUCCESS (4.6 s)
[windows-jdk9] [INFO] Building: evaluate\pom.xml
[windows-jdk10] [INFO]           effective-settings\pom.xml ....................... SUCCESS (3.8 s)
[windows-jdk10] [INFO] Building: effective-settings_deep-clone\pom.xml
[windows-jdk9] [INFO] run post-build script verify.groovy
[windows-jdk9] [INFO]           evaluate\pom.xml ................................. SUCCESS (4.6 s)
[windows-jdk9] [INFO] Building: evaluate-artifact-with-expression-with-output\pom.xml
[windows-jdk10] [INFO] run post-build script verify.groovy
[windows-jdk10] [INFO]           effective-settings_deep-clone\pom.xml ............ SUCCESS (3.6 s)
[windows-jdk10] [INFO] Building: evaluate\pom.xml
[windows-jdk10] [INFO] run post-build script verify.groovy
[windows-jdk10] [INFO]           evaluate\pom.xml ................................. SUCCESS (4.2 s)
[windows-jdk10] [INFO] Building: evaluate-artifact-with-expression-with-output\pom.xml
[windows-jdk9] [INFO] run post-build script verify.groovy
[windows-jdk9] [INFO]           evaluate-artifact-with-expression-with-output\pom.xml SUCCESS (8.5 s)
[windows-jdk9] [INFO] Building: evaluate-settings-servers\pom.xml
[windows-jdk10] [INFO] run post-build script verify.groovy
[windows-jdk10] [INFO]           evaluate-artifact-with-expression-with-output\pom.xml SUCCESS (7.3 s)
[windows-jdk10] [INFO] Building: evaluate-settings-servers\pom.xml
[windows-jdk9] [INFO] run post-build script verify.groovy
[windows-jdk9] [INFO]           evaluate-settings-servers\pom.xml ................ SUCCESS (5.7 s)
[windows-jdk9] [INFO] Building: evaluate-with-expression-with-output\pom.xml
[windows-jdk10] [INFO] run post-build script verify.groovy
[windows-jdk10] [INFO]           evaluate-settings-servers\pom.xml ................ SUCCESS (4.3 s)
[windows-jdk10] [INFO] Building: evaluate-with-expression-with-output\pom.xml
[windows-jdk9] [INFO] run post-build script verify.groovy
[windows-jdk9] [INFO]           evaluate-with-expression-with-output\pom.xml ..... SUCCESS (4.4 s)
[windows-jdk9] [INFO] Building: system\pom.xml
[windows-jdk10] [INFO] run post-build script verify.groovy
[windows-jdk10] [INFO]           evaluate-with-expression-with-output\pom.xml ..... SUCCESS (3.9 s)
[windows-jdk10] [INFO] Building: system\pom.xml
[windows-jdk9] [INFO]           system\pom.xml ................................... SUCCESS (4.2 s)
[windows-jdk9] [INFO] 
[windows-jdk9] [INFO] --- maven-checkstyle-plugin:3.0.0:check (checkstyle-check) @ maven-help-plugin ---
[windows-jdk9] [INFO] Downloading: https://repo.maven.apache.org/maven2/org/apache/maven/shared/maven-shared-resources/2/maven-shared-resources-2.pom
[windows-jdk9] [INFO] Downloaded: https://repo.maven.apache.org/maven2/org/apache/maven/shared/maven-shared-resources/2/maven-shared-resources-2.pom (3.0 kB at 370 kB/s)
[windows-jdk9] [INFO] Downloading: https://repo.maven.apache.org/maven2/org/codehaus/plexus/plexus-utils/3.0.10/plexus-utils-3.0.10.pom
[windows-jdk9] [INFO] Downloaded: https://repo.maven.apache.org/maven2/org/codehaus/plexus/plexus-utils/3.0.10/plexus-utils-3.0.10.pom (3.1 kB at 524 kB/s)
[windows-jdk9] [INFO] Downloading: https://repo.maven.apache.org/maven2/org/codehaus/plexus/plexus/3.3/plexus-3.3.pom
[windows-jdk9] [INFO] Downloaded: https://repo.maven.apache.org/maven2/org/codehaus/plexus/plexus/3.3/plexus-3.3.pom (20 kB at 2.8 MB/s)
[windows-jdk9] [INFO] Downloading: https://repo.maven.apache.org/maven2/org/apache/maven/doxia/doxia-integration-tools/1.6/doxia-integration-tools-1.6.pom
[windows-jdk9] [INFO] Downloaded: https://repo.maven.apache.org/maven2/org/apache/maven/doxia/doxia-integration-tools/1.6/doxia-integration-tools-1.6.pom (7.0 kB at 1.2 MB/s)
[windows-jdk9] [INFO] Downloading: https://repo.maven.apache.org/maven2/org/apache/maven/doxia/doxia-tools/3/doxia-tools-3.pom
[windows-jdk9] [INFO] Downloaded: https://repo.maven.apache.org/maven2/org/apache/maven/doxia/doxia-tools/3/doxia-tools-3.pom (9.9 kB at 1.7 MB/s)
[windows-jdk9] [INFO] Downloading: https://repo.maven.apache.org/maven2/org/codehaus/plexus/plexus-resources/1.1.0/plexus-resources-1.1.0.pom
[windows-jdk9] [INFO] Downloaded: https://repo.maven.apache.org/maven2/org/codehaus/plexus/plexus-resources/1.1.0/plexus-resources-1.1.0.pom (3.2 kB at 454 kB/s)
[windows-jdk9] [INFO] Downloading: https://repo.maven.apache.org/maven2/com/puppycrawl/tools/checkstyle/6.18/checkstyle-6.18.pom
[windows-jdk9] [INFO] Downloaded: https://repo.maven.apache.org/maven2/com/puppycrawl/tools/checkstyle/6.18/checkstyle-6.18.pom (71 kB at 7.9 MB/s)
[windows-jdk9] [INFO] Downloading: https://repo.maven.apache.org/maven2/antlr/antlr/2.7.7/antlr-2.7.7.pom
[windows-jdk9] [INFO] Downloaded: https://repo.maven.apache.org/maven2/antlr/antlr/2.7.7/antlr-2.7.7.pom (632 B at 90 kB/s)
[windows-jdk9] [INFO] Downloading: https://repo.maven.apache.org/maven2/org/antlr/antlr4-runtime/4.5.3/antlr4-runtime-4.5.3.pom
[windows-jdk9] [INFO] Downloaded: https://repo.maven.apache.org/maven2/org/antlr/antlr4-runtime/4.5.3/antlr4-runtime-4.5.3.pom (2.3 kB at 330 kB/s)
[windows-jdk9] [INFO] Downloading: https://repo.maven.apache.org/maven2/org/antlr/antlr4-master/4.5.3/antlr4-master-4.5.3.pom
[windows-jdk9] [INFO] Downloaded: https://repo.maven.apache.org/maven2/org/antlr/antlr4-master/4.5.3/antlr4-master-4.5.3.pom (3.7 kB at 614 kB/s)
[windows-jdk9] [INFO] Downloading: https://repo.maven.apache.org/maven2/commons-beanutils/commons-beanutils/1.9.2/commons-beanutils-1.9.2.pom
[windows-jdk9] [INFO] Downloaded: https://repo.maven.apache.org/maven2/commons-beanutils/commons-beanutils/1.9.2/commons-beanutils-1.9.2.pom (14 kB at 2.4 MB/s)
[windows-jdk9] [INFO] Downloading: https://repo.maven.apache.org/maven2/org/apache/commons/commons-parent/33/commons-parent-33.pom
[windows-jdk9] [INFO] Downloaded: https://repo.maven.apache.org/maven2/org/apache/commons/commons-parent/33/commons-parent-33.pom (53 kB at 5.9 MB/s)
[windows-jdk9] [INFO] Downloading: https://repo.maven.apache.org/maven2/commons-cli/commons-cli/1.3.1/commons-cli-1.3.1.pom
[windows-jdk9] [INFO] Downloaded: https://repo.maven.apache.org/maven2/commons-cli/commons-cli/1.3.1/commons-cli-1.3.1.pom (10 kB at 1.7 MB/s)
[windows-jdk9] [INFO] Downloading: https://repo.maven.apache.org/maven2/com/google/guava/guava/19.0/guava-19.0.pom
[windows-jdk9] [INFO] Downloaded: https://repo.maven.apache.org/maven2/com/google/guava/guava/19.0/guava-19.0.pom (6.8 kB at 970 kB/s)
[windows-jdk9] [INFO] Downloading: https://repo.maven.apache.org/maven2/com/google/guava/guava-parent/19.0/guava-parent-19.0.pom
[windows-jdk9] [INFO] Downloaded: https://repo.maven.apache.org/maven2/com/google/guava/guava-parent/19.0/guava-parent-19.0.pom (9.9 kB at 1.6 MB/s)
[windows-jdk9] [INFO] Downloading: https://repo.maven.apache.org/maven2/org/sonatype/oss/oss-parent/7/oss-parent-7.pom
[windows-jdk9] [INFO] Downloaded: https://repo.maven.apache.org/maven2/org/sonatype/oss/oss-parent/7/oss-parent-7.pom (4.8 kB at 689 kB/s)
[windows-jdk9] [INFO] Downloading: https://repo.maven.apache.org/maven2/javax/xml/bind/jaxb-api/2.3.0/jaxb-api-2.3.0.pom
[windows-jdk9] [INFO] Downloaded: https://repo.maven.apache.org/maven2/javax/xml/bind/jaxb-api/2.3.0/jaxb-api-2.3.0.pom (23 kB at 1.2 MB/s)
[windows-jdk9] [INFO] Downloading: https://repo.maven.apache.org/maven2/javax/xml/bind/jaxb-api-parent/2.3.0/jaxb-api-parent-2.3.0.pom
[windows-jdk9] [INFO] Downloaded: https://repo.maven.apache.org/maven2/javax/xml/bind/jaxb-api-parent/2.3.0/jaxb-api-parent-2.3.0.pom (5.6 kB at 705 kB/s)
[windows-jdk9] [INFO] Downloading: https://repo.maven.apache.org/maven2/net/java/jvnet-parent/5/jvnet-parent-5.pom
[windows-jdk9] [INFO] Downloaded: https://repo.maven.apache.org/maven2/net/java/jvnet-parent/5/jvnet-parent-5.pom (8.9 kB at 1.3 MB/s)
[windows-jdk9] [INFO] Downloading: https://repo.maven.apache.org/maven2/commons-digester/commons-digester/1.6/commons-digester-1.6.jar
[windows-jdk9] [INFO] Downloading: https://repo.maven.apache.org/maven2/commons-logging/commons-logging/1.0.4/commons-logging-1.0.4.jar
[windows-jdk9] [INFO] Downloading: https://repo.maven.apache.org/maven2/org/apache/maven/shared/maven-shared-resources/2/maven-shared-resources-2.jar
[windows-jdk9] [INFO] Downloading: https://repo.maven.apache.org/maven2/org/apache/maven/doxia/doxia-integration-tools/1.6/doxia-integration-tools-1.6.jar
[windows-jdk9] [INFO] Downloading: https://repo.maven.apache.org/maven2/org/apache/maven/doxia/doxia-core/1.2/doxia-core-1.2.jar
[windows-jdk9] [INFO] Downloaded: https://repo.maven.apache.org/maven2/commons-logging/commons-logging/1.0.4/commons-logging-1.0.4.jar (38 kB at 2.1 MB/s)
[windows-jdk9] [INFO] Downloading: https://repo.maven.apache.org/maven2/commons-io/commons-io/1.4/commons-io-1.4.jar
[windows-jdk9] [INFO] Downloaded: https://repo.maven.apache.org/maven2/org/apache/maven/shared/maven-shared-resources/2/maven-shared-resources-2.jar (13 kB at 653 kB/s)
[windows-jdk9] [INFO] Downloading: https://repo.maven.apache.org/maven2/org/codehaus/plexus/plexus-resources/1.1.0/plexus-resources-1.1.0.jar
[windows-jdk9] [INFO] Downloaded: https://repo.maven.apache.org/maven2/commons-digester/commons-digester/1.6/commons-digester-1.6.jar (168 kB at 8.4 MB/s)
[windows-jdk9] [INFO] Downloading: https://repo.maven.apache.org/maven2/com/puppycrawl/tools/checkstyle/6.18/checkstyle-6.18.jar
[windows-jdk9] [INFO] Downloaded: https://repo.maven.apache.org/maven2/org/apache/maven/doxia/doxia-core/1.2/doxia-core-1.2.jar (154 kB at 5.9 MB/s)
[windows-jdk9] [INFO] Downloading: https://repo.maven.apache.org/maven2/antlr/antlr/2.7.7/antlr-2.7.7.jar
[windows-jdk9] [INFO] Downloaded: https://repo.maven.apache.org/maven2/org/apache/maven/doxia/doxia-integration-tools/1.6/doxia-integration-tools-1.6.jar (45 kB at 1.7 MB/s)
[windows-jdk9] [INFO] Downloading: https://repo.maven.apache.org/maven2/org/antlr/antlr4-runtime/4.5.3/antlr4-runtime-4.5.3.jar
[windows-jdk9] [INFO] Downloaded: https://repo.maven.apache.org/maven2/org/codehaus/plexus/plexus-resources/1.1.0/plexus-resources-1.1.0.jar (23 kB at 749 kB/s)
[windows-jdk9] [INFO] Downloading: https://repo.maven.apache.org/maven2/commons-beanutils/commons-beanutils/1.9.2/commons-beanutils-1.9.2.jar
[windows-jdk9] [INFO] Downloaded: https://repo.maven.apache.org/maven2/commons-io/commons-io/1.4/commons-io-1.4.jar (109 kB at 2.3 MB/s)
[windows-jdk9] [INFO] Downloading: https://repo.maven.apache.org/maven2/commons-cli/commons-cli/1.3.1/commons-cli-1.3.1.jar
[windows-jdk9] [INFO] Downloaded: https://repo.maven.apache.org/maven2/org/antlr/antlr4-runtime/4.5.3/antlr4-runtime-4.5.3.jar (302 kB at 4.8 MB/s)
[windows-jdk9] [INFO] Downloading: https://repo.maven.apache.org/maven2/com/google/guava/guava/19.0/guava-19.0.jar
[windows-jdk9] [INFO] Downloaded: https://repo.maven.apache.org/maven2/commons-beanutils/commons-beanutils/1.9.2/commons-beanutils-1.9.2.jar (234 kB at 3.7 MB/s)
[windows-jdk9] [INFO] Downloading: https://repo.maven.apache.org/maven2/commons-lang/commons-lang/2.1/commons-lang-2.1.jar
[windows-jdk9] [INFO] Downloaded: https://repo.maven.apache.org/maven2/com/puppycrawl/tools/checkstyle/6.18/checkstyle-6.18.jar (1.2 MB at 18 MB/s)
[windows-jdk9] [INFO] Downloading: https://repo.maven.apache.org/maven2/javax/xml/bind/jaxb-api/2.3.0/jaxb-api-2.3.0.jar
[windows-jdk9] [INFO] Downloaded: https://repo.maven.apache.org/maven2/commons-cli/commons-cli/1.3.1/commons-cli-1.3.1.jar (53 kB at 768 kB/s)
[windows-jdk9] [INFO] Downloaded: https://repo.maven.apache.org/maven2/antlr/antlr/2.7.7/antlr-2.7.7.jar (445 kB at 5.8 MB/s)
[windows-jdk9] [INFO] Downloaded: https://repo.maven.apache.org/maven2/javax/xml/bind/jaxb-api/2.3.0/jaxb-api-2.3.0.jar (126 kB at 1.6 MB/s)
[windows-jdk9] [INFO] Downloaded: https://repo.maven.apache.org/maven2/commons-lang/commons-lang/2.1/commons-lang-2.1.jar (208 kB at 2.5 MB/s)
[windows-jdk10] [INFO]           system\pom.xml ................................... SUCCESS (3.2 s)
[windows-jdk10] [INFO] 
[windows-jdk10] [INFO] --- maven-checkstyle-plugin:3.0.0:check (checkstyle-check) @ maven-help-plugin ---
[windows-jdk10] [INFO] Downloading: https://repo.maven.apache.org/maven2/org/apache/maven/shared/maven-shared-resources/2/maven-shared-resources-2.pom
[windows-jdk10] [INFO] Downloaded: https://repo.maven.apache.org/maven2/org/apache/maven/shared/maven-shared-resources/2/maven-shared-resources-2.pom (3.0 kB at 422 kB/s)
[windows-jdk10] [INFO] Downloading: https://repo.maven.apache.org/maven2/org/codehaus/plexus/plexus-utils/3.0.10/plexus-utils-3.0.10.pom
[windows-jdk10] [INFO] Downloaded: https://repo.maven.apache.org/maven2/org/codehaus/plexus/plexus-utils/3.0.10/plexus-utils-3.0.10.pom (3.1 kB at 524 kB/s)
[windows-jdk10] [INFO] Downloading: https://repo.maven.apache.org/maven2/org/codehaus/plexus/plexus/3.3/plexus-3.3.pom
[windows-jdk10] [INFO] Downloaded: https://repo.maven.apache.org/maven2/org/codehaus/plexus/plexus/3.3/plexus-3.3.pom (20 kB at 3.3 MB/s)
[windows-jdk10] [INFO] Downloading: https://repo.maven.apache.org/maven2/org/apache/maven/doxia/doxia-integration-tools/1.6/doxia-integration-tools-1.6.pom
[windows-jdk10] [INFO] Downloaded: https://repo.maven.apache.org/maven2/org/apache/maven/doxia/doxia-integration-tools/1.6/doxia-integration-tools-1.6.pom (7.0 kB at 1.4 MB/s)
[windows-jdk10] [INFO] Downloading: https://repo.maven.apache.org/maven2/org/apache/maven/doxia/doxia-tools/3/doxia-tools-3.pom
[windows-jdk10] [INFO] Downloaded: https://repo.maven.apache.org/maven2/org/apache/maven/doxia/doxia-tools/3/doxia-tools-3.pom (9.9 kB at 1.7 MB/s)
[windows-jdk10] [INFO] Downloading: https://repo.maven.apache.org/maven2/org/codehaus/plexus/plexus-resources/1.1.0/plexus-resources-1.1.0.pom
[windows-jdk10] [INFO] Downloaded: https://repo.maven.apache.org/maven2/org/codehaus/plexus/plexus-resources/1.1.0/plexus-resources-1.1.0.pom (3.2 kB at 454 kB/s)
[windows-jdk10] [INFO] Downloading: https://repo.maven.apache.org/maven2/com/puppycrawl/tools/checkstyle/6.18/checkstyle-6.18.pom
[windows-jdk10] [INFO] Downloaded: https://repo.maven.apache.org/maven2/com/puppycrawl/tools/checkstyle/6.18/checkstyle-6.18.pom (71 kB at 6.5 MB/s)
[windows-jdk10] [INFO] Downloading: https://repo.maven.apache.org/maven2/antlr/antlr/2.7.7/antlr-2.7.7.pom
[windows-jdk10] [INFO] Downloaded: https://repo.maven.apache.org/maven2/antlr/antlr/2.7.7/antlr-2.7.7.pom (632 B at 105 kB/s)
[windows-jdk10] [INFO] Downloading: https://repo.maven.apache.org/maven2/org/antlr/antlr4-runtime/4.5.3/antlr4-runtime-4.5.3.pom
[windows-jdk10] [INFO] Downloaded: https://repo.maven.apache.org/maven2/org/antlr/antlr4-runtime/4.5.3/antlr4-runtime-4.5.3.pom (2.3 kB at 330 kB/s)
[windows-jdk10] [INFO] Downloading: https://repo.maven.apache.org/maven2/org/antlr/antlr4-master/4.5.3/antlr4-master-4.5.3.pom
[windows-jdk10] [INFO] Downloaded: https://repo.maven.apache.org/maven2/org/antlr/antlr4-master/4.5.3/antlr4-master-4.5.3.pom (3.7 kB at 614 kB/s)
[windows-jdk9] [INFO] Downloaded: https://repo.maven.apache.org/maven2/com/google/guava/guava/19.0/guava-19.0.jar (2.3 MB at 18 MB/s)
[windows-jdk10] [INFO] Downloading: https://repo.maven.apache.org/maven2/commons-beanutils/commons-beanutils/1.9.2/commons-beanutils-1.9.2.pom
[windows-jdk10] [INFO] Downloaded: https://repo.maven.apache.org/maven2/commons-beanutils/commons-beanutils/1.9.2/commons-beanutils-1.9.2.pom (14 kB at 2.0 MB/s)
[windows-jdk10] [INFO] Downloading: https://repo.maven.apache.org/maven2/org/apache/commons/commons-parent/33/commons-parent-33.pom
[windows-jdk10] [INFO] Downloaded: https://repo.maven.apache.org/maven2/org/apache/commons/commons-parent/33/commons-parent-33.pom (53 kB at 7.6 MB/s)
[windows-jdk10] [INFO] Downloading: https://repo.maven.apache.org/maven2/commons-cli/commons-cli/1.3.1/commons-cli-1.3.1.pom
[windows-jdk10] [INFO] Downloaded: https://repo.maven.apache.org/maven2/commons-cli/commons-cli/1.3.1/commons-cli-1.3.1.pom (10 kB at 1.7 MB/s)
[windows-jdk10] [INFO] Downloading: https://repo.maven.apache.org/maven2/com/google/guava/guava/19.0/guava-19.0.pom
[windows-jdk10] [INFO] Downloaded: https://repo.maven.apache.org/maven2/com/google/guava/guava/19.0/guava-19.0.pom (6.8 kB at 1.1 MB/s)
[windows-jdk10] [INFO] Downloading: https://repo.maven.apache.org/maven2/com/google/guava/guava-parent/19.0/guava-parent-19.0.pom
[windows-jdk10] [INFO] Downloaded: https://repo.maven.apache.org/maven2/com/google/guava/guava-parent/19.0/guava-parent-19.0.pom (9.9 kB at 2.0 MB/s)
[windows-jdk10] [INFO] Downloading: https://repo.maven.apache.org/maven2/org/sonatype/oss/oss-parent/7/oss-parent-7.pom
[windows-jdk10] [INFO] Downloaded: https://repo.maven.apache.org/maven2/org/sonatype/oss/oss-parent/7/oss-parent-7.pom (4.8 kB at 536 kB/s)
[windows-jdk10] [INFO] Downloading: https://repo.maven.apache.org/maven2/javax/xml/bind/jaxb-api/2.3.0/jaxb-api-2.3.0.pom
[windows-jdk10] [INFO] Downloaded: https://repo.maven.apache.org/maven2/javax/xml/bind/jaxb-api/2.3.0/jaxb-api-2.3.0.pom (23 kB at 3.3 MB/s)
[windows-jdk10] [INFO] Downloading: https://repo.maven.apache.org/maven2/javax/xml/bind/jaxb-api-parent/2.3.0/jaxb-api-parent-2.3.0.pom
[windows-jdk10] [INFO] Downloaded: https://repo.maven.apache.org/maven2/javax/xml/bind/jaxb-api-parent/2.3.0/jaxb-api-parent-2.3.0.pom (5.6 kB at 627 kB/s)
[windows-jdk10] [INFO] Downloading: https://repo.maven.apache.org/maven2/net/java/jvnet-parent/5/jvnet-parent-5.pom
[windows-jdk10] [INFO] Downloaded: https://repo.maven.apache.org/maven2/net/java/jvnet-parent/5/jvnet-parent-5.pom (8.9 kB at 1.5 MB/s)
[windows-jdk10] [INFO] Downloading: https://repo.maven.apache.org/maven2/org/apache/maven/shared/maven-shared-resources/2/maven-shared-resources-2.jar
[windows-jdk10] [INFO] Downloaded: https://repo.maven.apache.org/maven2/org/apache/maven/shared/maven-shared-resources/2/maven-shared-resources-2.jar (13 kB at 170 kB/s)
[windows-jdk10] [INFO] Downloading: https://repo.maven.apache.org/maven2/commons-io/commons-io/1.4/commons-io-1.4.jar
[windows-jdk10] [INFO] Downloaded: https://repo.maven.apache.org/maven2/commons-io/commons-io/1.4/commons-io-1.4.jar (109 kB at 1.3 MB/s)
[windows-jdk10] [INFO] Downloading: https://repo.maven.apache.org/maven2/org/codehaus/plexus/plexus-resources/1.1.0/plexus-resources-1.1.0.jar
[windows-jdk10] [INFO] Downloading: https://repo.maven.apache.org/maven2/org/apache/maven/doxia/doxia-integration-tools/1.6/doxia-integration-tools-1.6.jar
[windows-jdk10] [INFO] Downloading: https://repo.maven.apache.org/maven2/org/apache/maven/doxia/doxia-core/1.2/doxia-core-1.2.jar
[windows-jdk10] [INFO] Downloading: https://repo.maven.apache.org/maven2/commons-digester/commons-digester/1.6/commons-digester-1.6.jar
[windows-jdk10] [INFO] Downloading: https://repo.maven.apache.org/maven2/commons-logging/commons-logging/1.0.4/commons-logging-1.0.4.jar
[windows-jdk10] [INFO] Downloaded: https://repo.maven.apache.org/maven2/org/codehaus/plexus/plexus-resources/1.1.0/plexus-resources-1.1.0.jar (23 kB at 129 kB/s)
[windows-jdk10] [INFO] Downloading: https://repo.maven.apache.org/maven2/com/puppycrawl/tools/checkstyle/6.18/checkstyle-6.18.jar
[windows-jdk10] [INFO] Downloaded: https://repo.maven.apache.org/maven2/org/apache/maven/doxia/doxia-integration-tools/1.6/doxia-integration-tools-1.6.jar (45 kB at 208 kB/s)
[windows-jdk10] [INFO] Downloading: https://repo.maven.apache.org/maven2/antlr/antlr/2.7.7/antlr-2.7.7.jar
[windows-jdk10] [INFO] Downloaded: https://repo.maven.apache.org/maven2/com/puppycrawl/tools/checkstyle/6.18/checkstyle-6.18.jar (1.2 MB at 4.7 MB/s)
[windows-jdk10] [INFO] Downloading: https://repo.maven.apache.org/maven2/org/antlr/antlr4-runtime/4.5.3/antlr4-runtime-4.5.3.jar
[windows-jdk10] [INFO] Downloaded: https://repo.maven.apache.org/maven2/antlr/antlr/2.7.7/antlr-2.7.7.jar (445 kB at 1.8 MB/s)
[windows-jdk10] [INFO] Downloading: https://repo.maven.apache.org/maven2/commons-beanutils/commons-beanutils/1.9.2/commons-beanutils-1.9.2.jar
[windows-jdk10] [INFO] Downloaded: https://repo.maven.apache.org/maven2/commons-digester/commons-digester/1.6/commons-digester-1.6.jar (168 kB at 668 kB/s)
[windows-jdk10] [INFO] Downloading: https://repo.maven.apache.org/maven2/commons-cli/commons-cli/1.3.1/commons-cli-1.3.1.jar
[windows-jdk10] [INFO] Downloaded: https://repo.maven.apache.org/maven2/org/antlr/antlr4-runtime/4.5.3/antlr4-runtime-4.5.3.jar (302 kB at 1.1 MB/s)
[windows-jdk10] [INFO] Downloading: https://repo.maven.apache.org/maven2/com/google/guava/guava/19.0/guava-19.0.jar
[windows-jdk10] [INFO] Downloaded: https://repo.maven.apache.org/maven2/commons-beanutils/commons-beanutils/1.9.2/commons-beanutils-1.9.2.jar (234 kB at 873 kB/s)
[windows-jdk10] [INFO] Downloading: https://repo.maven.apache.org/maven2/commons-lang/commons-lang/2.1/commons-lang-2.1.jar
[windows-jdk10] [INFO] Downloaded: https://repo.maven.apache.org/maven2/commons-cli/commons-cli/1.3.1/commons-cli-1.3.1.jar (53 kB at 196 kB/s)
[windows-jdk10] [INFO] Downloading: https://repo.maven.apache.org/maven2/javax/xml/bind/jaxb-api/2.3.0/jaxb-api-2.3.0.jar
[windows-jdk10] [INFO] Downloaded: https://repo.maven.apache.org/maven2/org/apache/maven/doxia/doxia-core/1.2/doxia-core-1.2.jar (154 kB at 567 kB/s)
[windows-jdk10] [INFO] Downloaded: https://repo.maven.apache.org/maven2/commons-logging/commons-logging/1.0.4/commons-logging-1.0.4.jar (38 kB at 139 kB/s)
[windows-jdk10] [INFO] Downloaded: https://repo.maven.apache.org/maven2/javax/xml/bind/jaxb-api/2.3.0/jaxb-api-2.3.0.jar (126 kB at 447 kB/s)
[windows-jdk10] [INFO] Downloaded: https://repo.maven.apache.org/maven2/commons-lang/commons-lang/2.1/commons-lang-2.1.jar (208 kB at 737 kB/s)
[windows-jdk10] [INFO] Downloaded: https://repo.maven.apache.org/maven2/com/google/guava/guava/19.0/guava-19.0.jar (2.3 MB at 7.4 MB/s)
[windows-jdk9] [INFO] 
[windows-jdk9] [INFO] --- maven-invoker-plugin:3.0.1:verify (integration-test) @ maven-help-plugin ---
[windows-jdk9] [INFO] -------------------------------------------------
[windows-jdk9] [INFO] Build Summary:
[windows-jdk9] [INFO]   Passed: 29, Failed: 0, Errors: 0, Skipped: 0
[windows-jdk9] [INFO] -------------------------------------------------
[windows-jdk9] [INFO] ------------------------------------------------------------------------
[windows-jdk9] [INFO] BUILD SUCCESS
[windows-jdk9] [INFO] ------------------------------------------------------------------------
[windows-jdk9] [INFO] Total time: 03:36 min
[windows-jdk9] [INFO] Finished at: 2018-07-23T20:07:26Z
[windows-jdk9] [INFO] Final Memory: 48M/161M
[windows-jdk9] [INFO] ------------------------------------------------------------------------
[windows-jdk9] [INFO] [jenkins-event-spy] Generated F:\jenkins\jenkins-slave\workspace\ox_maven-help-plugin_master-U66QJWH3TRYC4M2J55DEV6AO7VQ2JW77H5GHKBUOBKZTW32WDTTA@tmp\withMaven3e4925d2\maven-spy-20180723-200349-11812152410556541063146.log
[windows-jdk10] [INFO] 
[windows-jdk10] [INFO] --- maven-invoker-plugin:3.0.1:verify (integration-test) @ maven-help-plugin ---
[windows-jdk10] [INFO] -------------------------------------------------
[windows-jdk10] [INFO] Build Summary:
[windows-jdk10] [INFO]   Passed: 29, Failed: 0, Errors: 0, Skipped: 0
[windows-jdk10] [INFO] -------------------------------------------------
[windows-jdk10] [INFO] ------------------------------------------------------------------------
[windows-jdk10] [INFO] BUILD SUCCESS
[windows-jdk10] [INFO] ------------------------------------------------------------------------
[windows-jdk10] [INFO] Total time: 03:02 min
[windows-jdk10] [INFO] Finished at: 2018-07-23T20:07:25Z
[windows-jdk10] [INFO] Final Memory: 47M/167M
[windows-jdk10] [INFO] ------------------------------------------------------------------------
[windows-jdk10] [INFO] [jenkins-event-spy] Generated F:\jenkins\jenkins-slave\workspace\ox_maven-help-plugin_master-U66QJWH3TRYC4M2J55DEV6AO7VQ2JW77H5GHKBUOBKZTW32WDTTA@tmp\withMaven48e89de4\maven-spy-20180723-200423-21214227547771509160690.log
[Pipeline] [windows-jdk10] }
[Pipeline] [windows-jdk10] // dir
[Pipeline] [windows-jdk10] }
[windows-jdk10] [withMaven] invokerPublisher - Archive invoker results for Maven artifact MavenArtifact{org.apache.maven.plugins:maven-help-plugin::3.1.1-SNAPSHOT(version: 3.1.1-SNAPSHOT, snapshot:false) } generated by PluginInvocation{org.apache.maven.plugins:maven-invoker-plugin:3.0.1@integration-test  integration-test}: m\target\invoker-reports\*.xml
[windows-jdk10] performing MavenInvokerRecorder, reportsFilenamePattern:'**/m\target\invoker-reports/BUILD*.xml', invokerBuildDir:'**/m\target\it'
[windows-jdk10] Found reports:[f:\jenkins\jenkins-slave\workspace\ox_maven-help-plugin_master-U66QJWH3TRYC4M2J55DEV6AO7VQ2JW77H5GHKBUOBKZTW32WDTTA\m\target\invoker-reports\BUILD-active-profiles.xml, f:\jenkins\jenkins-slave\workspace\ox_maven-help-plugin_master-U66QJWH3TRYC4M2J55DEV6AO7VQ2JW77H5GHKBUOBKZTW32WDTTA\m\target\invoker-reports\BUILD-active-profiles_multimodule.xml, f:\jenkins\jenkins-slave\workspace\ox_maven-help-plugin_master-U66QJWH3TRYC4M2J55DEV6AO7VQ2JW77H5GHKBUOBKZTW32WDTTA\m\target\invoker-reports\BUILD-all-profiles-parent-pom.xml, f:\jenkins\jenkins-slave\workspace\ox_maven-help-plugin_master-U66QJWH3TRYC4M2J55DEV6AO7VQ2JW77H5GHKBUOBKZTW32WDTTA\m\target\invoker-reports\BUILD-all-profiles.xml, f:\jenkins\jenkins-slave\workspace\ox_maven-help-plugin_master-U66QJWH3TRYC4M2J55DEV6AO7VQ2JW77H5GHKBUOBKZTW32WDTTA\m\target\invoker-reports\BUILD-describe-cmd-invalid.xml, f:\jenkins\jenkins-slave\workspace\ox_maven-help-plugin_master-U66QJWH3TRYC4M2J55DEV6AO7VQ2JW77H5GHKBUOBKZTW32WDTTA\m\target\invoker-reports\BUILD-describe-cmd-with-goal-invalid.xml, f:\jenkins\jenkins-slave\workspace\ox_maven-help-plugin_master-U66QJWH3TRYC4M2J55DEV6AO7VQ2JW77H5GHKBUOBKZTW32WDTTA\m\target\invoker-reports\BUILD-describe-cmd-with-goal-report.xml, f:\jenkins\jenkins-slave\workspace\ox_maven-help-plugin_master-U66QJWH3TRYC4M2J55DEV6AO7VQ2JW77H5GHKBUOBKZTW32WDTTA\m\target\invoker-reports\BUILD-describe-cmd-with-goal.xml, f:\jenkins\jenkins-slave\workspace\ox_maven-help-plugin_master-U66QJWH3TRYC4M2J55DEV6AO7VQ2JW77H5GHKBUOBKZTW32WDTTA\m\target\invoker-reports\BUILD-describe-cmd.xml, f:\jenkins\jenkins-slave\workspace\ox_maven-help-plugin_master-U66QJWH3TRYC4M2J55DEV6AO7VQ2JW77H5GHKBUOBKZTW32WDTTA\m\target\invoker-reports\BUILD-describe-ga.xml, f:\jenkins\jenkins-slave\workspace\ox_maven-help-plugin_master-U66QJWH3TRYC4M2J55DEV6AO7VQ2JW77H5GHKBUOBKZTW32WDTTA\m\target\invoker-reports\BUILD-describe-gav.xml, f:\jenkins\jenkins-slave\workspace\ox_maven-help-plugin_master-U66QJWH3TRYC4M2J55DEV6AO7VQ2JW77H5GHKBUOBKZTW32WDTTA\m\target\invoker-reports\BUILD-describe-plugin-in-plugin-management.xml, f:\jenkins\jenkins-slave\workspace\ox_maven-help-plugin_master-U66QJWH3TRYC4M2J55DEV6AO7VQ2JW77H5GHKBUOBKZTW32WDTTA\m\target\invoker-reports\BUILD-describe-plugin-without-name.xml, f:\jenkins\jenkins-slave\workspace\ox_maven-help-plugin_master-U66QJWH3TRYC4M2J55DEV6AO7VQ2JW77H5GHKBUOBKZTW32WDTTA\m\target\invoker-reports\BUILD-describe-prefix-and-invalid-mojo.xml, f:\jenkins\jenkins-slave\workspace\ox_maven-help-plugin_master-U66QJWH3TRYC4M2J55DEV6AO7VQ2JW77H5GHKBUOBKZTW32WDTTA\m\target\invoker-reports\BUILD-describe-prefix-and-mojo.xml, f:\jenkins\jenkins-slave\workspace\ox_maven-help-plugin_master-U66QJWH3TRYC4M2J55DEV6AO7VQ2JW77H5GHKBUOBKZTW32WDTTA\m\target\invoker-reports\BUILD-describe-prefix.xml, f:\jenkins\jenkins-slave\workspace\ox_maven-help-plugin_master-U66QJWH3TRYC4M2J55DEV6AO7VQ2JW77H5GHKBUOBKZTW32WDTTA\m\target\invoker-reports\BUILD-effective-pom-artifact.xml, f:\jenkins\jenkins-slave\workspace\ox_maven-help-plugin_master-U66QJWH3TRYC4M2J55DEV6AO7VQ2JW77H5GHKBUOBKZTW32WDTTA\m\target\invoker-reports\BUILD-effective-pom-from-lifecycle.xml, f:\jenkins\jenkins-slave\workspace\ox_maven-help-plugin_master-U66QJWH3TRYC4M2J55DEV6AO7VQ2JW77H5GHKBUOBKZTW32WDTTA\m\target\invoker-reports\BUILD-effective-pom-multimodule-unlink-parent.xml, f:\jenkins\jenkins-slave\workspace\ox_maven-help-plugin_master-U66QJWH3TRYC4M2J55DEV6AO7VQ2JW77H5GHKBUOBKZTW32WDTTA\m\target\invoker-reports\BUILD-effective-pom-multimodule.xml, f:\jenkins\jenkins-slave\workspace\ox_maven-help-plugin_master-U66QJWH3TRYC4M2J55DEV6AO7VQ2JW77H5GHKBUOBKZTW32WDTTA\m\target\invoker-reports\BUILD-effective-pom.xml, f:\jenkins\jenkins-slave\workspace\ox_maven-help-plugin_master-U66QJWH3TRYC4M2J55DEV6AO7VQ2JW77H5GHKBUOBKZTW32WDTTA\m\target\invoker-reports\BUILD-effective-pom_properties.xml, f:\jenkins\jenkins-slave\workspace\ox_maven-help-plugin_master-U66QJWH3TRYC4M2J55DEV6AO7VQ2JW77H5GHKBUOBKZTW32WDTTA\m\target\invoker-reports\BUILD-effective-settings.xml, f:\jenkins\jenkins-slave\workspace\ox_maven-help-plugin_master-U66QJWH3TRYC4M2J55DEV6AO7VQ2JW77H5GHKBUOBKZTW32WDTTA\m\target\invoker-reports\BUILD-effective-settings_deep-clone.xml, f:\jenkins\jenkins-slave\workspace\ox_maven-help-plugin_master-U66QJWH3TRYC4M2J55DEV6AO7VQ2JW77H5GHKBUOBKZTW32WDTTA\m\target\invoker-reports\BUILD-evaluate-artifact-with-expression-with-output.xml, f:\jenkins\jenkins-slave\workspace\ox_maven-help-plugin_master-U66QJWH3TRYC4M2J55DEV6AO7VQ2JW77H5GHKBUOBKZTW32WDTTA\m\target\invoker-reports\BUILD-evaluate-settings-servers.xml, f:\jenkins\jenkins-slave\workspace\ox_maven-help-plugin_master-U66QJWH3TRYC4M2J55DEV6AO7VQ2JW77H5GHKBUOBKZTW32WDTTA\m\target\invoker-reports\BUILD-evaluate-with-expression-with-output.xml, f:\jenkins\jenkins-slave\workspace\ox_maven-help-plugin_master-U66QJWH3TRYC4M2J55DEV6AO7VQ2JW77H5GHKBUOBKZTW32WDTTA\m\target\invoker-reports\BUILD-evaluate.xml, f:\jenkins\jenkins-slave\workspace\ox_maven-help-plugin_master-U66QJWH3TRYC4M2J55DEV6AO7VQ2JW77H5GHKBUOBKZTW32WDTTA\m\target\invoker-reports\BUILD-system.xml]
[windows-jdk10] Found logs:[f:\jenkins\jenkins-slave\workspace\ox_maven-help-plugin_master-U66QJWH3TRYC4M2J55DEV6AO7VQ2JW77H5GHKBUOBKZTW32WDTTA\m\target\it\active-profiles\build.log, f:\jenkins\jenkins-slave\workspace\ox_maven-help-plugin_master-U66QJWH3TRYC4M2J55DEV6AO7VQ2JW77H5GHKBUOBKZTW32WDTTA\m\target\it\active-profiles_multimodule\build.log, f:\jenkins\jenkins-slave\workspace\ox_maven-help-plugin_master-U66QJWH3TRYC4M2J55DEV6AO7VQ2JW77H5GHKBUOBKZTW32WDTTA\m\target\it\all-profiles-parent-pom\build.log, f:\jenkins\jenkins-slave\workspace\ox_maven-help-plugin_master-U66QJWH3TRYC4M2J55DEV6AO7VQ2JW77H5GHKBUOBKZTW32WDTTA\m\target\it\all-profiles\build.log, f:\jenkins\jenkins-slave\workspace\ox_maven-help-plugin_master-U66QJWH3TRYC4M2J55DEV6AO7VQ2JW77H5GHKBUOBKZTW32WDTTA\m\target\it\describe-cmd-invalid\build.log, f:\jenkins\jenkins-slave\workspace\ox_maven-help-plugin_master-U66QJWH3TRYC4M2J55DEV6AO7VQ2JW77H5GHKBUOBKZTW32WDTTA\m\target\it\describe-cmd-with-goal-invalid\build.log, f:\jenkins\jenkins-slave\workspace\ox_maven-help-plugin_master-U66QJWH3TRYC4M2J55DEV6AO7VQ2JW77H5GHKBUOBKZTW32WDTTA\m\target\it\describe-cmd-with-goal-report\build.log, f:\jenkins\jenkins-slave\workspace\ox_maven-help-plugin_master-U66QJWH3TRYC4M2J55DEV6AO7VQ2JW77H5GHKBUOBKZTW32WDTTA\m\target\it\describe-cmd-with-goal\build.log, f:\jenkins\jenkins-slave\workspace\ox_maven-help-plugin_master-U66QJWH3TRYC4M2J55DEV6AO7VQ2JW77H5GHKBUOBKZTW32WDTTA\m\target\it\describe-cmd\build.log, f:\jenkins\jenkins-slave\workspace\ox_maven-help-plugin_master-U66QJWH3TRYC4M2J55DEV6AO7VQ2JW77H5GHKBUOBKZTW32WDTTA\m\target\it\describe-ga\build.log, f:\jenkins\jenkins-slave\workspace\ox_maven-help-plugin_master-U66QJWH3TRYC4M2J55DEV6AO7VQ2JW77H5GHKBUOBKZTW32WDTTA\m\target\it\describe-gav\build.log, f:\jenkins\jenkins-slave\workspace\ox_maven-help-plugin_master-U66QJWH3TRYC4M2J55DEV6AO7VQ2JW77H5GHKBUOBKZTW32WDTTA\m\target\it\describe-plugin-in-plugin-management\build.log, f:\jenkins\jenkins-slave\workspace\ox_maven-help-plugin_master-U66QJWH3TRYC4M2J55DEV6AO7VQ2JW77H5GHKBUOBKZTW32WDTTA\m\target\it\describe-plugin-without-name\build.log, f:\jenkins\jenkins-slave\workspace\ox_maven-help-plugin_master-U66QJWH3TRYC4M2J55DEV6AO7VQ2JW77H5GHKBUOBKZTW32WDTTA\m\target\it\describe-prefix-and-invalid-mojo\build.log, f:\jenkins\jenkins-slave\workspace\ox_maven-help-plugin_master-U66QJWH3TRYC4M2J55DEV6AO7VQ2JW77H5GHKBUOBKZTW32WDTTA\m\target\it\describe-prefix-and-mojo\build.log, f:\jenkins\jenkins-slave\workspace\ox_maven-help-plugin_master-U66QJWH3TRYC4M2J55DEV6AO7VQ2JW77H5GHKBUOBKZTW32WDTTA\m\target\it\describe-prefix\build.log, f:\jenkins\jenkins-slave\workspace\ox_maven-help-plugin_master-U66QJWH3TRYC4M2J55DEV6AO7VQ2JW77H5GHKBUOBKZTW32WDTTA\m\target\it\effective-pom-artifact\build.log, f:\jenkins\jenkins-slave\workspace\ox_maven-help-plugin_master-U66QJWH3TRYC4M2J55DEV6AO7VQ2JW77H5GHKBUOBKZTW32WDTTA\m\target\it\effective-pom-from-lifecycle\build.log, f:\jenkins\jenkins-slave\workspace\ox_maven-help-plugin_master-U66QJWH3TRYC4M2J55DEV6AO7VQ2JW77H5GHKBUOBKZTW32WDTTA\m\target\it\effective-pom-multimodule-unlink-parent\build.log, f:\jenkins\jenkins-slave\workspace\ox_maven-help-plugin_master-U66QJWH3TRYC4M2J55DEV6AO7VQ2JW77H5GHKBUOBKZTW32WDTTA\m\target\it\effective-pom-multimodule\build.log, f:\jenkins\jenkins-slave\workspace\ox_maven-help-plugin_master-U66QJWH3TRYC4M2J55DEV6AO7VQ2JW77H5GHKBUOBKZTW32WDTTA\m\target\it\effective-pom\build.log, f:\jenkins\jenkins-slave\workspace\ox_maven-help-plugin_master-U66QJWH3TRYC4M2J55DEV6AO7VQ2JW77H5GHKBUOBKZTW32WDTTA\m\target\it\effective-pom_properties\build.log, f:\jenkins\jenkins-slave\workspace\ox_maven-help-plugin_master-U66QJWH3TRYC4M2J55DEV6AO7VQ2JW77H5GHKBUOBKZTW32WDTTA\m\target\it\effective-settings\build.log, f:\jenkins\jenkins-slave\workspace\ox_maven-help-plugin_master-U66QJWH3TRYC4M2J55DEV6AO7VQ2JW77H5GHKBUOBKZTW32WDTTA\m\target\it\effective-settings_deep-clone\build.log, f:\jenkins\jenkins-slave\workspace\ox_maven-help-plugin_master-U66QJWH3TRYC4M2J55DEV6AO7VQ2JW77H5GHKBUOBKZTW32WDTTA\m\target\it\evaluate-artifact-with-expression-with-output\build.log, f:\jenkins\jenkins-slave\workspace\ox_maven-help-plugin_master-U66QJWH3TRYC4M2J55DEV6AO7VQ2JW77H5GHKBUOBKZTW32WDTTA\m\target\it\evaluate-settings-servers\build.log, f:\jenkins\jenkins-slave\workspace\ox_maven-help-plugin_master-U66QJWH3TRYC4M2J55DEV6AO7VQ2JW77H5GHKBUOBKZTW32WDTTA\m\target\it\evaluate-with-expression-with-output\build.log, f:\jenkins\jenkins-slave\workspace\ox_maven-help-plugin_master-U66QJWH3TRYC4M2J55DEV6AO7VQ2JW77H5GHKBUOBKZTW32WDTTA\m\target\it\evaluate\build.log, f:\jenkins\jenkins-slave\workspace\ox_maven-help-plugin_master-U66QJWH3TRYC4M2J55DEV6AO7VQ2JW77H5GHKBUOBKZTW32WDTTA\m\target\it\system\build.log]
[windows-jdk10] Finished parsing Maven Invoker results (found 29)
[windows-jdk10] [withMaven] junitPublisher - Archive test results for Maven artifact org.apache.maven.plugins:maven-help-plugin:3.1.1-SNAPSHOT generated by maven-surefire-plugin:test (default-test): m\target\surefire-reports\*.xml
[windows-jdk10] Recording test results
[Pipeline] [windows-jdk10] // withMaven
[Pipeline] [windows-jdk9] }
[Pipeline] [windows-jdk10] cleanWs
[Pipeline] [windows-jdk9] // dir
[windows-jdk10] [WS-CLEANUP] Deleting project workspace...[WS-CLEANUP] done
[Pipeline] [windows-jdk9] }
[windows-jdk9] [withMaven] invokerPublisher - Archive invoker results for Maven artifact MavenArtifact{org.apache.maven.plugins:maven-help-plugin::3.1.1-SNAPSHOT(version: 3.1.1-SNAPSHOT, snapshot:false) } generated by PluginInvocation{org.apache.maven.plugins:maven-invoker-plugin:3.0.1@integration-test  integration-test}: m\target\invoker-reports\*.xml
[windows-jdk9] performing MavenInvokerRecorder, reportsFilenamePattern:'**/m\target\invoker-reports/BUILD*.xml', invokerBuildDir:'**/m\target\it'
[windows-jdk9] Found reports:[f:\jenkins\jenkins-slave\workspace\ox_maven-help-plugin_master-U66QJWH3TRYC4M2J55DEV6AO7VQ2JW77H5GHKBUOBKZTW32WDTTA\m\target\invoker-reports\BUILD-active-profiles.xml, f:\jenkins\jenkins-slave\workspace\ox_maven-help-plugin_master-U66QJWH3TRYC4M2J55DEV6AO7VQ2JW77H5GHKBUOBKZTW32WDTTA\m\target\invoker-reports\BUILD-active-profiles_multimodule.xml, f:\jenkins\jenkins-slave\workspace\ox_maven-help-plugin_master-U66QJWH3TRYC4M2J55DEV6AO7VQ2JW77H5GHKBUOBKZTW32WDTTA\m\target\invoker-reports\BUILD-all-profiles-parent-pom.xml, f:\jenkins\jenkins-slave\workspace\ox_maven-help-plugin_master-U66QJWH3TRYC4M2J55DEV6AO7VQ2JW77H5GHKBUOBKZTW32WDTTA\m\target\invoker-reports\BUILD-all-profiles.xml, f:\jenkins\jenkins-slave\workspace\ox_maven-help-plugin_master-U66QJWH3TRYC4M2J55DEV6AO7VQ2JW77H5GHKBUOBKZTW32WDTTA\m\target\invoker-reports\BUILD-describe-cmd-invalid.xml, f:\jenkins\jenkins-slave\workspace\ox_maven-help-plugin_master-U66QJWH3TRYC4M2J55DEV6AO7VQ2JW77H5GHKBUOBKZTW32WDTTA\m\target\invoker-reports\BUILD-describe-cmd-with-goal-invalid.xml, f:\jenkins\jenkins-slave\workspace\ox_maven-help-plugin_master-U66QJWH3TRYC4M2J55DEV6AO7VQ2JW77H5GHKBUOBKZTW32WDTTA\m\target\invoker-reports\BUILD-describe-cmd-with-goal-report.xml, f:\jenkins\jenkins-slave\workspace\ox_maven-help-plugin_master-U66QJWH3TRYC4M2J55DEV6AO7VQ2JW77H5GHKBUOBKZTW32WDTTA\m\target\invoker-reports\BUILD-describe-cmd-with-goal.xml, f:\jenkins\jenkins-slave\workspace\ox_maven-help-plugin_master-U66QJWH3TRYC4M2J55DEV6AO7VQ2JW77H5GHKBUOBKZTW32WDTTA\m\target\invoker-reports\BUILD-describe-cmd.xml, f:\jenkins\jenkins-slave\workspace\ox_maven-help-plugin_master-U66QJWH3TRYC4M2J55DEV6AO7VQ2JW77H5GHKBUOBKZTW32WDTTA\m\target\invoker-reports\BUILD-describe-ga.xml, f:\jenkins\jenkins-slave\workspace\ox_maven-help-plugin_master-U66QJWH3TRYC4M2J55DEV6AO7VQ2JW77H5GHKBUOBKZTW32WDTTA\m\target\invoker-reports\BUILD-describe-gav.xml, f:\jenkins\jenkins-slave\workspace\ox_maven-help-plugin_master-U66QJWH3TRYC4M2J55DEV6AO7VQ2JW77H5GHKBUOBKZTW32WDTTA\m\target\invoker-reports\BUILD-describe-plugin-in-plugin-management.xml, f:\jenkins\jenkins-slave\workspace\ox_maven-help-plugin_master-U66QJWH3TRYC4M2J55DEV6AO7VQ2JW77H5GHKBUOBKZTW32WDTTA\m\target\invoker-reports\BUILD-describe-plugin-without-name.xml, f:\jenkins\jenkins-slave\workspace\ox_maven-help-plugin_master-U66QJWH3TRYC4M2J55DEV6AO7VQ2JW77H5GHKBUOBKZTW32WDTTA\m\target\invoker-reports\BUILD-describe-prefix-and-invalid-mojo.xml, f:\jenkins\jenkins-slave\workspace\ox_maven-help-plugin_master-U66QJWH3TRYC4M2J55DEV6AO7VQ2JW77H5GHKBUOBKZTW32WDTTA\m\target\invoker-reports\BUILD-describe-prefix-and-mojo.xml, f:\jenkins\jenkins-slave\workspace\ox_maven-help-plugin_master-U66QJWH3TRYC4M2J55DEV6AO7VQ2JW77H5GHKBUOBKZTW32WDTTA\m\target\invoker-reports\BUILD-describe-prefix.xml, f:\jenkins\jenkins-slave\workspace\ox_maven-help-plugin_master-U66QJWH3TRYC4M2J55DEV6AO7VQ2JW77H5GHKBUOBKZTW32WDTTA\m\target\invoker-reports\BUILD-effective-pom-artifact.xml, f:\jenkins\jenkins-slave\workspace\ox_maven-help-plugin_master-U66QJWH3TRYC4M2J55DEV6AO7VQ2JW77H5GHKBUOBKZTW32WDTTA\m\target\invoker-reports\BUILD-effective-pom-from-lifecycle.xml, f:\jenkins\jenkins-slave\workspace\ox_maven-help-plugin_master-U66QJWH3TRYC4M2J55DEV6AO7VQ2JW77H5GHKBUOBKZTW32WDTTA\m\target\invoker-reports\BUILD-effective-pom-multimodule-unlink-parent.xml, f:\jenkins\jenkins-slave\workspace\ox_maven-help-plugin_master-U66QJWH3TRYC4M2J55DEV6AO7VQ2JW77H5GHKBUOBKZTW32WDTTA\m\target\invoker-reports\BUILD-effective-pom-multimodule.xml, f:\jenkins\jenkins-slave\workspace\ox_maven-help-plugin_master-U66QJWH3TRYC4M2J55DEV6AO7VQ2JW77H5GHKBUOBKZTW32WDTTA\m\target\invoker-reports\BUILD-effective-pom.xml, f:\jenkins\jenkins-slave\workspace\ox_maven-help-plugin_master-U66QJWH3TRYC4M2J55DEV6AO7VQ2JW77H5GHKBUOBKZTW32WDTTA\m\target\invoker-reports\BUILD-effective-pom_properties.xml, f:\jenkins\jenkins-slave\workspace\ox_maven-help-plugin_master-U66QJWH3TRYC4M2J55DEV6AO7VQ2JW77H5GHKBUOBKZTW32WDTTA\m\target\invoker-reports\BUILD-effective-settings.xml, f:\jenkins\jenkins-slave\workspace\ox_maven-help-plugin_master-U66QJWH3TRYC4M2J55DEV6AO7VQ2JW77H5GHKBUOBKZTW32WDTTA\m\target\invoker-reports\BUILD-effective-settings_deep-clone.xml, f:\jenkins\jenkins-slave\workspace\ox_maven-help-plugin_master-U66QJWH3TRYC4M2J55DEV6AO7VQ2JW77H5GHKBUOBKZTW32WDTTA\m\target\invoker-reports\BUILD-evaluate-artifact-with-expression-with-output.xml, f:\jenkins\jenkins-slave\workspace\ox_maven-help-plugin_master-U66QJWH3TRYC4M2J55DEV6AO7VQ2JW77H5GHKBUOBKZTW32WDTTA\m\target\invoker-reports\BUILD-evaluate-settings-servers.xml, f:\jenkins\jenkins-slave\workspace\ox_maven-help-plugin_master-U66QJWH3TRYC4M2J55DEV6AO7VQ2JW77H5GHKBUOBKZTW32WDTTA\m\target\invoker-reports\BUILD-evaluate-with-expression-with-output.xml, f:\jenkins\jenkins-slave\workspace\ox_maven-help-plugin_master-U66QJWH3TRYC4M2J55DEV6AO7VQ2JW77H5GHKBUOBKZTW32WDTTA\m\target\invoker-reports\BUILD-evaluate.xml, f:\jenkins\jenkins-slave\workspace\ox_maven-help-plugin_master-U66QJWH3TRYC4M2J55DEV6AO7VQ2JW77H5GHKBUOBKZTW32WDTTA\m\target\invoker-reports\BUILD-system.xml]
[windows-jdk9] Found logs:[f:\jenkins\jenkins-slave\workspace\ox_maven-help-plugin_master-U66QJWH3TRYC4M2J55DEV6AO7VQ2JW77H5GHKBUOBKZTW32WDTTA\m\target\it\active-profiles\build.log, f:\jenkins\jenkins-slave\workspace\ox_maven-help-plugin_master-U66QJWH3TRYC4M2J55DEV6AO7VQ2JW77H5GHKBUOBKZTW32WDTTA\m\target\it\active-profiles_multimodule\build.log, f:\jenkins\jenkins-slave\workspace\ox_maven-help-plugin_master-U66QJWH3TRYC4M2J55DEV6AO7VQ2JW77H5GHKBUOBKZTW32WDTTA\m\target\it\all-profiles-parent-pom\build.log, f:\jenkins\jenkins-slave\workspace\ox_maven-help-plugin_master-U66QJWH3TRYC4M2J55DEV6AO7VQ2JW77H5GHKBUOBKZTW32WDTTA\m\target\it\all-profiles\build.log, f:\jenkins\jenkins-slave\workspace\ox_maven-help-plugin_master-U66QJWH3TRYC4M2J55DEV6AO7VQ2JW77H5GHKBUOBKZTW32WDTTA\m\target\it\describe-cmd-invalid\build.log, f:\jenkins\jenkins-slave\workspace\ox_maven-help-plugin_master-U66QJWH3TRYC4M2J55DEV6AO7VQ2JW77H5GHKBUOBKZTW32WDTTA\m\target\it\describe-cmd-with-goal-invalid\build.log, f:\jenkins\jenkins-slave\workspace\ox_maven-help-plugin_master-U66QJWH3TRYC4M2J55DEV6AO7VQ2JW77H5GHKBUOBKZTW32WDTTA\m\target\it\describe-cmd-with-goal-report\build.log, f:\jenkins\jenkins-slave\workspace\ox_maven-help-plugin_master-U66QJWH3TRYC4M2J55DEV6AO7VQ2JW77H5GHKBUOBKZTW32WDTTA\m\target\it\describe-cmd-with-goal\build.log, f:\jenkins\jenkins-slave\workspace\ox_maven-help-plugin_master-U66QJWH3TRYC4M2J55DEV6AO7VQ2JW77H5GHKBUOBKZTW32WDTTA\m\target\it\describe-cmd\build.log, f:\jenkins\jenkins-slave\workspace\ox_maven-help-plugin_master-U66QJWH3TRYC4M2J55DEV6AO7VQ2JW77H5GHKBUOBKZTW32WDTTA\m\target\it\describe-ga\build.log, f:\jenkins\jenkins-slave\workspace\ox_maven-help-plugin_master-U66QJWH3TRYC4M2J55DEV6AO7VQ2JW77H5GHKBUOBKZTW32WDTTA\m\target\it\describe-gav\build.log, f:\jenkins\jenkins-slave\workspace\ox_maven-help-plugin_master-U66QJWH3TRYC4M2J55DEV6AO7VQ2JW77H5GHKBUOBKZTW32WDTTA\m\target\it\describe-plugin-in-plugin-management\build.log, f:\jenkins\jenkins-slave\workspace\ox_maven-help-plugin_master-U66QJWH3TRYC4M2J55DEV6AO7VQ2JW77H5GHKBUOBKZTW32WDTTA\m\target\it\describe-plugin-without-name\build.log, f:\jenkins\jenkins-slave\workspace\ox_maven-help-plugin_master-U66QJWH3TRYC4M2J55DEV6AO7VQ2JW77H5GHKBUOBKZTW32WDTTA\m\target\it\describe-prefix-and-invalid-mojo\build.log, f:\jenkins\jenkins-slave\workspace\ox_maven-help-plugin_master-U66QJWH3TRYC4M2J55DEV6AO7VQ2JW77H5GHKBUOBKZTW32WDTTA\m\target\it\describe-prefix-and-mojo\build.log, f:\jenkins\jenkins-slave\workspace\ox_maven-help-plugin_master-U66QJWH3TRYC4M2J55DEV6AO7VQ2JW77H5GHKBUOBKZTW32WDTTA\m\target\it\describe-prefix\build.log, f:\jenkins\jenkins-slave\workspace\ox_maven-help-plugin_master-U66QJWH3TRYC4M2J55DEV6AO7VQ2JW77H5GHKBUOBKZTW32WDTTA\m\target\it\effective-pom-artifact\build.log, f:\jenkins\jenkins-slave\workspace\ox_maven-help-plugin_master-U66QJWH3TRYC4M2J55DEV6AO7VQ2JW77H5GHKBUOBKZTW32WDTTA\m\target\it\effective-pom-from-lifecycle\build.log, f:\jenkins\jenkins-slave\workspace\ox_maven-help-plugin_master-U66QJWH3TRYC4M2J55DEV6AO7VQ2JW77H5GHKBUOBKZTW32WDTTA\m\target\it\effective-pom-multimodule-unlink-parent\build.log, f:\jenkins\jenkins-slave\workspace\ox_maven-help-plugin_master-U66QJWH3TRYC4M2J55DEV6AO7VQ2JW77H5GHKBUOBKZTW32WDTTA\m\target\it\effective-pom-multimodule\build.log, f:\jenkins\jenkins-slave\workspace\ox_maven-help-plugin_master-U66QJWH3TRYC4M2J55DEV6AO7VQ2JW77H5GHKBUOBKZTW32WDTTA\m\target\it\effective-pom\build.log, f:\jenkins\jenkins-slave\workspace\ox_maven-help-plugin_master-U66QJWH3TRYC4M2J55DEV6AO7VQ2JW77H5GHKBUOBKZTW32WDTTA\m\target\it\effective-pom_properties\build.log, f:\jenkins\jenkins-slave\workspace\ox_maven-help-plugin_master-U66QJWH3TRYC4M2J55DEV6AO7VQ2JW77H5GHKBUOBKZTW32WDTTA\m\target\it\effective-settings\build.log, f:\jenkins\jenkins-slave\workspace\ox_maven-help-plugin_master-U66QJWH3TRYC4M2J55DEV6AO7VQ2JW77H5GHKBUOBKZTW32WDTTA\m\target\it\effective-settings_deep-clone\build.log, f:\jenkins\jenkins-slave\workspace\ox_maven-help-plugin_master-U66QJWH3TRYC4M2J55DEV6AO7VQ2JW77H5GHKBUOBKZTW32WDTTA\m\target\it\evaluate-artifact-with-expression-with-output\build.log, f:\jenkins\jenkins-slave\workspace\ox_maven-help-plugin_master-U66QJWH3TRYC4M2J55DEV6AO7VQ2JW77H5GHKBUOBKZTW32WDTTA\m\target\it\evaluate-settings-servers\build.log, f:\jenkins\jenkins-slave\workspace\ox_maven-help-plugin_master-U66QJWH3TRYC4M2J55DEV6AO7VQ2JW77H5GHKBUOBKZTW32WDTTA\m\target\it\evaluate-with-expression-with-output\build.log, f:\jenkins\jenkins-slave\workspace\ox_maven-help-plugin_master-U66QJWH3TRYC4M2J55DEV6AO7VQ2JW77H5GHKBUOBKZTW32WDTTA\m\target\it\evaluate\build.log, f:\jenkins\jenkins-slave\workspace\ox_maven-help-plugin_master-U66QJWH3TRYC4M2J55DEV6AO7VQ2JW77H5GHKBUOBKZTW32WDTTA\m\target\it\system\build.log]
[windows-jdk9] Finished parsing Maven Invoker results (found 29)
[windows-jdk9] [withMaven] junitPublisher - Archive test results for Maven artifact org.apache.maven.plugins:maven-help-plugin:3.1.1-SNAPSHOT generated by maven-surefire-plugin:test (default-test): m\target\surefire-reports\*.xml
[windows-jdk9] Recording test results
[Pipeline] [windows-jdk9] // withMaven
[Pipeline] [windows-jdk9] cleanWs
[Pipeline] [windows-jdk10] }
[Pipeline] [windows-jdk10] // stage
[Pipeline] [windows-jdk10] }
[Pipeline] [windows-jdk10] // node
[Pipeline] [windows-jdk10] }
[windows-jdk9] [WS-CLEANUP] Deleting project workspace...[WS-CLEANUP] done
[Pipeline] [windows-jdk9] }
[Pipeline] [windows-jdk9] // stage
[Pipeline] [windows-jdk9] }
[Pipeline] [windows-jdk9] // node
[Pipeline] [windows-jdk9] }
[Pipeline] // parallel
[Pipeline] stage
[Pipeline] { (Notifications)
[Pipeline] echo
Build result: UNSTABLE
[Pipeline] jiraIssueSelector
[Pipeline] emailext

Build unstable in Jenkins: Maven TLP » maven-help-plugin » master #41

Posted by Apache Jenkins Server <je...@builds.apache.org>.
See https://builds.apache.org/job/maven-box/job/maven-help-plugin/job/master/41/

Changes:

* Fixed link to mailing list.

All tests passed

Build log:
[...truncated 3.79 MB...]
[windows-jdk9] [INFO] Downloaded: https://repo.maven.apache.org/maven2/org/apache/maven/shared/maven-shared-resources/2/maven-shared-resources-2.jar (13 kB at 99 kB/s)
[windows-jdk9] [INFO] Downloading: https://repo.maven.apache.org/maven2/javax/xml/bind/jaxb-api/2.3.0/jaxb-api-2.3.0.jar
[windows-jdk9] [INFO] Downloaded: https://repo.maven.apache.org/maven2/org/apache/maven/doxia/doxia-integration-tools/1.6/doxia-integration-tools-1.6.jar (45 kB at 336 kB/s)
[windows-jdk9] [INFO] Downloaded: https://repo.maven.apache.org/maven2/commons-cli/commons-cli/1.3.1/commons-cli-1.3.1.jar (53 kB at 395 kB/s)
[windows-jdk9] [INFO] Downloaded: https://repo.maven.apache.org/maven2/commons-lang/commons-lang/2.1/commons-lang-2.1.jar (208 kB at 1.2 MB/s)
[windows-jdk9] [INFO] Downloaded: https://repo.maven.apache.org/maven2/javax/xml/bind/jaxb-api/2.3.0/jaxb-api-2.3.0.jar (126 kB at 638 kB/s)
[windows-jdk9] [INFO] Downloaded: https://repo.maven.apache.org/maven2/com/google/guava/guava/19.0/guava-19.0.jar (2.3 MB at 8.8 MB/s)
[windows-jdk10] [INFO]           system\pom.xml ................................... SUCCESS (4.4 s)
[windows-jdk10] [INFO] 
[windows-jdk10] [INFO] --- maven-checkstyle-plugin:3.0.0:check (checkstyle-check) @ maven-help-plugin ---
[windows-jdk10] [INFO] Downloading: https://repo.maven.apache.org/maven2/org/apache/maven/shared/maven-shared-resources/2/maven-shared-resources-2.pom
[windows-jdk10] [INFO] Downloaded: https://repo.maven.apache.org/maven2/org/apache/maven/shared/maven-shared-resources/2/maven-shared-resources-2.pom (3.0 kB at 370 kB/s)
[windows-jdk10] [INFO] Downloading: https://repo.maven.apache.org/maven2/org/codehaus/plexus/plexus-utils/3.0.10/plexus-utils-3.0.10.pom
[windows-jdk10] [INFO] Downloaded: https://repo.maven.apache.org/maven2/org/codehaus/plexus/plexus-utils/3.0.10/plexus-utils-3.0.10.pom (3.1 kB at 449 kB/s)
[windows-jdk10] [INFO] Downloading: https://repo.maven.apache.org/maven2/org/codehaus/plexus/plexus/3.3/plexus-3.3.pom
[windows-jdk10] [INFO] Downloaded: https://repo.maven.apache.org/maven2/org/codehaus/plexus/plexus/3.3/plexus-3.3.pom (20 kB at 2.5 MB/s)
[windows-jdk10] [INFO] Downloading: https://repo.maven.apache.org/maven2/org/apache/maven/doxia/doxia-integration-tools/1.6/doxia-integration-tools-1.6.pom
[windows-jdk10] [INFO] Downloaded: https://repo.maven.apache.org/maven2/org/apache/maven/doxia/doxia-integration-tools/1.6/doxia-integration-tools-1.6.pom (7.0 kB at 1.2 MB/s)
[windows-jdk10] [INFO] Downloading: https://repo.maven.apache.org/maven2/org/apache/maven/doxia/doxia-tools/3/doxia-tools-3.pom
[windows-jdk10] [INFO] Downloaded: https://repo.maven.apache.org/maven2/org/apache/maven/doxia/doxia-tools/3/doxia-tools-3.pom (9.9 kB at 1.4 MB/s)
[windows-jdk10] [INFO] Downloading: https://repo.maven.apache.org/maven2/org/codehaus/plexus/plexus-resources/1.1.0/plexus-resources-1.1.0.pom
[windows-jdk10] [INFO] Downloaded: https://repo.maven.apache.org/maven2/org/codehaus/plexus/plexus-resources/1.1.0/plexus-resources-1.1.0.pom (3.2 kB at 530 kB/s)
[windows-jdk10] [INFO] Downloading: https://repo.maven.apache.org/maven2/com/puppycrawl/tools/checkstyle/6.18/checkstyle-6.18.pom
[windows-jdk10] [INFO] Downloaded: https://repo.maven.apache.org/maven2/com/puppycrawl/tools/checkstyle/6.18/checkstyle-6.18.pom (71 kB at 7.1 MB/s)
[windows-jdk10] [INFO] Downloading: https://repo.maven.apache.org/maven2/antlr/antlr/2.7.7/antlr-2.7.7.pom
[windows-jdk10] [INFO] Downloaded: https://repo.maven.apache.org/maven2/antlr/antlr/2.7.7/antlr-2.7.7.pom (632 B at 105 kB/s)
[windows-jdk10] [INFO] Downloading: https://repo.maven.apache.org/maven2/org/antlr/antlr4-runtime/4.5.3/antlr4-runtime-4.5.3.pom
[windows-jdk10] [INFO] Downloaded: https://repo.maven.apache.org/maven2/org/antlr/antlr4-runtime/4.5.3/antlr4-runtime-4.5.3.pom (2.3 kB at 257 kB/s)
[windows-jdk10] [INFO] Downloading: https://repo.maven.apache.org/maven2/org/antlr/antlr4-master/4.5.3/antlr4-master-4.5.3.pom
[windows-jdk10] [INFO] Downloaded: https://repo.maven.apache.org/maven2/org/antlr/antlr4-master/4.5.3/antlr4-master-4.5.3.pom (3.7 kB at 526 kB/s)
[windows-jdk10] [INFO] Downloading: https://repo.maven.apache.org/maven2/commons-beanutils/commons-beanutils/1.9.2/commons-beanutils-1.9.2.pom
[windows-jdk10] [INFO] Downloaded: https://repo.maven.apache.org/maven2/commons-beanutils/commons-beanutils/1.9.2/commons-beanutils-1.9.2.pom (14 kB at 2.0 MB/s)
[windows-jdk10] [INFO] Downloading: https://repo.maven.apache.org/maven2/org/apache/commons/commons-parent/33/commons-parent-33.pom
[windows-jdk10] [INFO] Downloaded: https://repo.maven.apache.org/maven2/org/apache/commons/commons-parent/33/commons-parent-33.pom (53 kB at 5.9 MB/s)
[windows-jdk10] [INFO] Downloading: https://repo.maven.apache.org/maven2/commons-cli/commons-cli/1.3.1/commons-cli-1.3.1.pom
[windows-jdk10] [INFO] Downloaded: https://repo.maven.apache.org/maven2/commons-cli/commons-cli/1.3.1/commons-cli-1.3.1.pom (10 kB at 1.5 MB/s)
[windows-jdk10] [INFO] Downloading: https://repo.maven.apache.org/maven2/com/google/guava/guava/19.0/guava-19.0.pom
[windows-jdk10] [INFO] Downloaded: https://repo.maven.apache.org/maven2/com/google/guava/guava/19.0/guava-19.0.pom (6.8 kB at 679 kB/s)
[windows-jdk10] [INFO] Downloading: https://repo.maven.apache.org/maven2/com/google/guava/guava-parent/19.0/guava-parent-19.0.pom
[windows-jdk10] [INFO] Downloaded: https://repo.maven.apache.org/maven2/com/google/guava/guava-parent/19.0/guava-parent-19.0.pom (9.9 kB at 988 kB/s)
[windows-jdk10] [INFO] Downloading: https://repo.maven.apache.org/maven2/org/sonatype/oss/oss-parent/7/oss-parent-7.pom
[windows-jdk10] [INFO] Downloaded: https://repo.maven.apache.org/maven2/org/sonatype/oss/oss-parent/7/oss-parent-7.pom (4.8 kB at 302 kB/s)
[windows-jdk10] [INFO] Downloading: https://repo.maven.apache.org/maven2/javax/xml/bind/jaxb-api/2.3.0/jaxb-api-2.3.0.pom
[windows-jdk10] [INFO] Downloaded: https://repo.maven.apache.org/maven2/javax/xml/bind/jaxb-api/2.3.0/jaxb-api-2.3.0.pom (23 kB at 270 kB/s)
[windows-jdk10] [INFO] Downloading: https://repo.maven.apache.org/maven2/javax/xml/bind/jaxb-api-parent/2.3.0/jaxb-api-parent-2.3.0.pom
[windows-jdk10] [INFO] Downloaded: https://repo.maven.apache.org/maven2/javax/xml/bind/jaxb-api-parent/2.3.0/jaxb-api-parent-2.3.0.pom (5.6 kB at 376 kB/s)
[windows-jdk10] [INFO] Downloading: https://repo.maven.apache.org/maven2/net/java/jvnet-parent/5/jvnet-parent-5.pom
[windows-jdk10] [INFO] Downloaded: https://repo.maven.apache.org/maven2/net/java/jvnet-parent/5/jvnet-parent-5.pom (8.9 kB at 1.1 MB/s)
[windows-jdk10] [INFO] Downloading: https://repo.maven.apache.org/maven2/commons-logging/commons-logging/1.0.4/commons-logging-1.0.4.jar
[windows-jdk10] [INFO] Downloading: https://repo.maven.apache.org/maven2/org/apache/maven/shared/maven-shared-resources/2/maven-shared-resources-2.jar
[windows-jdk10] [INFO] Downloading: https://repo.maven.apache.org/maven2/org/apache/maven/doxia/doxia-integration-tools/1.6/doxia-integration-tools-1.6.jar
[windows-jdk10] [INFO] Downloading: https://repo.maven.apache.org/maven2/org/apache/maven/doxia/doxia-core/1.2/doxia-core-1.2.jar
[windows-jdk10] [INFO] Downloaded: https://repo.maven.apache.org/maven2/commons-logging/commons-logging/1.0.4/commons-logging-1.0.4.jar (38 kB at 3.5 MB/s)
[windows-jdk10] [INFO] Downloading: https://repo.maven.apache.org/maven2/commons-io/commons-io/1.4/commons-io-1.4.jar
[windows-jdk10] [INFO] Downloading: https://repo.maven.apache.org/maven2/commons-digester/commons-digester/1.6/commons-digester-1.6.jar
[windows-jdk10] [INFO] Downloaded: https://repo.maven.apache.org/maven2/commons-io/commons-io/1.4/commons-io-1.4.jar (109 kB at 4.0 MB/s)
[windows-jdk10] [INFO] Downloading: https://repo.maven.apache.org/maven2/org/codehaus/plexus/plexus-resources/1.1.0/plexus-resources-1.1.0.jar
[windows-jdk10] [INFO] Downloaded: https://repo.maven.apache.org/maven2/org/apache/maven/shared/maven-shared-resources/2/maven-shared-resources-2.jar (13 kB at 421 kB/s)
[windows-jdk10] [INFO] Downloading: https://repo.maven.apache.org/maven2/com/puppycrawl/tools/checkstyle/6.18/checkstyle-6.18.jar
[windows-jdk10] [INFO] Downloaded: https://repo.maven.apache.org/maven2/org/apache/maven/doxia/doxia-integration-tools/1.6/doxia-integration-tools-1.6.jar (45 kB at 1.4 MB/s)
[windows-jdk10] [INFO] Downloading: https://repo.maven.apache.org/maven2/antlr/antlr/2.7.7/antlr-2.7.7.jar
[windows-jdk10] [INFO] Downloaded: https://repo.maven.apache.org/maven2/commons-digester/commons-digester/1.6/commons-digester-1.6.jar (168 kB at 5.1 MB/s)
[windows-jdk10] [INFO] Downloading: https://repo.maven.apache.org/maven2/org/antlr/antlr4-runtime/4.5.3/antlr4-runtime-4.5.3.jar
[windows-jdk10] [INFO] Downloaded: https://repo.maven.apache.org/maven2/org/codehaus/plexus/plexus-resources/1.1.0/plexus-resources-1.1.0.jar (23 kB at 663 kB/s)
[windows-jdk10] [INFO] Downloading: https://repo.maven.apache.org/maven2/commons-beanutils/commons-beanutils/1.9.2/commons-beanutils-1.9.2.jar
[windows-jdk10] [INFO] Downloaded: https://repo.maven.apache.org/maven2/org/apache/maven/doxia/doxia-core/1.2/doxia-core-1.2.jar (154 kB at 4.0 MB/s)
[windows-jdk10] [INFO] Downloading: https://repo.maven.apache.org/maven2/commons-cli/commons-cli/1.3.1/commons-cli-1.3.1.jar
[windows-jdk10] [INFO] Downloaded: https://repo.maven.apache.org/maven2/commons-beanutils/commons-beanutils/1.9.2/commons-beanutils-1.9.2.jar (234 kB at 4.7 MB/s)
[windows-jdk10] [INFO] Downloading: https://repo.maven.apache.org/maven2/com/google/guava/guava/19.0/guava-19.0.jar
[windows-jdk10] [INFO] Downloaded: https://repo.maven.apache.org/maven2/org/antlr/antlr4-runtime/4.5.3/antlr4-runtime-4.5.3.jar (302 kB at 5.7 MB/s)
[windows-jdk10] [INFO] Downloading: https://repo.maven.apache.org/maven2/commons-lang/commons-lang/2.1/commons-lang-2.1.jar
[windows-jdk10] [INFO] Downloaded: https://repo.maven.apache.org/maven2/antlr/antlr/2.7.7/antlr-2.7.7.jar (445 kB at 7.5 MB/s)
[windows-jdk10] [INFO] Downloading: https://repo.maven.apache.org/maven2/javax/xml/bind/jaxb-api/2.3.0/jaxb-api-2.3.0.jar
[windows-jdk10] [INFO] Downloaded: https://repo.maven.apache.org/maven2/commons-cli/commons-cli/1.3.1/commons-cli-1.3.1.jar (53 kB at 803 kB/s)
[windows-jdk10] [INFO] Downloaded: https://repo.maven.apache.org/maven2/commons-lang/commons-lang/2.1/commons-lang-2.1.jar (208 kB at 2.8 MB/s)
[windows-jdk10] [INFO] Downloaded: https://repo.maven.apache.org/maven2/javax/xml/bind/jaxb-api/2.3.0/jaxb-api-2.3.0.jar (126 kB at 1.6 MB/s)
[windows-jdk10] [INFO] Downloaded: https://repo.maven.apache.org/maven2/com/puppycrawl/tools/checkstyle/6.18/checkstyle-6.18.jar (1.2 MB at 13 MB/s)
[windows-jdk10] [INFO] Downloaded: https://repo.maven.apache.org/maven2/com/google/guava/guava/19.0/guava-19.0.jar (2.3 MB at 20 MB/s)
[windows-jdk8] [INFO] run post-build script verify.groovy
[windows-jdk8] [INFO]           evaluate-artifact-with-expression-with-output\pom.xml SUCCESS (11.6 s)
[windows-jdk8] [INFO] Building: evaluate-settings-servers\pom.xml
[windows-jdk9] [INFO] 
[windows-jdk9] [INFO] --- maven-invoker-plugin:3.0.1:verify (integration-test) @ maven-help-plugin ---
[windows-jdk9] [INFO] -------------------------------------------------
[windows-jdk9] [INFO] Build Summary:
[windows-jdk9] [INFO]   Passed: 29, Failed: 0, Errors: 0, Skipped: 0
[windows-jdk9] [INFO] -------------------------------------------------
[windows-jdk9] [INFO] ------------------------------------------------------------------------
[windows-jdk9] [INFO] BUILD SUCCESS
[windows-jdk9] [INFO] ------------------------------------------------------------------------
[windows-jdk9] [INFO] Total time: 03:39 min
[windows-jdk9] [INFO] Finished at: 2018-07-21T09:28:38Z
[windows-jdk9] [INFO] Final Memory: 48M/160M
[windows-jdk9] [INFO] ------------------------------------------------------------------------
[windows-jdk9] [INFO] [jenkins-event-spy] Generated F:\jenkins\jenkins-slave\workspace\ox_maven-help-plugin_master-U66QJWH3TRYC4M2J55DEV6AO7VQ2JW77H5GHKBUOBKZTW32WDTTA@2@tmp\withMaven0eb91377\maven-spy-20180721-092458-3734839424567777942817.log
[Pipeline] [windows-jdk9] }
[Pipeline] [windows-jdk9] // dir
[windows-jdk10] [INFO] 
[windows-jdk10] [INFO] --- maven-invoker-plugin:3.0.1:verify (integration-test) @ maven-help-plugin ---
[windows-jdk10] [INFO] -------------------------------------------------
[windows-jdk10] [INFO] Build Summary:
[windows-jdk10] [INFO]   Passed: 29, Failed: 0, Errors: 0, Skipped: 0
[windows-jdk10] [INFO] -------------------------------------------------
[windows-jdk10] [INFO] ------------------------------------------------------------------------
[windows-jdk10] [INFO] BUILD SUCCESS
[windows-jdk10] [INFO] ------------------------------------------------------------------------
[windows-jdk10] [INFO] Total time: 03:18 min
[windows-jdk10] [INFO] Finished at: 2018-07-21T09:28:40Z
[windows-jdk10] [INFO] Final Memory: 47M/164M
[windows-jdk10] [INFO] ------------------------------------------------------------------------
[windows-jdk10] [INFO] [jenkins-event-spy] Generated F:\jenkins\jenkins-slave\workspace\ox_maven-help-plugin_master-U66QJWH3TRYC4M2J55DEV6AO7VQ2JW77H5GHKBUOBKZTW32WDTTA@2@tmp\withMaven1e002b09\maven-spy-20180721-092521-5914619037480145189751.log
[Pipeline] [windows-jdk9] }
[windows-jdk9] [withMaven] invokerPublisher - Archive invoker results for Maven artifact MavenArtifact{org.apache.maven.plugins:maven-help-plugin::3.1.1-SNAPSHOT(version: 3.1.1-SNAPSHOT, snapshot:false) } generated by PluginInvocation{org.apache.maven.plugins:maven-invoker-plugin:3.0.1@integration-test  integration-test}: m\target\invoker-reports\*.xml
[windows-jdk9] performing MavenInvokerRecorder, reportsFilenamePattern:'**/m\target\invoker-reports/BUILD*.xml', invokerBuildDir:'**/m\target\it'
[windows-jdk9] Found reports:[f:\jenkins\jenkins-slave\workspace\ox_maven-help-plugin_master-U66QJWH3TRYC4M2J55DEV6AO7VQ2JW77H5GHKBUOBKZTW32WDTTA@2\m\target\invoker-reports\BUILD-active-profiles.xml, f:\jenkins\jenkins-slave\workspace\ox_maven-help-plugin_master-U66QJWH3TRYC4M2J55DEV6AO7VQ2JW77H5GHKBUOBKZTW32WDTTA@2\m\target\invoker-reports\BUILD-active-profiles_multimodule.xml, f:\jenkins\jenkins-slave\workspace\ox_maven-help-plugin_master-U66QJWH3TRYC4M2J55DEV6AO7VQ2JW77H5GHKBUOBKZTW32WDTTA@2\m\target\invoker-reports\BUILD-all-profiles-parent-pom.xml, f:\jenkins\jenkins-slave\workspace\ox_maven-help-plugin_master-U66QJWH3TRYC4M2J55DEV6AO7VQ2JW77H5GHKBUOBKZTW32WDTTA@2\m\target\invoker-reports\BUILD-all-profiles.xml, f:\jenkins\jenkins-slave\workspace\ox_maven-help-plugin_master-U66QJWH3TRYC4M2J55DEV6AO7VQ2JW77H5GHKBUOBKZTW32WDTTA@2\m\target\invoker-reports\BUILD-describe-cmd-invalid.xml, f:\jenkins\jenkins-slave\workspace\ox_maven-help-plugin_master-U66QJWH3TRYC4M2J55DEV6AO7VQ2JW77H5GHKBUOBKZTW32WDTTA@2\m\target\invoker-reports\BUILD-describe-cmd-with-goal-invalid.xml, f:\jenkins\jenkins-slave\workspace\ox_maven-help-plugin_master-U66QJWH3TRYC4M2J55DEV6AO7VQ2JW77H5GHKBUOBKZTW32WDTTA@2\m\target\invoker-reports\BUILD-describe-cmd-with-goal-report.xml, f:\jenkins\jenkins-slave\workspace\ox_maven-help-plugin_master-U66QJWH3TRYC4M2J55DEV6AO7VQ2JW77H5GHKBUOBKZTW32WDTTA@2\m\target\invoker-reports\BUILD-describe-cmd-with-goal.xml, f:\jenkins\jenkins-slave\workspace\ox_maven-help-plugin_master-U66QJWH3TRYC4M2J55DEV6AO7VQ2JW77H5GHKBUOBKZTW32WDTTA@2\m\target\invoker-reports\BUILD-describe-cmd.xml, f:\jenkins\jenkins-slave\workspace\ox_maven-help-plugin_master-U66QJWH3TRYC4M2J55DEV6AO7VQ2JW77H5GHKBUOBKZTW32WDTTA@2\m\target\invoker-reports\BUILD-describe-ga.xml, f:\jenkins\jenkins-slave\workspace\ox_maven-help-plugin_master-U66QJWH3TRYC4M2J55DEV6AO7VQ2JW77H5GHKBUOBKZTW32WDTTA@2\m\target\invoker-reports\BUILD-describe-gav.xml, f:\jenkins\jenkins-slave\workspace\ox_maven-help-plugin_master-U66QJWH3TRYC4M2J55DEV6AO7VQ2JW77H5GHKBUOBKZTW32WDTTA@2\m\target\invoker-reports\BUILD-describe-plugin-in-plugin-management.xml, f:\jenkins\jenkins-slave\workspace\ox_maven-help-plugin_master-U66QJWH3TRYC4M2J55DEV6AO7VQ2JW77H5GHKBUOBKZTW32WDTTA@2\m\target\invoker-reports\BUILD-describe-plugin-without-name.xml, f:\jenkins\jenkins-slave\workspace\ox_maven-help-plugin_master-U66QJWH3TRYC4M2J55DEV6AO7VQ2JW77H5GHKBUOBKZTW32WDTTA@2\m\target\invoker-reports\BUILD-describe-prefix-and-invalid-mojo.xml, f:\jenkins\jenkins-slave\workspace\ox_maven-help-plugin_master-U66QJWH3TRYC4M2J55DEV6AO7VQ2JW77H5GHKBUOBKZTW32WDTTA@2\m\target\invoker-reports\BUILD-describe-prefix-and-mojo.xml, f:\jenkins\jenkins-slave\workspace\ox_maven-help-plugin_master-U66QJWH3TRYC4M2J55DEV6AO7VQ2JW77H5GHKBUOBKZTW32WDTTA@2\m\target\invoker-reports\BUILD-describe-prefix.xml, f:\jenkins\jenkins-slave\workspace\ox_maven-help-plugin_master-U66QJWH3TRYC4M2J55DEV6AO7VQ2JW77H5GHKBUOBKZTW32WDTTA@2\m\target\invoker-reports\BUILD-effective-pom-artifact.xml, f:\jenkins\jenkins-slave\workspace\ox_maven-help-plugin_master-U66QJWH3TRYC4M2J55DEV6AO7VQ2JW77H5GHKBUOBKZTW32WDTTA@2\m\target\invoker-reports\BUILD-effective-pom-from-lifecycle.xml, f:\jenkins\jenkins-slave\workspace\ox_maven-help-plugin_master-U66QJWH3TRYC4M2J55DEV6AO7VQ2JW77H5GHKBUOBKZTW32WDTTA@2\m\target\invoker-reports\BUILD-effective-pom-multimodule-unlink-parent.xml, f:\jenkins\jenkins-slave\workspace\ox_maven-help-plugin_master-U66QJWH3TRYC4M2J55DEV6AO7VQ2JW77H5GHKBUOBKZTW32WDTTA@2\m\target\invoker-reports\BUILD-effective-pom-multimodule.xml, f:\jenkins\jenkins-slave\workspace\ox_maven-help-plugin_master-U66QJWH3TRYC4M2J55DEV6AO7VQ2JW77H5GHKBUOBKZTW32WDTTA@2\m\target\invoker-reports\BUILD-effective-pom.xml, f:\jenkins\jenkins-slave\workspace\ox_maven-help-plugin_master-U66QJWH3TRYC4M2J55DEV6AO7VQ2JW77H5GHKBUOBKZTW32WDTTA@2\m\target\invoker-reports\BUILD-effective-pom_properties.xml, f:\jenkins\jenkins-slave\workspace\ox_maven-help-plugin_master-U66QJWH3TRYC4M2J55DEV6AO7VQ2JW77H5GHKBUOBKZTW32WDTTA@2\m\target\invoker-reports\BUILD-effective-settings.xml, f:\jenkins\jenkins-slave\workspace\ox_maven-help-plugin_master-U66QJWH3TRYC4M2J55DEV6AO7VQ2JW77H5GHKBUOBKZTW32WDTTA@2\m\target\invoker-reports\BUILD-effective-settings_deep-clone.xml, f:\jenkins\jenkins-slave\workspace\ox_maven-help-plugin_master-U66QJWH3TRYC4M2J55DEV6AO7VQ2JW77H5GHKBUOBKZTW32WDTTA@2\m\target\invoker-reports\BUILD-evaluate-artifact-with-expression-with-output.xml, f:\jenkins\jenkins-slave\workspace\ox_maven-help-plugin_master-U66QJWH3TRYC4M2J55DEV6AO7VQ2JW77H5GHKBUOBKZTW32WDTTA@2\m\target\invoker-reports\BUILD-evaluate-settings-servers.xml, f:\jenkins\jenkins-slave\workspace\ox_maven-help-plugin_master-U66QJWH3TRYC4M2J55DEV6AO7VQ2JW77H5GHKBUOBKZTW32WDTTA@2\m\target\invoker-reports\BUILD-evaluate-with-expression-with-output.xml, f:\jenkins\jenkins-slave\workspace\ox_maven-help-plugin_master-U66QJWH3TRYC4M2J55DEV6AO7VQ2JW77H5GHKBUOBKZTW32WDTTA@2\m\target\invoker-reports\BUILD-evaluate.xml, f:\jenkins\jenkins-slave\workspace\ox_maven-help-plugin_master-U66QJWH3TRYC4M2J55DEV6AO7VQ2JW77H5GHKBUOBKZTW32WDTTA@2\m\target\invoker-reports\BUILD-system.xml]
[windows-jdk9] Found logs:[f:\jenkins\jenkins-slave\workspace\ox_maven-help-plugin_master-U66QJWH3TRYC4M2J55DEV6AO7VQ2JW77H5GHKBUOBKZTW32WDTTA@2\m\target\it\active-profiles\build.log, f:\jenkins\jenkins-slave\workspace\ox_maven-help-plugin_master-U66QJWH3TRYC4M2J55DEV6AO7VQ2JW77H5GHKBUOBKZTW32WDTTA@2\m\target\it\active-profiles_multimodule\build.log, f:\jenkins\jenkins-slave\workspace\ox_maven-help-plugin_master-U66QJWH3TRYC4M2J55DEV6AO7VQ2JW77H5GHKBUOBKZTW32WDTTA@2\m\target\it\all-profiles-parent-pom\build.log, f:\jenkins\jenkins-slave\workspace\ox_maven-help-plugin_master-U66QJWH3TRYC4M2J55DEV6AO7VQ2JW77H5GHKBUOBKZTW32WDTTA@2\m\target\it\all-profiles\build.log, f:\jenkins\jenkins-slave\workspace\ox_maven-help-plugin_master-U66QJWH3TRYC4M2J55DEV6AO7VQ2JW77H5GHKBUOBKZTW32WDTTA@2\m\target\it\describe-cmd-invalid\build.log, f:\jenkins\jenkins-slave\workspace\ox_maven-help-plugin_master-U66QJWH3TRYC4M2J55DEV6AO7VQ2JW77H5GHKBUOBKZTW32WDTTA@2\m\target\it\describe-cmd-with-goal-invalid\build.log, f:\jenkins\jenkins-slave\workspace\ox_maven-help-plugin_master-U66QJWH3TRYC4M2J55DEV6AO7VQ2JW77H5GHKBUOBKZTW32WDTTA@2\m\target\it\describe-cmd-with-goal-report\build.log, f:\jenkins\jenkins-slave\workspace\ox_maven-help-plugin_master-U66QJWH3TRYC4M2J55DEV6AO7VQ2JW77H5GHKBUOBKZTW32WDTTA@2\m\target\it\describe-cmd-with-goal\build.log, f:\jenkins\jenkins-slave\workspace\ox_maven-help-plugin_master-U66QJWH3TRYC4M2J55DEV6AO7VQ2JW77H5GHKBUOBKZTW32WDTTA@2\m\target\it\describe-cmd\build.log, f:\jenkins\jenkins-slave\workspace\ox_maven-help-plugin_master-U66QJWH3TRYC4M2J55DEV6AO7VQ2JW77H5GHKBUOBKZTW32WDTTA@2\m\target\it\describe-ga\build.log, f:\jenkins\jenkins-slave\workspace\ox_maven-help-plugin_master-U66QJWH3TRYC4M2J55DEV6AO7VQ2JW77H5GHKBUOBKZTW32WDTTA@2\m\target\it\describe-gav\build.log, f:\jenkins\jenkins-slave\workspace\ox_maven-help-plugin_master-U66QJWH3TRYC4M2J55DEV6AO7VQ2JW77H5GHKBUOBKZTW32WDTTA@2\m\target\it\describe-plugin-in-plugin-management\build.log, f:\jenkins\jenkins-slave\workspace\ox_maven-help-plugin_master-U66QJWH3TRYC4M2J55DEV6AO7VQ2JW77H5GHKBUOBKZTW32WDTTA@2\m\target\it\describe-plugin-without-name\build.log, f:\jenkins\jenkins-slave\workspace\ox_maven-help-plugin_master-U66QJWH3TRYC4M2J55DEV6AO7VQ2JW77H5GHKBUOBKZTW32WDTTA@2\m\target\it\describe-prefix-and-invalid-mojo\build.log, f:\jenkins\jenkins-slave\workspace\ox_maven-help-plugin_master-U66QJWH3TRYC4M2J55DEV6AO7VQ2JW77H5GHKBUOBKZTW32WDTTA@2\m\target\it\describe-prefix-and-mojo\build.log, f:\jenkins\jenkins-slave\workspace\ox_maven-help-plugin_master-U66QJWH3TRYC4M2J55DEV6AO7VQ2JW77H5GHKBUOBKZTW32WDTTA@2\m\target\it\describe-prefix\build.log, f:\jenkins\jenkins-slave\workspace\ox_maven-help-plugin_master-U66QJWH3TRYC4M2J55DEV6AO7VQ2JW77H5GHKBUOBKZTW32WDTTA@2\m\target\it\effective-pom-artifact\build.log, f:\jenkins\jenkins-slave\workspace\ox_maven-help-plugin_master-U66QJWH3TRYC4M2J55DEV6AO7VQ2JW77H5GHKBUOBKZTW32WDTTA@2\m\target\it\effective-pom-from-lifecycle\build.log, f:\jenkins\jenkins-slave\workspace\ox_maven-help-plugin_master-U66QJWH3TRYC4M2J55DEV6AO7VQ2JW77H5GHKBUOBKZTW32WDTTA@2\m\target\it\effective-pom-multimodule-unlink-parent\build.log, f:\jenkins\jenkins-slave\workspace\ox_maven-help-plugin_master-U66QJWH3TRYC4M2J55DEV6AO7VQ2JW77H5GHKBUOBKZTW32WDTTA@2\m\target\it\effective-pom-multimodule\build.log, f:\jenkins\jenkins-slave\workspace\ox_maven-help-plugin_master-U66QJWH3TRYC4M2J55DEV6AO7VQ2JW77H5GHKBUOBKZTW32WDTTA@2\m\target\it\effective-pom\build.log, f:\jenkins\jenkins-slave\workspace\ox_maven-help-plugin_master-U66QJWH3TRYC4M2J55DEV6AO7VQ2JW77H5GHKBUOBKZTW32WDTTA@2\m\target\it\effective-pom_properties\build.log, f:\jenkins\jenkins-slave\workspace\ox_maven-help-plugin_master-U66QJWH3TRYC4M2J55DEV6AO7VQ2JW77H5GHKBUOBKZTW32WDTTA@2\m\target\it\effective-settings\build.log, f:\jenkins\jenkins-slave\workspace\ox_maven-help-plugin_master-U66QJWH3TRYC4M2J55DEV6AO7VQ2JW77H5GHKBUOBKZTW32WDTTA@2\m\target\it\effective-settings_deep-clone\build.log, f:\jenkins\jenkins-slave\workspace\ox_maven-help-plugin_master-U66QJWH3TRYC4M2J55DEV6AO7VQ2JW77H5GHKBUOBKZTW32WDTTA@2\m\target\it\evaluate-artifact-with-expression-with-output\build.log, f:\jenkins\jenkins-slave\workspace\ox_maven-help-plugin_master-U66QJWH3TRYC4M2J55DEV6AO7VQ2JW77H5GHKBUOBKZTW32WDTTA@2\m\target\it\evaluate-settings-servers\build.log, f:\jenkins\jenkins-slave\workspace\ox_maven-help-plugin_master-U66QJWH3TRYC4M2J55DEV6AO7VQ2JW77H5GHKBUOBKZTW32WDTTA@2\m\target\it\evaluate-with-expression-with-output\build.log, f:\jenkins\jenkins-slave\workspace\ox_maven-help-plugin_master-U66QJWH3TRYC4M2J55DEV6AO7VQ2JW77H5GHKBUOBKZTW32WDTTA@2\m\target\it\evaluate\build.log, f:\jenkins\jenkins-slave\workspace\ox_maven-help-plugin_master-U66QJWH3TRYC4M2J55DEV6AO7VQ2JW77H5GHKBUOBKZTW32WDTTA@2\m\target\it\system\build.log]
[windows-jdk9] Finished parsing Maven Invoker results (found 29)
[windows-jdk9] [withMaven] junitPublisher - Archive test results for Maven artifact org.apache.maven.plugins:maven-help-plugin:3.1.1-SNAPSHOT generated by maven-surefire-plugin:test (default-test): m\target\surefire-reports\*.xml
[windows-jdk9] Recording test results
[windows-jdk9] None of the test reports contained any result
[Pipeline] [windows-jdk9] // withMaven
[Pipeline] [windows-jdk9] }
[Pipeline] [windows-jdk10] }
[Pipeline] [windows-jdk9] // stage
[Pipeline] [windows-jdk10] // dir
[windows-jdk8] [INFO] run post-build script verify.groovy
[windows-jdk8] [INFO]           evaluate-settings-servers\pom.xml ................ SUCCESS (5.7 s)
[windows-jdk8] [INFO] Building: evaluate-with-expression-with-output\pom.xml
[windows-jdk8] [INFO] run post-build script verify.groovy
[windows-jdk8] [INFO]           evaluate-with-expression-with-output\pom.xml ..... SUCCESS (4.0 s)
[windows-jdk8] [INFO] Building: system\pom.xml
[windows-jdk8] [INFO]           system\pom.xml ................................... SUCCESS (3.9 s)
[windows-jdk8] [INFO] 
[windows-jdk8] [INFO] --- maven-checkstyle-plugin:3.0.0:check (checkstyle-check) @ maven-help-plugin ---
[windows-jdk8] [INFO] Downloading: https://repo.maven.apache.org/maven2/org/apache/maven/shared/maven-shared-resources/2/maven-shared-resources-2.pom
[windows-jdk8] [INFO] Downloaded: https://repo.maven.apache.org/maven2/org/apache/maven/shared/maven-shared-resources/2/maven-shared-resources-2.pom (3.0 kB at 370 kB/s)
[windows-jdk8] [INFO] Downloading: https://repo.maven.apache.org/maven2/org/codehaus/plexus/plexus-utils/3.0.10/plexus-utils-3.0.10.pom
[windows-jdk8] [INFO] Downloaded: https://repo.maven.apache.org/maven2/org/codehaus/plexus/plexus-utils/3.0.10/plexus-utils-3.0.10.pom (3.1 kB at 629 kB/s)
[windows-jdk8] [INFO] Downloading: https://repo.maven.apache.org/maven2/org/codehaus/plexus/plexus/3.3/plexus-3.3.pom
[windows-jdk8] [INFO] Downloaded: https://repo.maven.apache.org/maven2/org/codehaus/plexus/plexus/3.3/plexus-3.3.pom (20 kB at 3.3 MB/s)
[windows-jdk8] [INFO] Downloading: https://repo.maven.apache.org/maven2/org/apache/maven/doxia/doxia-integration-tools/1.6/doxia-integration-tools-1.6.pom
[windows-jdk8] [INFO] Downloaded: https://repo.maven.apache.org/maven2/org/apache/maven/doxia/doxia-integration-tools/1.6/doxia-integration-tools-1.6.pom (7.0 kB at 1.2 MB/s)
[windows-jdk8] [INFO] Downloading: https://repo.maven.apache.org/maven2/org/apache/maven/doxia/doxia-tools/3/doxia-tools-3.pom
[windows-jdk8] [INFO] Downloaded: https://repo.maven.apache.org/maven2/org/apache/maven/doxia/doxia-tools/3/doxia-tools-3.pom (9.9 kB at 2.0 MB/s)
[windows-jdk8] [INFO] Downloading: https://repo.maven.apache.org/maven2/org/codehaus/plexus/plexus-resources/1.1.0/plexus-resources-1.1.0.pom
[windows-jdk8] [INFO] Downloaded: https://repo.maven.apache.org/maven2/org/codehaus/plexus/plexus-resources/1.1.0/plexus-resources-1.1.0.pom (3.2 kB at 635 kB/s)
[windows-jdk8] [INFO] Downloading: https://repo.maven.apache.org/maven2/com/puppycrawl/tools/checkstyle/6.18/checkstyle-6.18.pom
[windows-jdk8] [INFO] Downloaded: https://repo.maven.apache.org/maven2/com/puppycrawl/tools/checkstyle/6.18/checkstyle-6.18.pom (71 kB at 7.9 MB/s)
[windows-jdk8] [INFO] Downloading: https://repo.maven.apache.org/maven2/antlr/antlr/2.7.7/antlr-2.7.7.pom
[windows-jdk8] [INFO] Downloaded: https://repo.maven.apache.org/maven2/antlr/antlr/2.7.7/antlr-2.7.7.pom (632 B at 126 kB/s)
[windows-jdk8] [INFO] Downloading: https://repo.maven.apache.org/maven2/org/antlr/antlr4-runtime/4.5.3/antlr4-runtime-4.5.3.pom
[windows-jdk8] [INFO] Downloaded: https://repo.maven.apache.org/maven2/org/antlr/antlr4-runtime/4.5.3/antlr4-runtime-4.5.3.pom (2.3 kB at 462 kB/s)
[windows-jdk8] [INFO] Downloading: https://repo.maven.apache.org/maven2/org/antlr/antlr4-master/4.5.3/antlr4-master-4.5.3.pom
[windows-jdk8] [INFO] Downloaded: https://repo.maven.apache.org/maven2/org/antlr/antlr4-master/4.5.3/antlr4-master-4.5.3.pom (3.7 kB at 737 kB/s)
[windows-jdk8] [INFO] Downloading: https://repo.maven.apache.org/maven2/commons-beanutils/commons-beanutils/1.9.2/commons-beanutils-1.9.2.pom
[windows-jdk8] [INFO] Downloaded: https://repo.maven.apache.org/maven2/commons-beanutils/commons-beanutils/1.9.2/commons-beanutils-1.9.2.pom (14 kB at 2.4 MB/s)
[windows-jdk8] [INFO] Downloading: https://repo.maven.apache.org/maven2/org/apache/commons/commons-parent/33/commons-parent-33.pom
[windows-jdk8] [INFO] Downloaded: https://repo.maven.apache.org/maven2/org/apache/commons/commons-parent/33/commons-parent-33.pom (53 kB at 7.6 MB/s)
[windows-jdk8] [INFO] Downloading: https://repo.maven.apache.org/maven2/commons-cli/commons-cli/1.3.1/commons-cli-1.3.1.pom
[windows-jdk8] [INFO] Downloaded: https://repo.maven.apache.org/maven2/commons-cli/commons-cli/1.3.1/commons-cli-1.3.1.pom (10 kB at 2.1 MB/s)
[windows-jdk8] [INFO] Downloading: https://repo.maven.apache.org/maven2/com/google/guava/guava/19.0/guava-19.0.pom
[windows-jdk8] [INFO] Downloaded: https://repo.maven.apache.org/maven2/com/google/guava/guava/19.0/guava-19.0.pom (6.8 kB at 1.1 MB/s)
[windows-jdk8] [INFO] Downloading: https://repo.maven.apache.org/maven2/com/google/guava/guava-parent/19.0/guava-parent-19.0.pom
[windows-jdk8] [INFO] Downloaded: https://repo.maven.apache.org/maven2/com/google/guava/guava-parent/19.0/guava-parent-19.0.pom (9.9 kB at 1.6 MB/s)
[windows-jdk8] [INFO] Downloading: https://repo.maven.apache.org/maven2/org/sonatype/oss/oss-parent/7/oss-parent-7.pom
[windows-jdk8] [INFO] Downloaded: https://repo.maven.apache.org/maven2/org/sonatype/oss/oss-parent/7/oss-parent-7.pom (4.8 kB at 965 kB/s)
[windows-jdk8] [INFO] Downloading: https://repo.maven.apache.org/maven2/commons-digester/commons-digester/1.6/commons-digester-1.6.jar
[windows-jdk8] [INFO] Downloading: https://repo.maven.apache.org/maven2/commons-logging/commons-logging/1.0.4/commons-logging-1.0.4.jar
[windows-jdk8] [INFO] Downloading: https://repo.maven.apache.org/maven2/org/apache/maven/doxia/doxia-integration-tools/1.6/doxia-integration-tools-1.6.jar
[windows-jdk8] [INFO] Downloading: https://repo.maven.apache.org/maven2/org/apache/maven/shared/maven-shared-resources/2/maven-shared-resources-2.jar
[windows-jdk8] [INFO] Downloading: https://repo.maven.apache.org/maven2/org/apache/maven/doxia/doxia-core/1.2/doxia-core-1.2.jar
[windows-jdk8] [INFO] Downloaded: https://repo.maven.apache.org/maven2/commons-logging/commons-logging/1.0.4/commons-logging-1.0.4.jar (38 kB at 1.3 MB/s)
[windows-jdk8] [INFO] Downloading: https://repo.maven.apache.org/maven2/commons-io/commons-io/1.4/commons-io-1.4.jar
[windows-jdk8] [INFO] Downloaded: https://repo.maven.apache.org/maven2/commons-io/commons-io/1.4/commons-io-1.4.jar (109 kB at 2.4 MB/s)
[windows-jdk8] [INFO] Downloaded: https://repo.maven.apache.org/maven2/commons-digester/commons-digester/1.6/commons-digester-1.6.jar (168 kB at 3.6 MB/s)
[windows-jdk8] [INFO] Downloading: https://repo.maven.apache.org/maven2/org/codehaus/plexus/plexus-resources/1.1.0/plexus-resources-1.1.0.jar
[windows-jdk8] [INFO] Downloading: https://repo.maven.apache.org/maven2/com/puppycrawl/tools/checkstyle/6.18/checkstyle-6.18.jar
[windows-jdk8] [INFO] Downloaded: https://repo.maven.apache.org/maven2/org/apache/maven/shared/maven-shared-resources/2/maven-shared-resources-2.jar (13 kB at 251 kB/s)
[windows-jdk8] [INFO] Downloading: https://repo.maven.apache.org/maven2/antlr/antlr/2.7.7/antlr-2.7.7.jar
[windows-jdk8] [INFO] Downloaded: https://repo.maven.apache.org/maven2/org/apache/maven/doxia/doxia-integration-tools/1.6/doxia-integration-tools-1.6.jar (45 kB at 697 kB/s)
[windows-jdk8] [INFO] Downloading: https://repo.maven.apache.org/maven2/org/antlr/antlr4-runtime/4.5.3/antlr4-runtime-4.5.3.jar
[windows-jdk8] [INFO] Downloaded: https://repo.maven.apache.org/maven2/org/codehaus/plexus/plexus-resources/1.1.0/plexus-resources-1.1.0.jar (23 kB at 327 kB/s)
[windows-jdk8] [INFO] Downloading: https://repo.maven.apache.org/maven2/commons-beanutils/commons-beanutils/1.9.2/commons-beanutils-1.9.2.jar
[windows-jdk8] [INFO] Downloaded: https://repo.maven.apache.org/maven2/org/apache/maven/doxia/doxia-core/1.2/doxia-core-1.2.jar (154 kB at 2.1 MB/s)
[windows-jdk8] [INFO] Downloading: https://repo.maven.apache.org/maven2/commons-cli/commons-cli/1.3.1/commons-cli-1.3.1.jar
[windows-jdk8] [INFO] Downloaded: https://repo.maven.apache.org/maven2/antlr/antlr/2.7.7/antlr-2.7.7.jar (445 kB at 5.2 MB/s)
[windows-jdk8] [INFO] Downloading: https://repo.maven.apache.org/maven2/com/google/guava/guava/19.0/guava-19.0.jar
[windows-jdk8] [INFO] Downloaded: https://repo.maven.apache.org/maven2/org/antlr/antlr4-runtime/4.5.3/antlr4-runtime-4.5.3.jar (302 kB at 3.4 MB/s)
[windows-jdk8] [INFO] Downloading: https://repo.maven.apache.org/maven2/commons-lang/commons-lang/2.1/commons-lang-2.1.jar
[windows-jdk8] [INFO] Downloaded: https://repo.maven.apache.org/maven2/commons-beanutils/commons-beanutils/1.9.2/commons-beanutils-1.9.2.jar (234 kB at 2.7 MB/s)
[windows-jdk8] [INFO] Downloaded: https://repo.maven.apache.org/maven2/commons-lang/commons-lang/2.1/commons-lang-2.1.jar (208 kB at 1.9 MB/s)
[windows-jdk8] [INFO] Downloaded: https://repo.maven.apache.org/maven2/com/puppycrawl/tools/checkstyle/6.18/checkstyle-6.18.jar (1.2 MB at 10 MB/s)
[windows-jdk8] [INFO] Downloaded: https://repo.maven.apache.org/maven2/commons-cli/commons-cli/1.3.1/commons-cli-1.3.1.jar (53 kB at 469 kB/s)
[windows-jdk8] [INFO] Downloaded: https://repo.maven.apache.org/maven2/com/google/guava/guava/19.0/guava-19.0.jar (2.3 MB at 13 MB/s)
[windows-jdk8] [INFO] 
[windows-jdk8] [INFO] --- maven-invoker-plugin:3.0.1:verify (integration-test) @ maven-help-plugin ---
[windows-jdk8] [INFO] -------------------------------------------------
[windows-jdk8] [INFO] Build Summary:
[windows-jdk8] [INFO]   Passed: 29, Failed: 0, Errors: 0, Skipped: 0
[windows-jdk8] [INFO] -------------------------------------------------
[windows-jdk8] [INFO] ------------------------------------------------------------------------
[windows-jdk8] [INFO] BUILD SUCCESS
[windows-jdk8] [INFO] ------------------------------------------------------------------------
[windows-jdk8] [INFO] Total time: 04:20 min
[windows-jdk8] [INFO] Finished at: 2018-07-21T09:28:53Z
[windows-jdk8] [INFO] Final Memory: 62M/1131M
[windows-jdk8] [INFO] ------------------------------------------------------------------------
[windows-jdk8] [INFO] [jenkins-event-spy] Generated F:\jenkins\jenkins-slave\workspace\ox_maven-help-plugin_master-U66QJWH3TRYC4M2J55DEV6AO7VQ2JW77H5GHKBUOBKZTW32WDTTA@tmp\withMaven444fa327\maven-spy-20180721-092433-3077713961112629397266.log
[windows-jdk8] Picked up JAVA_TOOL_OPTIONS: -Dmaven.ext.class.path="f:\jenkins\jenkins-slave\workspace\ox_maven-help-plugin_master-U66QJWH3TRYC4M2J55DEV6AO7VQ2JW77H5GHKBUOBKZTW32WDTTA@tmp\withMaven444fa327\pipeline-maven-spy.jar" -Dorg.jenkinsci.plugins.pipeline.maven.reportsFolder="f:\jenkins\jenkins-slave\workspace\ox_maven-help-plugin_master-U66QJWH3TRYC4M2J55DEV6AO7VQ2JW77H5GHKBUOBKZTW32WDTTA@tmp\withMaven444fa327" 
[Pipeline] [windows-jdk9] }
[Pipeline] [windows-jdk10] }
[windows-jdk10] [withMaven] invokerPublisher - Archive invoker results for Maven artifact MavenArtifact{org.apache.maven.plugins:maven-help-plugin::3.1.1-SNAPSHOT(version: 3.1.1-SNAPSHOT, snapshot:false) } generated by PluginInvocation{org.apache.maven.plugins:maven-invoker-plugin:3.0.1@integration-test  integration-test}: m\target\invoker-reports\*.xml
[windows-jdk10] performing MavenInvokerRecorder, reportsFilenamePattern:'**/m\target\invoker-reports/BUILD*.xml', invokerBuildDir:'**/m\target\it'
[windows-jdk10] Found reports:[f:\jenkins\jenkins-slave\workspace\ox_maven-help-plugin_master-U66QJWH3TRYC4M2J55DEV6AO7VQ2JW77H5GHKBUOBKZTW32WDTTA@2\m\target\invoker-reports\BUILD-active-profiles.xml, f:\jenkins\jenkins-slave\workspace\ox_maven-help-plugin_master-U66QJWH3TRYC4M2J55DEV6AO7VQ2JW77H5GHKBUOBKZTW32WDTTA@2\m\target\invoker-reports\BUILD-active-profiles_multimodule.xml, f:\jenkins\jenkins-slave\workspace\ox_maven-help-plugin_master-U66QJWH3TRYC4M2J55DEV6AO7VQ2JW77H5GHKBUOBKZTW32WDTTA@2\m\target\invoker-reports\BUILD-all-profiles-parent-pom.xml, f:\jenkins\jenkins-slave\workspace\ox_maven-help-plugin_master-U66QJWH3TRYC4M2J55DEV6AO7VQ2JW77H5GHKBUOBKZTW32WDTTA@2\m\target\invoker-reports\BUILD-all-profiles.xml, f:\jenkins\jenkins-slave\workspace\ox_maven-help-plugin_master-U66QJWH3TRYC4M2J55DEV6AO7VQ2JW77H5GHKBUOBKZTW32WDTTA@2\m\target\invoker-reports\BUILD-describe-cmd-invalid.xml, f:\jenkins\jenkins-slave\workspace\ox_maven-help-plugin_master-U66QJWH3TRYC4M2J55DEV6AO7VQ2JW77H5GHKBUOBKZTW32WDTTA@2\m\target\invoker-reports\BUILD-describe-cmd-with-goal-invalid.xml, f:\jenkins\jenkins-slave\workspace\ox_maven-help-plugin_master-U66QJWH3TRYC4M2J55DEV6AO7VQ2JW77H5GHKBUOBKZTW32WDTTA@2\m\target\invoker-reports\BUILD-describe-cmd-with-goal-report.xml, f:\jenkins\jenkins-slave\workspace\ox_maven-help-plugin_master-U66QJWH3TRYC4M2J55DEV6AO7VQ2JW77H5GHKBUOBKZTW32WDTTA@2\m\target\invoker-reports\BUILD-describe-cmd-with-goal.xml, f:\jenkins\jenkins-slave\workspace\ox_maven-help-plugin_master-U66QJWH3TRYC4M2J55DEV6AO7VQ2JW77H5GHKBUOBKZTW32WDTTA@2\m\target\invoker-reports\BUILD-describe-cmd.xml, f:\jenkins\jenkins-slave\workspace\ox_maven-help-plugin_master-U66QJWH3TRYC4M2J55DEV6AO7VQ2JW77H5GHKBUOBKZTW32WDTTA@2\m\target\invoker-reports\BUILD-describe-ga.xml, f:\jenkins\jenkins-slave\workspace\ox_maven-help-plugin_master-U66QJWH3TRYC4M2J55DEV6AO7VQ2JW77H5GHKBUOBKZTW32WDTTA@2\m\target\invoker-reports\BUILD-describe-gav.xml, f:\jenkins\jenkins-slave\workspace\ox_maven-help-plugin_master-U66QJWH3TRYC4M2J55DEV6AO7VQ2JW77H5GHKBUOBKZTW32WDTTA@2\m\target\invoker-reports\BUILD-describe-plugin-in-plugin-management.xml, f:\jenkins\jenkins-slave\workspace\ox_maven-help-plugin_master-U66QJWH3TRYC4M2J55DEV6AO7VQ2JW77H5GHKBUOBKZTW32WDTTA@2\m\target\invoker-reports\BUILD-describe-plugin-without-name.xml, f:\jenkins\jenkins-slave\workspace\ox_maven-help-plugin_master-U66QJWH3TRYC4M2J55DEV6AO7VQ2JW77H5GHKBUOBKZTW32WDTTA@2\m\target\invoker-reports\BUILD-describe-prefix-and-invalid-mojo.xml, f:\jenkins\jenkins-slave\workspace\ox_maven-help-plugin_master-U66QJWH3TRYC4M2J55DEV6AO7VQ2JW77H5GHKBUOBKZTW32WDTTA@2\m\target\invoker-reports\BUILD-describe-prefix-and-mojo.xml, f:\jenkins\jenkins-slave\workspace\ox_maven-help-plugin_master-U66QJWH3TRYC4M2J55DEV6AO7VQ2JW77H5GHKBUOBKZTW32WDTTA@2\m\target\invoker-reports\BUILD-describe-prefix.xml, f:\jenkins\jenkins-slave\workspace\ox_maven-help-plugin_master-U66QJWH3TRYC4M2J55DEV6AO7VQ2JW77H5GHKBUOBKZTW32WDTTA@2\m\target\invoker-reports\BUILD-effective-pom-artifact.xml, f:\jenkins\jenkins-slave\workspace\ox_maven-help-plugin_master-U66QJWH3TRYC4M2J55DEV6AO7VQ2JW77H5GHKBUOBKZTW32WDTTA@2\m\target\invoker-reports\BUILD-effective-pom-from-lifecycle.xml, f:\jenkins\jenkins-slave\workspace\ox_maven-help-plugin_master-U66QJWH3TRYC4M2J55DEV6AO7VQ2JW77H5GHKBUOBKZTW32WDTTA@2\m\target\invoker-reports\BUILD-effective-pom-multimodule-unlink-parent.xml, f:\jenkins\jenkins-slave\workspace\ox_maven-help-plugin_master-U66QJWH3TRYC4M2J55DEV6AO7VQ2JW77H5GHKBUOBKZTW32WDTTA@2\m\target\invoker-reports\BUILD-effective-pom-multimodule.xml, f:\jenkins\jenkins-slave\workspace\ox_maven-help-plugin_master-U66QJWH3TRYC4M2J55DEV6AO7VQ2JW77H5GHKBUOBKZTW32WDTTA@2\m\target\invoker-reports\BUILD-effective-pom.xml, f:\jenkins\jenkins-slave\workspace\ox_maven-help-plugin_master-U66QJWH3TRYC4M2J55DEV6AO7VQ2JW77H5GHKBUOBKZTW32WDTTA@2\m\target\invoker-reports\BUILD-effective-pom_properties.xml, f:\jenkins\jenkins-slave\workspace\ox_maven-help-plugin_master-U66QJWH3TRYC4M2J55DEV6AO7VQ2JW77H5GHKBUOBKZTW32WDTTA@2\m\target\invoker-reports\BUILD-effective-settings.xml, f:\jenkins\jenkins-slave\workspace\ox_maven-help-plugin_master-U66QJWH3TRYC4M2J55DEV6AO7VQ2JW77H5GHKBUOBKZTW32WDTTA@2\m\target\invoker-reports\BUILD-effective-settings_deep-clone.xml, f:\jenkins\jenkins-slave\workspace\ox_maven-help-plugin_master-U66QJWH3TRYC4M2J55DEV6AO7VQ2JW77H5GHKBUOBKZTW32WDTTA@2\m\target\invoker-reports\BUILD-evaluate-artifact-with-expression-with-output.xml, f:\jenkins\jenkins-slave\workspace\ox_maven-help-plugin_master-U66QJWH3TRYC4M2J55DEV6AO7VQ2JW77H5GHKBUOBKZTW32WDTTA@2\m\target\invoker-reports\BUILD-evaluate-settings-servers.xml, f:\jenkins\jenkins-slave\workspace\ox_maven-help-plugin_master-U66QJWH3TRYC4M2J55DEV6AO7VQ2JW77H5GHKBUOBKZTW32WDTTA@2\m\target\invoker-reports\BUILD-evaluate-with-expression-with-output.xml, f:\jenkins\jenkins-slave\workspace\ox_maven-help-plugin_master-U66QJWH3TRYC4M2J55DEV6AO7VQ2JW77H5GHKBUOBKZTW32WDTTA@2\m\target\invoker-reports\BUILD-evaluate.xml, f:\jenkins\jenkins-slave\workspace\ox_maven-help-plugin_master-U66QJWH3TRYC4M2J55DEV6AO7VQ2JW77H5GHKBUOBKZTW32WDTTA@2\m\target\invoker-reports\BUILD-system.xml]
[windows-jdk10] Found logs:[f:\jenkins\jenkins-slave\workspace\ox_maven-help-plugin_master-U66QJWH3TRYC4M2J55DEV6AO7VQ2JW77H5GHKBUOBKZTW32WDTTA@2\m\target\it\active-profiles\build.log, f:\jenkins\jenkins-slave\workspace\ox_maven-help-plugin_master-U66QJWH3TRYC4M2J55DEV6AO7VQ2JW77H5GHKBUOBKZTW32WDTTA@2\m\target\it\active-profiles_multimodule\build.log, f:\jenkins\jenkins-slave\workspace\ox_maven-help-plugin_master-U66QJWH3TRYC4M2J55DEV6AO7VQ2JW77H5GHKBUOBKZTW32WDTTA@2\m\target\it\all-profiles-parent-pom\build.log, f:\jenkins\jenkins-slave\workspace\ox_maven-help-plugin_master-U66QJWH3TRYC4M2J55DEV6AO7VQ2JW77H5GHKBUOBKZTW32WDTTA@2\m\target\it\all-profiles\build.log, f:\jenkins\jenkins-slave\workspace\ox_maven-help-plugin_master-U66QJWH3TRYC4M2J55DEV6AO7VQ2JW77H5GHKBUOBKZTW32WDTTA@2\m\target\it\describe-cmd-invalid\build.log, f:\jenkins\jenkins-slave\workspace\ox_maven-help-plugin_master-U66QJWH3TRYC4M2J55DEV6AO7VQ2JW77H5GHKBUOBKZTW32WDTTA@2\m\target\it\describe-cmd-with-goal-invalid\build.log, f:\jenkins\jenkins-slave\workspace\ox_maven-help-plugin_master-U66QJWH3TRYC4M2J55DEV6AO7VQ2JW77H5GHKBUOBKZTW32WDTTA@2\m\target\it\describe-cmd-with-goal-report\build.log, f:\jenkins\jenkins-slave\workspace\ox_maven-help-plugin_master-U66QJWH3TRYC4M2J55DEV6AO7VQ2JW77H5GHKBUOBKZTW32WDTTA@2\m\target\it\describe-cmd-with-goal\build.log, f:\jenkins\jenkins-slave\workspace\ox_maven-help-plugin_master-U66QJWH3TRYC4M2J55DEV6AO7VQ2JW77H5GHKBUOBKZTW32WDTTA@2\m\target\it\describe-cmd\build.log, f:\jenkins\jenkins-slave\workspace\ox_maven-help-plugin_master-U66QJWH3TRYC4M2J55DEV6AO7VQ2JW77H5GHKBUOBKZTW32WDTTA@2\m\target\it\describe-ga\build.log, f:\jenkins\jenkins-slave\workspace\ox_maven-help-plugin_master-U66QJWH3TRYC4M2J55DEV6AO7VQ2JW77H5GHKBUOBKZTW32WDTTA@2\m\target\it\describe-gav\build.log, f:\jenkins\jenkins-slave\workspace\ox_maven-help-plugin_master-U66QJWH3TRYC4M2J55DEV6AO7VQ2JW77H5GHKBUOBKZTW32WDTTA@2\m\target\it\describe-plugin-in-plugin-management\build.log, f:\jenkins\jenkins-slave\workspace\ox_maven-help-plugin_master-U66QJWH3TRYC4M2J55DEV6AO7VQ2JW77H5GHKBUOBKZTW32WDTTA@2\m\target\it\describe-plugin-without-name\build.log, f:\jenkins\jenkins-slave\workspace\ox_maven-help-plugin_master-U66QJWH3TRYC4M2J55DEV6AO7VQ2JW77H5GHKBUOBKZTW32WDTTA@2\m\target\it\describe-prefix-and-invalid-mojo\build.log, f:\jenkins\jenkins-slave\workspace\ox_maven-help-plugin_master-U66QJWH3TRYC4M2J55DEV6AO7VQ2JW77H5GHKBUOBKZTW32WDTTA@2\m\target\it\describe-prefix-and-mojo\build.log, f:\jenkins\jenkins-slave\workspace\ox_maven-help-plugin_master-U66QJWH3TRYC4M2J55DEV6AO7VQ2JW77H5GHKBUOBKZTW32WDTTA@2\m\target\it\describe-prefix\build.log, f:\jenkins\jenkins-slave\workspace\ox_maven-help-plugin_master-U66QJWH3TRYC4M2J55DEV6AO7VQ2JW77H5GHKBUOBKZTW32WDTTA@2\m\target\it\effective-pom-artifact\build.log, f:\jenkins\jenkins-slave\workspace\ox_maven-help-plugin_master-U66QJWH3TRYC4M2J55DEV6AO7VQ2JW77H5GHKBUOBKZTW32WDTTA@2\m\target\it\effective-pom-from-lifecycle\build.log, f:\jenkins\jenkins-slave\workspace\ox_maven-help-plugin_master-U66QJWH3TRYC4M2J55DEV6AO7VQ2JW77H5GHKBUOBKZTW32WDTTA@2\m\target\it\effective-pom-multimodule-unlink-parent\build.log, f:\jenkins\jenkins-slave\workspace\ox_maven-help-plugin_master-U66QJWH3TRYC4M2J55DEV6AO7VQ2JW77H5GHKBUOBKZTW32WDTTA@2\m\target\it\effective-pom-multimodule\build.log, f:\jenkins\jenkins-slave\workspace\ox_maven-help-plugin_master-U66QJWH3TRYC4M2J55DEV6AO7VQ2JW77H5GHKBUOBKZTW32WDTTA@2\m\target\it\effective-pom\build.log, f:\jenkins\jenkins-slave\workspace\ox_maven-help-plugin_master-U66QJWH3TRYC4M2J55DEV6AO7VQ2JW77H5GHKBUOBKZTW32WDTTA@2\m\target\it\effective-pom_properties\build.log, f:\jenkins\jenkins-slave\workspace\ox_maven-help-plugin_master-U66QJWH3TRYC4M2J55DEV6AO7VQ2JW77H5GHKBUOBKZTW32WDTTA@2\m\target\it\effective-settings\build.log, f:\jenkins\jenkins-slave\workspace\ox_maven-help-plugin_master-U66QJWH3TRYC4M2J55DEV6AO7VQ2JW77H5GHKBUOBKZTW32WDTTA@2\m\target\it\effective-settings_deep-clone\build.log, f:\jenkins\jenkins-slave\workspace\ox_maven-help-plugin_master-U66QJWH3TRYC4M2J55DEV6AO7VQ2JW77H5GHKBUOBKZTW32WDTTA@2\m\target\it\evaluate-artifact-with-expression-with-output\build.log, f:\jenkins\jenkins-slave\workspace\ox_maven-help-plugin_master-U66QJWH3TRYC4M2J55DEV6AO7VQ2JW77H5GHKBUOBKZTW32WDTTA@2\m\target\it\evaluate-settings-servers\build.log, f:\jenkins\jenkins-slave\workspace\ox_maven-help-plugin_master-U66QJWH3TRYC4M2J55DEV6AO7VQ2JW77H5GHKBUOBKZTW32WDTTA@2\m\target\it\evaluate-with-expression-with-output\build.log, f:\jenkins\jenkins-slave\workspace\ox_maven-help-plugin_master-U66QJWH3TRYC4M2J55DEV6AO7VQ2JW77H5GHKBUOBKZTW32WDTTA@2\m\target\it\evaluate\build.log, f:\jenkins\jenkins-slave\workspace\ox_maven-help-plugin_master-U66QJWH3TRYC4M2J55DEV6AO7VQ2JW77H5GHKBUOBKZTW32WDTTA@2\m\target\it\system\build.log]
[windows-jdk10] Finished parsing Maven Invoker results (found 29)
[windows-jdk10] [withMaven] junitPublisher - Archive test results for Maven artifact org.apache.maven.plugins:maven-help-plugin:3.1.1-SNAPSHOT generated by maven-surefire-plugin:test (default-test): m\target\surefire-reports\*.xml
[windows-jdk10] Recording test results
[Pipeline] [windows-jdk9] // node
[Pipeline] [windows-jdk10] // withMaven
[Pipeline] [windows-jdk9] }
[Pipeline] [windows-jdk8] }
[Pipeline] [windows-jdk10] }
[Pipeline] [windows-jdk8] // dir
[Pipeline] [windows-jdk10] // stage
[Pipeline] [windows-jdk8] }
[windows-jdk8] [withMaven] invokerPublisher - Archive invoker results for Maven artifact MavenArtifact{org.apache.maven.plugins:maven-help-plugin::3.1.1-SNAPSHOT(version: 3.1.1-SNAPSHOT, snapshot:false) } generated by PluginInvocation{org.apache.maven.plugins:maven-invoker-plugin:3.0.1@integration-test  integration-test}: m\target\invoker-reports\*.xml
[windows-jdk8] performing MavenInvokerRecorder, reportsFilenamePattern:'**/m\target\invoker-reports/BUILD*.xml', invokerBuildDir:'**/m\target\it'
[windows-jdk8] Found reports:[f:\jenkins\jenkins-slave\workspace\ox_maven-help-plugin_master-U66QJWH3TRYC4M2J55DEV6AO7VQ2JW77H5GHKBUOBKZTW32WDTTA\m\target\invoker-reports\BUILD-active-profiles.xml, f:\jenkins\jenkins-slave\workspace\ox_maven-help-plugin_master-U66QJWH3TRYC4M2J55DEV6AO7VQ2JW77H5GHKBUOBKZTW32WDTTA\m\target\invoker-reports\BUILD-active-profiles_multimodule.xml, f:\jenkins\jenkins-slave\workspace\ox_maven-help-plugin_master-U66QJWH3TRYC4M2J55DEV6AO7VQ2JW77H5GHKBUOBKZTW32WDTTA\m\target\invoker-reports\BUILD-all-profiles-parent-pom.xml, f:\jenkins\jenkins-slave\workspace\ox_maven-help-plugin_master-U66QJWH3TRYC4M2J55DEV6AO7VQ2JW77H5GHKBUOBKZTW32WDTTA\m\target\invoker-reports\BUILD-all-profiles.xml, f:\jenkins\jenkins-slave\workspace\ox_maven-help-plugin_master-U66QJWH3TRYC4M2J55DEV6AO7VQ2JW77H5GHKBUOBKZTW32WDTTA\m\target\invoker-reports\BUILD-describe-cmd-invalid.xml, f:\jenkins\jenkins-slave\workspace\ox_maven-help-plugin_master-U66QJWH3TRYC4M2J55DEV6AO7VQ2JW77H5GHKBUOBKZTW32WDTTA\m\target\invoker-reports\BUILD-describe-cmd-with-goal-invalid.xml, f:\jenkins\jenkins-slave\workspace\ox_maven-help-plugin_master-U66QJWH3TRYC4M2J55DEV6AO7VQ2JW77H5GHKBUOBKZTW32WDTTA\m\target\invoker-reports\BUILD-describe-cmd-with-goal-report.xml, f:\jenkins\jenkins-slave\workspace\ox_maven-help-plugin_master-U66QJWH3TRYC4M2J55DEV6AO7VQ2JW77H5GHKBUOBKZTW32WDTTA\m\target\invoker-reports\BUILD-describe-cmd-with-goal.xml, f:\jenkins\jenkins-slave\workspace\ox_maven-help-plugin_master-U66QJWH3TRYC4M2J55DEV6AO7VQ2JW77H5GHKBUOBKZTW32WDTTA\m\target\invoker-reports\BUILD-describe-cmd.xml, f:\jenkins\jenkins-slave\workspace\ox_maven-help-plugin_master-U66QJWH3TRYC4M2J55DEV6AO7VQ2JW77H5GHKBUOBKZTW32WDTTA\m\target\invoker-reports\BUILD-describe-ga.xml, f:\jenkins\jenkins-slave\workspace\ox_maven-help-plugin_master-U66QJWH3TRYC4M2J55DEV6AO7VQ2JW77H5GHKBUOBKZTW32WDTTA\m\target\invoker-reports\BUILD-describe-gav.xml, f:\jenkins\jenkins-slave\workspace\ox_maven-help-plugin_master-U66QJWH3TRYC4M2J55DEV6AO7VQ2JW77H5GHKBUOBKZTW32WDTTA\m\target\invoker-reports\BUILD-describe-plugin-in-plugin-management.xml, f:\jenkins\jenkins-slave\workspace\ox_maven-help-plugin_master-U66QJWH3TRYC4M2J55DEV6AO7VQ2JW77H5GHKBUOBKZTW32WDTTA\m\target\invoker-reports\BUILD-describe-plugin-without-name.xml, f:\jenkins\jenkins-slave\workspace\ox_maven-help-plugin_master-U66QJWH3TRYC4M2J55DEV6AO7VQ2JW77H5GHKBUOBKZTW32WDTTA\m\target\invoker-reports\BUILD-describe-prefix-and-invalid-mojo.xml, f:\jenkins\jenkins-slave\workspace\ox_maven-help-plugin_master-U66QJWH3TRYC4M2J55DEV6AO7VQ2JW77H5GHKBUOBKZTW32WDTTA\m\target\invoker-reports\BUILD-describe-prefix-and-mojo.xml, f:\jenkins\jenkins-slave\workspace\ox_maven-help-plugin_master-U66QJWH3TRYC4M2J55DEV6AO7VQ2JW77H5GHKBUOBKZTW32WDTTA\m\target\invoker-reports\BUILD-describe-prefix.xml, f:\jenkins\jenkins-slave\workspace\ox_maven-help-plugin_master-U66QJWH3TRYC4M2J55DEV6AO7VQ2JW77H5GHKBUOBKZTW32WDTTA\m\target\invoker-reports\BUILD-effective-pom-artifact.xml, f:\jenkins\jenkins-slave\workspace\ox_maven-help-plugin_master-U66QJWH3TRYC4M2J55DEV6AO7VQ2JW77H5GHKBUOBKZTW32WDTTA\m\target\invoker-reports\BUILD-effective-pom-from-lifecycle.xml, f:\jenkins\jenkins-slave\workspace\ox_maven-help-plugin_master-U66QJWH3TRYC4M2J55DEV6AO7VQ2JW77H5GHKBUOBKZTW32WDTTA\m\target\invoker-reports\BUILD-effective-pom-multimodule-unlink-parent.xml, f:\jenkins\jenkins-slave\workspace\ox_maven-help-plugin_master-U66QJWH3TRYC4M2J55DEV6AO7VQ2JW77H5GHKBUOBKZTW32WDTTA\m\target\invoker-reports\BUILD-effective-pom-multimodule.xml, f:\jenkins\jenkins-slave\workspace\ox_maven-help-plugin_master-U66QJWH3TRYC4M2J55DEV6AO7VQ2JW77H5GHKBUOBKZTW32WDTTA\m\target\invoker-reports\BUILD-effective-pom.xml, f:\jenkins\jenkins-slave\workspace\ox_maven-help-plugin_master-U66QJWH3TRYC4M2J55DEV6AO7VQ2JW77H5GHKBUOBKZTW32WDTTA\m\target\invoker-reports\BUILD-effective-pom_properties.xml, f:\jenkins\jenkins-slave\workspace\ox_maven-help-plugin_master-U66QJWH3TRYC4M2J55DEV6AO7VQ2JW77H5GHKBUOBKZTW32WDTTA\m\target\invoker-reports\BUILD-effective-settings.xml, f:\jenkins\jenkins-slave\workspace\ox_maven-help-plugin_master-U66QJWH3TRYC4M2J55DEV6AO7VQ2JW77H5GHKBUOBKZTW32WDTTA\m\target\invoker-reports\BUILD-effective-settings_deep-clone.xml, f:\jenkins\jenkins-slave\workspace\ox_maven-help-plugin_master-U66QJWH3TRYC4M2J55DEV6AO7VQ2JW77H5GHKBUOBKZTW32WDTTA\m\target\invoker-reports\BUILD-evaluate-artifact-with-expression-with-output.xml, f:\jenkins\jenkins-slave\workspace\ox_maven-help-plugin_master-U66QJWH3TRYC4M2J55DEV6AO7VQ2JW77H5GHKBUOBKZTW32WDTTA\m\target\invoker-reports\BUILD-evaluate-settings-servers.xml, f:\jenkins\jenkins-slave\workspace\ox_maven-help-plugin_master-U66QJWH3TRYC4M2J55DEV6AO7VQ2JW77H5GHKBUOBKZTW32WDTTA\m\target\invoker-reports\BUILD-evaluate-with-expression-with-output.xml, f:\jenkins\jenkins-slave\workspace\ox_maven-help-plugin_master-U66QJWH3TRYC4M2J55DEV6AO7VQ2JW77H5GHKBUOBKZTW32WDTTA\m\target\invoker-reports\BUILD-evaluate.xml, f:\jenkins\jenkins-slave\workspace\ox_maven-help-plugin_master-U66QJWH3TRYC4M2J55DEV6AO7VQ2JW77H5GHKBUOBKZTW32WDTTA\m\target\invoker-reports\BUILD-system.xml]
[windows-jdk8] Found logs:[f:\jenkins\jenkins-slave\workspace\ox_maven-help-plugin_master-U66QJWH3TRYC4M2J55DEV6AO7VQ2JW77H5GHKBUOBKZTW32WDTTA\m\target\it\active-profiles\build.log, f:\jenkins\jenkins-slave\workspace\ox_maven-help-plugin_master-U66QJWH3TRYC4M2J55DEV6AO7VQ2JW77H5GHKBUOBKZTW32WDTTA\m\target\it\active-profiles_multimodule\build.log, f:\jenkins\jenkins-slave\workspace\ox_maven-help-plugin_master-U66QJWH3TRYC4M2J55DEV6AO7VQ2JW77H5GHKBUOBKZTW32WDTTA\m\target\it\all-profiles-parent-pom\build.log, f:\jenkins\jenkins-slave\workspace\ox_maven-help-plugin_master-U66QJWH3TRYC4M2J55DEV6AO7VQ2JW77H5GHKBUOBKZTW32WDTTA\m\target\it\all-profiles\build.log, f:\jenkins\jenkins-slave\workspace\ox_maven-help-plugin_master-U66QJWH3TRYC4M2J55DEV6AO7VQ2JW77H5GHKBUOBKZTW32WDTTA\m\target\it\describe-cmd-invalid\build.log, f:\jenkins\jenkins-slave\workspace\ox_maven-help-plugin_master-U66QJWH3TRYC4M2J55DEV6AO7VQ2JW77H5GHKBUOBKZTW32WDTTA\m\target\it\describe-cmd-with-goal-invalid\build.log, f:\jenkins\jenkins-slave\workspace\ox_maven-help-plugin_master-U66QJWH3TRYC4M2J55DEV6AO7VQ2JW77H5GHKBUOBKZTW32WDTTA\m\target\it\describe-cmd-with-goal-report\build.log, f:\jenkins\jenkins-slave\workspace\ox_maven-help-plugin_master-U66QJWH3TRYC4M2J55DEV6AO7VQ2JW77H5GHKBUOBKZTW32WDTTA\m\target\it\describe-cmd-with-goal\build.log, f:\jenkins\jenkins-slave\workspace\ox_maven-help-plugin_master-U66QJWH3TRYC4M2J55DEV6AO7VQ2JW77H5GHKBUOBKZTW32WDTTA\m\target\it\describe-cmd\build.log, f:\jenkins\jenkins-slave\workspace\ox_maven-help-plugin_master-U66QJWH3TRYC4M2J55DEV6AO7VQ2JW77H5GHKBUOBKZTW32WDTTA\m\target\it\describe-ga\build.log, f:\jenkins\jenkins-slave\workspace\ox_maven-help-plugin_master-U66QJWH3TRYC4M2J55DEV6AO7VQ2JW77H5GHKBUOBKZTW32WDTTA\m\target\it\describe-gav\build.log, f:\jenkins\jenkins-slave\workspace\ox_maven-help-plugin_master-U66QJWH3TRYC4M2J55DEV6AO7VQ2JW77H5GHKBUOBKZTW32WDTTA\m\target\it\describe-plugin-in-plugin-management\build.log, f:\jenkins\jenkins-slave\workspace\ox_maven-help-plugin_master-U66QJWH3TRYC4M2J55DEV6AO7VQ2JW77H5GHKBUOBKZTW32WDTTA\m\target\it\describe-plugin-without-name\build.log, f:\jenkins\jenkins-slave\workspace\ox_maven-help-plugin_master-U66QJWH3TRYC4M2J55DEV6AO7VQ2JW77H5GHKBUOBKZTW32WDTTA\m\target\it\describe-prefix-and-invalid-mojo\build.log, f:\jenkins\jenkins-slave\workspace\ox_maven-help-plugin_master-U66QJWH3TRYC4M2J55DEV6AO7VQ2JW77H5GHKBUOBKZTW32WDTTA\m\target\it\describe-prefix-and-mojo\build.log, f:\jenkins\jenkins-slave\workspace\ox_maven-help-plugin_master-U66QJWH3TRYC4M2J55DEV6AO7VQ2JW77H5GHKBUOBKZTW32WDTTA\m\target\it\describe-prefix\build.log, f:\jenkins\jenkins-slave\workspace\ox_maven-help-plugin_master-U66QJWH3TRYC4M2J55DEV6AO7VQ2JW77H5GHKBUOBKZTW32WDTTA\m\target\it\effective-pom-artifact\build.log, f:\jenkins\jenkins-slave\workspace\ox_maven-help-plugin_master-U66QJWH3TRYC4M2J55DEV6AO7VQ2JW77H5GHKBUOBKZTW32WDTTA\m\target\it\effective-pom-from-lifecycle\build.log, f:\jenkins\jenkins-slave\workspace\ox_maven-help-plugin_master-U66QJWH3TRYC4M2J55DEV6AO7VQ2JW77H5GHKBUOBKZTW32WDTTA\m\target\it\effective-pom-multimodule-unlink-parent\build.log, f:\jenkins\jenkins-slave\workspace\ox_maven-help-plugin_master-U66QJWH3TRYC4M2J55DEV6AO7VQ2JW77H5GHKBUOBKZTW32WDTTA\m\target\it\effective-pom-multimodule\build.log, f:\jenkins\jenkins-slave\workspace\ox_maven-help-plugin_master-U66QJWH3TRYC4M2J55DEV6AO7VQ2JW77H5GHKBUOBKZTW32WDTTA\m\target\it\effective-pom\build.log, f:\jenkins\jenkins-slave\workspace\ox_maven-help-plugin_master-U66QJWH3TRYC4M2J55DEV6AO7VQ2JW77H5GHKBUOBKZTW32WDTTA\m\target\it\effective-pom_properties\build.log, f:\jenkins\jenkins-slave\workspace\ox_maven-help-plugin_master-U66QJWH3TRYC4M2J55DEV6AO7VQ2JW77H5GHKBUOBKZTW32WDTTA\m\target\it\effective-settings\build.log, f:\jenkins\jenkins-slave\workspace\ox_maven-help-plugin_master-U66QJWH3TRYC4M2J55DEV6AO7VQ2JW77H5GHKBUOBKZTW32WDTTA\m\target\it\effective-settings_deep-clone\build.log, f:\jenkins\jenkins-slave\workspace\ox_maven-help-plugin_master-U66QJWH3TRYC4M2J55DEV6AO7VQ2JW77H5GHKBUOBKZTW32WDTTA\m\target\it\evaluate-artifact-with-expression-with-output\build.log, f:\jenkins\jenkins-slave\workspace\ox_maven-help-plugin_master-U66QJWH3TRYC4M2J55DEV6AO7VQ2JW77H5GHKBUOBKZTW32WDTTA\m\target\it\evaluate-settings-servers\build.log, f:\jenkins\jenkins-slave\workspace\ox_maven-help-plugin_master-U66QJWH3TRYC4M2J55DEV6AO7VQ2JW77H5GHKBUOBKZTW32WDTTA\m\target\it\evaluate-with-expression-with-output\build.log, f:\jenkins\jenkins-slave\workspace\ox_maven-help-plugin_master-U66QJWH3TRYC4M2J55DEV6AO7VQ2JW77H5GHKBUOBKZTW32WDTTA\m\target\it\evaluate\build.log, f:\jenkins\jenkins-slave\workspace\ox_maven-help-plugin_master-U66QJWH3TRYC4M2J55DEV6AO7VQ2JW77H5GHKBUOBKZTW32WDTTA\m\target\it\system\build.log]
[windows-jdk8] Finished parsing Maven Invoker results (found 29)
[windows-jdk8] [withMaven] junitPublisher - Archive test results for Maven artifact org.apache.maven.plugins:maven-help-plugin:3.1.1-SNAPSHOT generated by maven-surefire-plugin:test (default-test): m\target\surefire-reports\*.xml
[windows-jdk8] Recording test results
[windows-jdk8] None of the test reports contained any result
[Pipeline] [windows-jdk10] }
[Pipeline] [windows-jdk8] // withMaven
[Pipeline] [windows-jdk10] // node
[Pipeline] [windows-jdk10] }
[Pipeline] [windows-jdk8] }
[Pipeline] [windows-jdk8] // stage
[Pipeline] [windows-jdk8] }
[Pipeline] [windows-jdk8] // node
[Pipeline] [windows-jdk8] }
[Pipeline] // parallel
[Pipeline] stage
[Pipeline] { (Notifications)
[Pipeline] echo
Build result: UNSTABLE
[Pipeline] jiraIssueSelector