You are viewing a plain text version of this content. The canonical link for it is here.
Posted to builds@solr.apache.org by Policeman Jenkins Server <je...@thetaphi.de> on 2025/08/12 00:56:44 UTC
[JENKINS] Solr-main-macOS (64bit/hotspot/jdk-23.0.2) - Build # 6658 - Unstable!
Build: https://jenkins.thetaphi.de/job/Solr-main-macOS/6658/
Java: 64bit/hotspot/jdk-23.0.2 -XX:-UseCompressedOops -XX:+UseG1GC
2 tests failed.
FAILED: org.apache.solr.cloud.api.collections.CollectionReloadTest.testCreateReloadDeleteAllNrt {seed=[F5DA3778D8E6B8E8:EA575218CA9C5273]}
Error Message:
java.lang.AssertionError: Timeout waiting for collection testCreateReloadDeleteAllNrt
Timeout waiting to see state for collection=testCreateReloadDeleteAllNrt :DocCollection(testCreateReloadDeleteAllNrt//collections/testCreateReloadDeleteAllNrt/state.json/0 )={
"pullReplicas":0,
"configName":"conf",
"nrtReplicas":3,
"replicationFactor":3,
"tlogReplicas":0,
"router":{"name":"compositeId"},
"shards":{
"shard1":{
"range":"80000000-d554ffff",
"replicas":{},
"state":"active"},
"shard2":{
"range":"d5550000-2aa9ffff",
"replicas":{},
"state":"active"},
"shard3":{
"range":"2aaa0000-7fffffff",
"replicas":{},
"state":"active"}}}
Live Nodes: [127.0.0.1:59411_solr]
Last available state: DocCollection(testCreateReloadDeleteAllNrt//collections/testCreateReloadDeleteAllNrt/state.json/0 )={
"pullReplicas":0,
"configName":"conf",
"nrtReplicas":3,
"replicationFactor":3,
"tlogReplicas":0,
"router":{"name":"compositeId"},
"shards":{
"shard1":{
"range":"80000000-d554ffff",
"replicas":{},
"state":"active"},
"shard2":{
"range":"d5550000-2aa9ffff",
"replicas":{},
"state":"active"},
"shard3":{
"range":"2aaa0000-7fffffff",
"replicas":{},
"state":"active"}}}
Stack Trace:
java.lang.AssertionError: Timeout waiting for collection testCreateReloadDeleteAllNrt
Timeout waiting to see state for collection=testCreateReloadDeleteAllNrt :DocCollection(testCreateReloadDeleteAllNrt//collections/testCreateReloadDeleteAllNrt/state.json/0 )={
"pullReplicas":0,
"configName":"conf",
"nrtReplicas":3,
"replicationFactor":3,
"tlogReplicas":0,
"router":{"name":"compositeId"},
"shards":{
"shard1":{
"range":"80000000-d554ffff",
"replicas":{},
"state":"active"},
"shard2":{
"range":"d5550000-2aa9ffff",
"replicas":{},
"state":"active"},
"shard3":{
"range":"2aaa0000-7fffffff",
"replicas":{},
"state":"active"}}}
Live Nodes: [127.0.0.1:59411_solr]
Last available state: DocCollection(testCreateReloadDeleteAllNrt//collections/testCreateReloadDeleteAllNrt/state.json/0 )={
"pullReplicas":0,
"configName":"conf",
"nrtReplicas":3,
"replicationFactor":3,
"tlogReplicas":0,
"router":{"name":"compositeId"},
"shards":{
"shard1":{
"range":"80000000-d554ffff",
"replicas":{},
"state":"active"},
"shard2":{
"range":"d5550000-2aa9ffff",
"replicas":{},
"state":"active"},
"shard3":{
"range":"2aaa0000-7fffffff",
"replicas":{},
"state":"active"}}}
at __randomizedtesting.SeedInfo.seed([F5DA3778D8E6B8E8:EA575218CA9C5273]:0)
at org.junit.Assert.fail(Assert.java:89)
at org.apache.solr.cloud.SolrCloudTestCase.waitForState(SolrCloudTestCase.java:202)
at org.apache.solr.cloud.SolrCloudTestCase.waitForState(SolrCloudTestCase.java:170)
at org.apache.solr.cloud.api.collections.CollectionReloadTest.testCreateReloadDelete(CollectionReloadTest.java:121)
at org.apache.solr.cloud.api.collections.CollectionReloadTest.testCreateReloadDeleteAllNrt(CollectionReloadTest.java:102)
at java.base/jdk.internal.reflect.DirectMethodHandleAccessor.invoke(DirectMethodHandleAccessor.java:103)
at java.base/java.lang.reflect.Method.invoke(Method.java:580)
at com.carrotsearch.randomizedtesting.RandomizedRunner.invoke(RandomizedRunner.java:1758)
at com.carrotsearch.randomizedtesting.RandomizedRunner$8.evaluate(RandomizedRunner.java:946)
at com.carrotsearch.randomizedtesting.RandomizedRunner$9.evaluate(RandomizedRunner.java:982)
at com.carrotsearch.randomizedtesting.RandomizedRunner$10.evaluate(RandomizedRunner.java:996)
at com.carrotsearch.randomizedtesting.rules.SystemPropertiesRestoreRule$1.evaluate(SystemPropertiesRestoreRule.java:80)
at org.junit.rules.RunRules.evaluate(RunRules.java:20)
at org.apache.lucene.tests.util.TestRuleSetupTeardownChained$1.evaluate(TestRuleSetupTeardownChained.java:48)
at org.apache.lucene.tests.util.AbstractBeforeAfterRule$1.evaluate(AbstractBeforeAfterRule.java:43)
at org.apache.lucene.tests.util.TestRuleThreadAndTestName$1.evaluate(TestRuleThreadAndTestName.java:45)
at org.apache.lucene.tests.util.TestRuleIgnoreAfterMaxFailures$1.evaluate(TestRuleIgnoreAfterMaxFailures.java:60)
at org.apache.lucene.tests.util.TestRuleMarkFailure$1.evaluate(TestRuleMarkFailure.java:44)
at org.junit.rules.RunRules.evaluate(RunRules.java:20)
at com.carrotsearch.randomizedtesting.rules.StatementAdapter.evaluate(StatementAdapter.java:36)
at com.carrotsearch.randomizedtesting.ThreadLeakControl$StatementRunner.run(ThreadLeakControl.java:390)
at com.carrotsearch.randomizedtesting.ThreadLeakControl.forkTimeoutingTask(ThreadLeakControl.java:843)
at com.carrotsearch.randomizedtesting.ThreadLeakControl$3.evaluate(ThreadLeakControl.java:490)
at com.carrotsearch.randomizedtesting.RandomizedRunner.runSingleTest(RandomizedRunner.java:955)
at com.carrotsearch.randomizedtesting.RandomizedRunner$5.evaluate(RandomizedRunner.java:840)
at com.carrotsearch.randomizedtesting.RandomizedRunner$6.evaluate(RandomizedRunner.java:891)
at com.carrotsearch.randomizedtesting.RandomizedRunner$7.evaluate(RandomizedRunner.java:902)
at com.carrotsearch.randomizedtesting.rules.StatementAdapter.evaluate(StatementAdapter.java:36)
at com.carrotsearch.randomizedtesting.rules.StatementAdapter.evaluate(StatementAdapter.java:36)
at org.apache.lucene.tests.util.AbstractBeforeAfterRule$1.evaluate(AbstractBeforeAfterRule.java:43)
at com.carrotsearch.randomizedtesting.rules.SystemPropertiesRestoreRule$1.evaluate(SystemPropertiesRestoreRule.java:80)
at org.junit.rules.RunRules.evaluate(RunRules.java:20)
at org.apache.lucene.tests.util.AbstractBeforeAfterRule$1.evaluate(AbstractBeforeAfterRule.java:43)
at com.carrotsearch.randomizedtesting.rules.StatementAdapter.evaluate(StatementAdapter.java:36)
at org.apache.lucene.tests.util.TestRuleStoreClassName$1.evaluate(TestRuleStoreClassName.java:38)
at com.carrotsearch.randomizedtesting.rules.NoShadowingOrOverridesOnMethodsRule$1.evaluate(NoShadowingOrOverridesOnMethodsRule.java:40)
at com.carrotsearch.randomizedtesting.rules.NoShadowingOrOverridesOnMethodsRule$1.evaluate(NoShadowingOrOverridesOnMethodsRule.java:40)
at com.carrotsearch.randomizedtesting.rules.StatementAdapter.evaluate(StatementAdapter.java:36)
at com.carrotsearch.randomizedtesting.rules.StatementAdapter.evaluate(StatementAdapter.java:36)
at org.apache.lucene.tests.util.TestRuleAssertionsRequired$1.evaluate(TestRuleAssertionsRequired.java:53)
at org.apache.lucene.tests.util.AbstractBeforeAfterRule$1.evaluate(AbstractBeforeAfterRule.java:43)
at org.apache.lucene.tests.util.TestRuleMarkFailure$1.evaluate(TestRuleMarkFailure.java:44)
at org.apache.lucene.tests.util.TestRuleIgnoreAfterMaxFailures$1.evaluate(TestRuleIgnoreAfterMaxFailures.java:60)
at org.apache.lucene.tests.util.TestRuleIgnoreTestSuites$1.evaluate(TestRuleIgnoreTestSuites.java:47)
at org.junit.rules.RunRules.evaluate(RunRules.java:20)
at com.carrotsearch.randomizedtesting.rules.StatementAdapter.evaluate(StatementAdapter.java:36)
at com.carrotsearch.randomizedtesting.ThreadLeakControl$StatementRunner.run(ThreadLeakControl.java:390)
at com.carrotsearch.randomizedtesting.ThreadLeakControl.lambda$forkTimeoutingTask$0(ThreadLeakControl.java:850)
at java.base/java.lang.Thread.run(Thread.java:1575)
FAILED: org.apache.solr.cloud.api.collections.CollectionReloadTest.testCreateReloadDeleteAllNrt {seed=[F5DA3778D8E6B8E8:5E01EEE4FE5E995F]}
Error Message:
java.lang.AssertionError: expected:<200> but was:<400>
Stack Trace:
java.lang.AssertionError: expected:<200> but was:<400>
at __randomizedtesting.SeedInfo.seed([F5DA3778D8E6B8E8:5E01EEE4FE5E995F]:0)
at org.junit.Assert.fail(Assert.java:89)
at org.junit.Assert.failNotEquals(Assert.java:835)
at org.junit.Assert.assertEquals(Assert.java:647)
at org.junit.Assert.assertEquals(Assert.java:633)
at org.apache.solr.cloud.api.collections.CollectionReloadTest.createCollection(CollectionReloadTest.java:197)
at org.apache.solr.cloud.api.collections.CollectionReloadTest.testCreateReloadDelete(CollectionReloadTest.java:118)
at org.apache.solr.cloud.api.collections.CollectionReloadTest.testCreateReloadDeleteAllNrt(CollectionReloadTest.java:102)
at java.base/jdk.internal.reflect.DirectMethodHandleAccessor.invoke(DirectMethodHandleAccessor.java:103)
at java.base/java.lang.reflect.Method.invoke(Method.java:580)
at com.carrotsearch.randomizedtesting.RandomizedRunner.invoke(RandomizedRunner.java:1758)
at com.carrotsearch.randomizedtesting.RandomizedRunner$8.evaluate(RandomizedRunner.java:946)
at com.carrotsearch.randomizedtesting.RandomizedRunner$9.evaluate(RandomizedRunner.java:982)
at com.carrotsearch.randomizedtesting.RandomizedRunner$10.evaluate(RandomizedRunner.java:996)
at com.carrotsearch.randomizedtesting.rules.SystemPropertiesRestoreRule$1.evaluate(SystemPropertiesRestoreRule.java:80)
at org.junit.rules.RunRules.evaluate(RunRules.java:20)
at org.apache.lucene.tests.util.TestRuleSetupTeardownChained$1.evaluate(TestRuleSetupTeardownChained.java:48)
at org.apache.lucene.tests.util.AbstractBeforeAfterRule$1.evaluate(AbstractBeforeAfterRule.java:43)
at org.apache.lucene.tests.util.TestRuleThreadAndTestName$1.evaluate(TestRuleThreadAndTestName.java:45)
at org.apache.lucene.tests.util.TestRuleIgnoreAfterMaxFailures$1.evaluate(TestRuleIgnoreAfterMaxFailures.java:60)
at org.apache.lucene.tests.util.TestRuleMarkFailure$1.evaluate(TestRuleMarkFailure.java:44)
at org.junit.rules.RunRules.evaluate(RunRules.java:20)
at com.carrotsearch.randomizedtesting.rules.StatementAdapter.evaluate(StatementAdapter.java:36)
at com.carrotsearch.randomizedtesting.ThreadLeakControl$StatementRunner.run(ThreadLeakControl.java:390)
at com.carrotsearch.randomizedtesting.ThreadLeakControl.forkTimeoutingTask(ThreadLeakControl.java:843)
at com.carrotsearch.randomizedtesting.ThreadLeakControl$3.evaluate(ThreadLeakControl.java:490)
at com.carrotsearch.randomizedtesting.RandomizedRunner.runSingleTest(RandomizedRunner.java:955)
at com.carrotsearch.randomizedtesting.RandomizedRunner$5.evaluate(RandomizedRunner.java:840)
at com.carrotsearch.randomizedtesting.RandomizedRunner$6.evaluate(RandomizedRunner.java:891)
at com.carrotsearch.randomizedtesting.RandomizedRunner$7.evaluate(RandomizedRunner.java:902)
at com.carrotsearch.randomizedtesting.rules.StatementAdapter.evaluate(StatementAdapter.java:36)
at com.carrotsearch.randomizedtesting.rules.StatementAdapter.evaluate(StatementAdapter.java:36)
at org.apache.lucene.tests.util.AbstractBeforeAfterRule$1.evaluate(AbstractBeforeAfterRule.java:43)
at com.carrotsearch.randomizedtesting.rules.SystemPropertiesRestoreRule$1.evaluate(SystemPropertiesRestoreRule.java:80)
at org.junit.rules.RunRules.evaluate(RunRules.java:20)
at org.apache.lucene.tests.util.AbstractBeforeAfterRule$1.evaluate(AbstractBeforeAfterRule.java:43)
at com.carrotsearch.randomizedtesting.rules.StatementAdapter.evaluate(StatementAdapter.java:36)
at org.apache.lucene.tests.util.TestRuleStoreClassName$1.evaluate(TestRuleStoreClassName.java:38)
at com.carrotsearch.randomizedtesting.rules.NoShadowingOrOverridesOnMethodsRule$1.evaluate(NoShadowingOrOverridesOnMethodsRule.java:40)
at com.carrotsearch.randomizedtesting.rules.NoShadowingOrOverridesOnMethodsRule$1.evaluate(NoShadowingOrOverridesOnMethodsRule.java:40)
at com.carrotsearch.randomizedtesting.rules.StatementAdapter.evaluate(StatementAdapter.java:36)
at com.carrotsearch.randomizedtesting.rules.StatementAdapter.evaluate(StatementAdapter.java:36)
at org.apache.lucene.tests.util.TestRuleAssertionsRequired$1.evaluate(TestRuleAssertionsRequired.java:53)
at org.apache.lucene.tests.util.AbstractBeforeAfterRule$1.evaluate(AbstractBeforeAfterRule.java:43)
at org.apache.lucene.tests.util.TestRuleMarkFailure$1.evaluate(TestRuleMarkFailure.java:44)
at org.apache.lucene.tests.util.TestRuleIgnoreAfterMaxFailures$1.evaluate(TestRuleIgnoreAfterMaxFailures.java:60)
at org.apache.lucene.tests.util.TestRuleIgnoreTestSuites$1.evaluate(TestRuleIgnoreTestSuites.java:47)
at org.junit.rules.RunRules.evaluate(RunRules.java:20)
at com.carrotsearch.randomizedtesting.rules.StatementAdapter.evaluate(StatementAdapter.java:36)
at com.carrotsearch.randomizedtesting.ThreadLeakControl$StatementRunner.run(ThreadLeakControl.java:390)
at com.carrotsearch.randomizedtesting.ThreadLeakControl.lambda$forkTimeoutingTask$0(ThreadLeakControl.java:850)
at java.base/java.lang.Thread.run(Thread.java:1575)