You are viewing a plain text version of this content. The canonical link for it is here.
Posted to builds@beam.apache.org by Apache Jenkins Server <je...@builds.apache.org> on 2023/02/09 23:35:26 UTC

Build failed in Jenkins: beam_PostCommit_XVR_Flink #6481

See <https://ci-beam.apache.org/job/beam_PostCommit_XVR_Flink/6481/display/redirect?page=changes>

Changes:

[noreply] fix doc on bq sxtorage (#25353)

[noreply] [Playground] Fix Test_getRunOrTestCmd on Go 1.20 (#25379)

[noreply] Fix typo - metdata -> metadata (#25399)

[noreply] [prism] Initial commit for READMEs and go.mod (#25404)

[noreply] [prism] Add urns package (#25405)

[noreply] Add Two Counter Metric in BigQuery Write Schema Transform (#25155)


------------------------------------------
[...truncated 1.46 MB...]
> Task :runners:flink:1.15:job-server:flinkJobServerSetup
> Task :sdks:java:container:java8:docker

> Task :sdks:python:setupVirtualenv
Collecting protobuf<4.0dev,>=3.5.0.post1
  Using cached protobuf-3.20.3-cp310-cp310-manylinux_2_12_x86_64.manylinux2010_x86_64.whl (1.1 MB)
Collecting grpcio>=1.37.0
  Using cached grpcio-1.51.1-cp310-cp310-manylinux_2_17_x86_64.manylinux2014_x86_64.whl (4.8 MB)
Collecting platformdirs<4,>=2.4
  Using cached platformdirs-3.0.0-py3-none-any.whl (14 kB)
Collecting virtualenv!=20.0.0,!=20.0.1,!=20.0.2,!=20.0.3,!=20.0.4,!=20.0.5,!=20.0.6,!=20.0.7,>=16.0.0
  Using cached virtualenv-20.18.0-py3-none-any.whl (8.7 MB)
  Using cached virtualenv-20.17.1-py3-none-any.whl (8.8 MB)
  Using cached virtualenv-20.17.0-py3-none-any.whl (8.8 MB)
  Using cached virtualenv-20.16.7-py3-none-any.whl (8.8 MB)
  Using cached virtualenv-20.16.6-py3-none-any.whl (8.8 MB)
  Using cached virtualenv-20.16.5-py3-none-any.whl (8.8 MB)
  Using cached virtualenv-20.16.4-py3-none-any.whl (8.8 MB)
  Using cached virtualenv-20.16.3-py2.py3-none-any.whl (8.8 MB)
  Using cached virtualenv-20.16.2-py2.py3-none-any.whl (8.8 MB)
Collecting platformdirs<3,>=2
  Using cached platformdirs-2.6.2-py3-none-any.whl (14 kB)
Installing collected packages: distlib, wheel, toml, six, setuptools, py, protobuf, pluggy, platformdirs, packaging, numpy, grpcio, filelock, virtualenv, mypy-protobuf, grpcio-tools, tox
  Attempting uninstall: setuptools
    Found existing installation: setuptools 58.1.0
    Uninstalling setuptools-58.1.0:
      Successfully uninstalled setuptools-58.1.0
Successfully installed distlib-0.3.1 filelock-3.9.0 grpcio-1.51.1 grpcio-tools-1.37.0 mypy-protobuf-1.18 numpy-1.24.2 packaging-23.0 platformdirs-2.6.2 pluggy-1.0.0 protobuf-3.20.3 py-1.11.0 setuptools-67.2.0 six-1.16.0 toml-0.10.2 tox-3.20.1 virtualenv-20.16.2 wheel-0.38.4

> Task :sdks:python:sdist
/home/jenkins/jenkins-slave/workspace/beam_PostCommit_XVR_Flink/src/build/gradleenv/1922375555/lib/python3.10/site-packages/setuptools/dist.py:534: UserWarning: Normalizing '2.46.0.dev' to '2.46.0.dev0'
  warnings.warn(tmpl.format(**locals()))
warning: no files found matching 'README.md'
warning: no files found matching 'NOTICE'
warning: no files found matching 'LICENSE'
warning: no files found matching 'LICENSE.python'
warning: sdist: standard file not found: should have one of README, README.rst, README.txt, README.md


> Task :sdks:python:container:py310:copyDockerfileDependencies
> Task :sdks:python:container:py310:dockerPrepare
> Task :sdks:python:installGcpTest
> Task :sdks:python:container:py310:docker
  Building wheel for google-cloud-profiler (setup.py): finished with status 'done'
  Created wheel for google-cloud-profiler: filename=google_cloud_profiler-3.1.0-cp310-cp310-linux_x86_64.whl size=733867 sha256=8dfaa54049bd41cfd3b47117d2be1d9d300dc81e663e619b828366c8df979a28
  Stored in directory: /root/.cache/pip/wheels/28/9b/e7/bf48735a8cb92dae24c96f151d33bca39c5619d810c37864d8
  Building wheel for mmh3 (setup.py): started
  Building wheel for mmh3 (setup.py): finished with status 'done'
  Created wheel for mmh3: filename=mmh3-3.0.0-cp310-cp310-linux_x86_64.whl size=35190 sha256=bcd4dbdf8c814ab677464e42f29a1cf42c12e55081de7e92ba9fb9112efad684
  Stored in directory: /root/.cache/pip/wheels/00/62/4e/dc5414f9be1561daee8748ff8882d446d15e44ed2d997f2536
Successfully built bs4 crcmod dill docopt future google-apitools google-cloud-profiler mmh3
Installing collected packages: tensorboard-plugin-wit, tenacity, sortedcontainers, requests-mock, pytz, python-snappy, pyasn1-modules, pyasn1, parameterized, oauth2client, nose, mock, mmh3, libclang, hdfs, google-pasta, google-cloud-profiler, google-auth-httplib2, flatbuffers, docopt, deprecation, crcmod, charset-normalizer, cffi, bs4, astunparse, zstandard, wrapt, Werkzeug, websocket-client, urllib3, uritemplate, typing_extensions, tqdm, tomli, threadpoolctl, testcontainers, termcolor, tensorflow-io-gcs-filesystem, tensorflow-estimator, tensorflow, tensorboard-data-server, tensorboard, sqlparse, SQLAlchemy, soupsieve, six, scipy, scikit-learn, rsa, requests-oauthlib, requests, regex, PyYAML, python-dateutil, pytest-xdist, pytest-timeout, pytest-forked, pytest, pyparsing, PyMySQL, pymongo, PyHamcrest, pydot, pycparser, pyarrow, py, psycopg2-binary, protobuf, proto-plus, pluggy, pbr, pandas, packaging, overrides, orjson, opt-einsum, objsize, oauthlib, numpy, nltk, MarkupSafe, Markdown, keras, joblib, iniconfig, idna, hypothesis, httplib2, h5py, guppy3, grpcio-status, grpcio, grpc-google-iam-v1, greenlet, googleapis-common-protos, google-resumable-media, google-crc32c, google-cloud-vision, google-cloud-videointelligence, google-cloud-spanner, google-cloud-recommendations-ai, google-cloud-pubsublite, google-cloud-pubsub, google-cloud-language, google-cloud-dlp, google-cloud-datastore, google-cloud-core, google-cloud-bigtable, google-cloud-bigquery-storage, google-cloud-bigquery, google-auth-oauthlib, google-auth, google-apitools, google-api-python-client, google-api-core, gast, future, freezegun, fasteners, fastavro, execnet, exceptiongroup, docker, dill, Cython, cryptography, cloudpickle, click, certifi, cachetools, beautifulsoup4, attrs, absl-py
Successfully installed Cython-0.29.33 Markdown-3.4.1 MarkupSafe-2.1.2 PyHamcrest-1.10.1 PyMySQL-1.0.2 PyYAML-6.0 SQLAlchemy-1.4.46 Werkzeug-2.2.2 absl-py-1.4.0 astunparse-1.6.3 attrs-22.2.0 beautifulsoup4-4.11.1 bs4-0.0.1 cachetools-4.2.4 certifi-2022.12.7 cffi-1.15.1 charset-normalizer-3.0.1 click-8.1.3 cloudpickle-2.2.1 crcmod-1.7 cryptography-39.0.0 deprecation-2.1.0 dill-0.3.1.1 docker-6.0.1 docopt-0.6.2 exceptiongroup-1.1.0 execnet-1.9.0 fastavro-1.7.0 fasteners-0.18 flatbuffers-23.1.21 freezegun-1.2.2 future-0.18.3 gast-0.4.0 google-api-core-2.11.0 google-api-python-client-2.74.0 google-apitools-0.5.31 google-auth-2.16.0 google-auth-httplib2-0.1.0 google-auth-oauthlib-0.4.6 google-cloud-bigquery-3.4.2 google-cloud-bigquery-storage-2.16.2 google-cloud-bigtable-1.7.3 google-cloud-core-2.3.2 google-cloud-datastore-1.15.5 google-cloud-dlp-3.11.1 google-cloud-language-1.3.2 google-cloud-profiler-3.1.0 google-cloud-pubsub-2.14.0 google-cloud-pubsublite-1.6.0 google-cloud-recommendations-ai-0.7.1 google-cloud-spanner-3.27.0 google-cloud-videointelligence-1.16.3 google-cloud-vision-3.3.1 google-crc32c-1.5.0 google-pasta-0.2.0 google-resumable-media-2.4.1 googleapis-common-protos-1.58.0 greenlet-2.0.1 grpc-google-iam-v1-0.12.6 grpcio-1.51.1 grpcio-status-1.48.2 guppy3-3.1.2 h5py-3.8.0 hdfs-2.7.0 httplib2-0.21.0 hypothesis-6.65.0 idna-3.4 iniconfig-2.0.0 joblib-1.2.0 keras-2.11.0 libclang-15.0.6.1 mmh3-3.0.0 mock-2.0.0 nltk-3.8.1 nose-1.3.7 numpy-1.24.0 oauth2client-4.1.3 oauthlib-3.2.2 objsize-0.6.1 opt-einsum-3.3.0 orjson-3.8.5 overrides-6.5.0 packaging-23.0 pandas-1.5.3 parameterized-0.8.1 pbr-5.11.1 pluggy-1.0.0 proto-plus-1.22.2 protobuf-3.19.6 psycopg2-binary-2.9.5 py-1.11.0 pyarrow-9.0.0 pyasn1-0.4.8 pyasn1-modules-0.2.8 pycparser-2.21 pydot-1.4.2 pymongo-3.13.0 pyparsing-3.0.9 pytest-7.2.1 pytest-forked-1.4.0 pytest-timeout-2.1.0 pytest-xdist-2.5.0 python-dateutil-2.8.2 python-snappy-0.6.1 pytz-2022.7.1 regex-2022.10.31 requests-2.28.2 requests-mock-1.10.0 requests-oauthlib-1.3.1 rsa-4.9 scikit-learn-1.2.1 scipy-1.10.0 six-1.16.0 sortedcontainers-2.4.0 soupsieve-2.3.2.post1 sqlparse-0.4.3 tenacity-5.1.5 tensorboard-2.11.2 tensorboard-data-server-0.6.1 tensorboard-plugin-wit-1.8.1 tensorflow-2.11.0 tensorflow-estimator-2.11.0 tensorflow-io-gcs-filesystem-0.30.0 termcolor-2.2.0 testcontainers-3.7.1 threadpoolctl-3.1.0 tomli-2.0.1 tqdm-4.64.1 typing_extensions-4.4.0 uritemplate-4.1.1 urllib3-1.26.14 websocket-client-1.4.2 wrapt-1.14.1 zstandard-0.19.0
WARNING: Running pip as the 'root' user can result in broken permissions and conflicting behaviour with the system package manager. It is recommended to use a virtual environment instead: https://pip.pypa.io/warnings/venv

[notice] A new release of pip available: 22.3.1 -> 23.0
[notice] To update, run: pip install --upgrade pip
[nltk_data] Downloading package stopwords to /root/nltk_data...
[nltk_data]   Unzipping corpora/stopwords.zip.
Verified fast protobuf used.
Removing intermediate container d0aea865f9b3
 ---> 91d64205c4f6
Step 7/32 : RUN pip install --upgrade pip setuptools
 ---> Running in 315677cd4121
Requirement already satisfied: pip in /usr/local/lib/python3.10/site-packages (22.3.1)
Collecting pip
  Downloading pip-23.0-py3-none-any.whl (2.1 MB)
     ━━━━━━━━━━━━━━━━━━━━━━━━━━━━━━━━━━━━━━━━ 2.1/2.1 MB 22.2 MB/s eta 0:00:00
Requirement already satisfied: setuptools in /usr/local/lib/python3.10/site-packages (65.5.1)
Collecting setuptools
  Downloading setuptools-67.2.0-py3-none-any.whl (1.1 MB)
     ━━━━━━━━━━━━━━━━━━━━━━━━━━━━━━━━━━━━━━━━ 1.1/1.1 MB 43.8 MB/s eta 0:00:00
Installing collected packages: setuptools, pip
  Attempting uninstall: setuptools
    Found existing installation: setuptools 65.5.1
    Uninstalling setuptools-65.5.1:
      Successfully uninstalled setuptools-65.5.1
  Attempting uninstall: pip
    Found existing installation: pip 22.3.1
    Uninstalling pip-22.3.1:
      Successfully uninstalled pip-22.3.1
Successfully installed pip-23.0 setuptools-67.2.0
WARNING: Running pip as the 'root' user can result in broken permissions and conflicting behaviour with the system package manager. It is recommended to use a virtual environment instead: https://pip.pypa.io/warnings/venv
Removing intermediate container 315677cd4121
 ---> 6281c5988413
Step 8/32 : ENV CLOUDSDK_CORE_DISABLE_PROMPTS yes
 ---> Running in a509ed5de5dc
Removing intermediate container a509ed5de5dc
 ---> c2a82b920e90
Step 9/32 : ENV PATH $PATH:/usr/local/gcloud/google-cloud-sdk/bin
 ---> Running in e08ee07456a1
Removing intermediate container e08ee07456a1
 ---> 092431f13f04
Step 10/32 : RUN mkdir -p /usr/local/gcloud &&     cd /usr/local/gcloud &&     curl -s -O https://dl.google.com/dl/cloudsdk/release/google-cloud-sdk.tar.gz &&     tar -xf google-cloud-sdk.tar.gz &&     /usr/local/gcloud/google-cloud-sdk/install.sh &&     rm google-cloud-sdk.tar.gz
 ---> Running in 5567ca28b558
Welcome to the Google Cloud CLI!
WARNING: You appear to be running this script as root. This may cause 
the installation to be inaccessible to users other than the root user.
Beginning update. This process may take several minutes.


Your current Google Cloud CLI version is: 417.0.1
Installing components from version: 417.0.1

┌─────────────────────────────────────────────────────────────────────────────┐
│                     These components will be installed.                     │
├─────────────────────────────────────────────────────┬────────────┬──────────┤
│                         Name                        │  Version   │   Size   │
├─────────────────────────────────────────────────────┼────────────┼──────────┤
│ BigQuery Command Line Tool                          │     2.0.84 │  1.6 MiB │
│ BigQuery Command Line Tool (Platform Specific)      │     2.0.77 │  < 1 MiB │
│ Bundled Python 3.9                                  │     3.9.16 │ 63.4 MiB │
│ Cloud Storage Command Line Tool                     │       5.19 │ 15.6 MiB │
│ Cloud Storage Command Line Tool (Platform Specific) │       5.13 │  < 1 MiB │
│ Google Cloud CLI Core Libraries (Platform Specific) │ 2022.09.20 │  < 1 MiB │
│ Google Cloud CRC32C Hash Tool                       │      1.0.0 │  1.2 MiB │
│ anthoscli                                           │     0.2.34 │ 68.6 MiB │
│ gcloud cli dependencies                             │ 2021.04.16 │  < 1 MiB │
└─────────────────────────────────────────────────────┴────────────┴──────────┘

For the latest full release notes, please visit:
  https://cloud.google.com/sdk/release_notes

╔════════════════════════════════════════════════════════════╗
╠═ Creating update staging area                             ═╣
╚════════════════════════════════════════════════════════════╝
╔════════════════════════════════════════════════════════════╗
╠═ Installing: BigQuery Command Line Tool                   ═╣
╚════════════════════════════════════════════════════════════╝
╔════════════════════════════════════════════════════════════╗
╠═ Installing: BigQuery Command Line Tool (Platform Spec... ═╣
╚════════════════════════════════════════════════════════════╝
╔════════════════════════════════════════════════════════════╗
╠═ Installing: Bundled Python 3.9                           ═╣
╚════════════════════════════════════════════════════════════╝
╔════════════════════════════════════════════════════════════╗
╠═ Installing: Bundled Python 3.9                           ═╣
╚════════════════════════════════════════════════════════════╝
╔════════════════════════════════════════════════════════════╗
╠═ Installing: Cloud Storage Command Line Tool              ═╣
╚════════════════════════════════════════════════════════════╝
╔════════════════════════════════════════════════════════════╗
╠═ Installing: Cloud Storage Command Line Tool (Platform... ═╣
╚════════════════════════════════════════════════════════════╝
╔════════════════════════════════════════════════════════════╗
╠═ Installing: Default set of gcloud commands               ═╣
╚════════════════════════════════════════════════════════════╝
╔════════════════════════════════════════════════════════════╗
╠═ Installing: Google Cloud CLI Core Libraries (Platform... ═╣
╚════════════════════════════════════════════════════════════╝
╔════════════════════════════════════════════════════════════╗
╠═ Installing: Google Cloud CRC32C Hash Tool                ═╣
╚════════════════════════════════════════════════════════════╝
╔════════════════════════════════════════════════════════════╗
╠═ Installing: Google Cloud CRC32C Hash Tool                ═╣
╚════════════════════════════════════════════════════════════╝
╔════════════════════════════════════════════════════════════╗
╠═ Installing: anthoscli                                    ═╣
╚════════════════════════════════════════════════════════════╝
╔════════════════════════════════════════════════════════════╗
╠═ Installing: anthoscli                                    ═╣
╚════════════════════════════════════════════════════════════╝
╔════════════════════════════════════════════════════════════╗
╠═ Installing: gcloud cli dependencies                      ═╣
╚════════════════════════════════════════════════════════════╝
╔════════════════════════════════════════════════════════════╗
╠═ Creating backup and activating new installation          ═╣
╚════════════════════════════════════════════════════════════╝

Performing post processing steps...
...............................................................................................................................................................................................done.

Update done!


To help improve the quality of this product, we collect anonymized usage data
and anonymized stacktraces when crashes are encountered; additional information
is available at <https://cloud.google.com/sdk/usage-statistics>. This data is
handled in accordance with our privacy policy
<https://cloud.google.com/terms/cloud-privacy-notice>. You may choose to opt in this
collection now (by choosing 'Y' at the below prompt), or at any time in the
future by running the following command:

    gcloud config set disable_usage_reporting false


This will install all the core command line tools necessary for working with
the Google Cloud Platform.

==> Source [/usr/local/gcloud/google-cloud-sdk/completion.bash.inc] in your profile to enable shell command completion for gcloud.
==> Source [/usr/local/gcloud/google-cloud-sdk/path.bash.inc] in your profile to add the Google Cloud SDK command line tools to your $PATH.

For more information on how to get started, please visit:
  https://cloud.google.com/sdk/docs/quickstarts


Removing intermediate container 5567ca28b558
 ---> 881c8e7b3a2d
Step 11/32 : RUN ln -s /usr/bin/ccache /usr/local/bin/gcc
 ---> Running in ff3f9e34f8eb
Removing intermediate container ff3f9e34f8eb
 ---> 3656e7a49fe1
Step 12/32 : RUN ccache --set-config=sloppiness=file_macro && ccache --set-config=hash_dir=false
 ---> Running in 79a0a04b16a9
Removing intermediate container 79a0a04b16a9
 ---> 1dac0cabbecb
Step 13/32 : COPY target/apache-beam.tar.gz /opt/apache/beam/tars/
 ---> 879887c24ca6
Step 14/32 : RUN pip install --no-deps -v /opt/apache/beam/tars/apache-beam.tar.gz[gcp]
 ---> Running in ac9f6fee02fb
Using pip 23.0 from /usr/local/lib/python3.10/site-packages/pip (python 3.10)
Processing /opt/apache/beam/tars/apache-beam.tar.gz
  Preparing metadata (setup.py): started
  Running command python setup.py egg_info
  /usr/local/lib/python3.10/site-packages/Cython/Compiler/Main.py:369: FutureWarning: Cython directive 'language_level' not set, using 2 for now (Py2). This will change in a later release! File: /tmp/pip-req-build-4yy5gp91/apache_beam/coders/coder_impl.pxd
    tree = Parsing.p_module(s, pxd, full_module_name)
FATAL: command execution failed
java.io.IOException: Backing channel 'apache-beam-jenkins-6' is disconnected.
	at hudson.remoting.RemoteInvocationHandler.channelOrFail(RemoteInvocationHandler.java:215)
	at hudson.remoting.RemoteInvocationHandler.invoke(RemoteInvocationHandler.java:285)
	at com.sun.proxy.$Proxy132.isAlive(Unknown Source)
	at hudson.Launcher$RemoteLauncher$ProcImpl.isAlive(Launcher.java:1215)
	at hudson.Launcher$RemoteLauncher$ProcImpl.join(Launcher.java:1207)
	at hudson.Launcher$ProcStarter.join(Launcher.java:524)
	at hudson.plugins.gradle.Gradle.perform(Gradle.java:317)
	at hudson.tasks.BuildStepMonitor$1.perform(BuildStepMonitor.java:20)
	at hudson.model.AbstractBuild$AbstractBuildExecution.perform(AbstractBuild.java:814)
	at hudson.model.Build$BuildExecution.build(Build.java:199)
	at hudson.model.Build$BuildExecution.doRun(Build.java:164)
	at hudson.model.AbstractBuild$AbstractBuildExecution.run(AbstractBuild.java:522)
	at hudson.model.Run.execute(Run.java:1896)
	at hudson.model.FreeStyleBuild.run(FreeStyleBuild.java:44)
	at hudson.model.ResourceController.execute(ResourceController.java:101)
	at hudson.model.Executor.run(Executor.java:442)
Caused by: hudson.remoting.Channel$OrderlyShutdown: Command Close created at
	at hudson.remoting.Channel$CloseCommand.execute(Channel.java:1313)
	at hudson.remoting.Channel$1.handle(Channel.java:606)
	at hudson.remoting.SynchronousCommandTransport$ReaderThread.run(SynchronousCommandTransport.java:81)
Caused by: Command Close created at
	at hudson.remoting.Command.<init>(Command.java:70)
	at hudson.remoting.Channel$CloseCommand.<init>(Channel.java:1306)
	at hudson.remoting.Channel$CloseCommand.<init>(Channel.java:1304)
	at hudson.remoting.Channel.close(Channel.java:1480)
	at hudson.remoting.Channel.close(Channel.java:1447)
	at hudson.remoting.Channel$CloseCommand.execute(Channel.java:1312)
	... 2 more
Build step 'Invoke Gradle script' changed build result to FAILURE
Build step 'Invoke Gradle script' marked build as failure
ERROR: apache-beam-jenkins-6 is offline; cannot locate jdk_1.8_latest


---------------------------------------------------------------------
To unsubscribe, e-mail: builds-unsubscribe@beam.apache.org
For additional commands, e-mail: builds-help@beam.apache.org


Jenkins build is back to normal : beam_PostCommit_XVR_Flink #6483

Posted by Apache Jenkins Server <je...@builds.apache.org>.
See <https://ci-beam.apache.org/job/beam_PostCommit_XVR_Flink/6483/display/redirect>


---------------------------------------------------------------------
To unsubscribe, e-mail: builds-unsubscribe@beam.apache.org
For additional commands, e-mail: builds-help@beam.apache.org


Build failed in Jenkins: beam_PostCommit_XVR_Flink #6482

Posted by Apache Jenkins Server <je...@builds.apache.org>.
See <https://ci-beam.apache.org/job/beam_PostCommit_XVR_Flink/6482/display/redirect?page=changes>

Changes:

[noreply] [prism] Add internal/config package (#25406)


------------------------------------------
[...truncated 1.13 MB...]
        urn: "beam:coders:javasdk:0.1"
        payload: "\202SNAPPY\000\000\000\000\001\000\000\000\001\000\000\000\210\326\001\350\254\355\000\005sr\000$org.apache.beam.sdk.coders.VoidCoder\271\277U\233\350\r\257U\002\000\000xr\000&j3\000\024Atomic\0055 \307\354\265\314\205tPF\002\0055\000*j5\000$Structured\0059\034s\277\022\016\325\3246\021\t9\000 j9\000\005/0C\335\325\211\256\274~\370\002\000\000xp"
      >
    >
  >
  coders: <
    key: "c0"
    value: <
      spec: <
        urn: "beam:coder:bytes:v1"
      >
    >
  >
  coders: <
    key: "c1"
    value: <
      spec: <
        urn: "beam:coder:global_window:v1"
      >
    >
  >
  coders: <
    key: "c2"
    value: <
      spec: <
        urn: "beam:coder:row:v1"
        payload: "\n\r\n\007role_id\032\002\020\003\022$abc5e222-ab8f-4f6f-800a-a58bb0f45675"
      >
    >
  >
  environments: <
    key: "RuZmxVKUAsbeam:env:docker:v1"
    value: <
      urn: "beam:env:docker:v1"
      payload: "\n apache/beam_java8_sdk:2.46.0.dev"
      capabilities: "beam:coder:bytes:v1"
      capabilities: "beam:coder:bool:v1"
      capabilities: "beam:coder:varint:v1"
      capabilities: "beam:coder:string_utf8:v1"
      capabilities: "beam:coder:iterable:v1"
      capabilities: "beam:coder:timer:v1"
      capabilities: "beam:coder:kv:v1"
      capabilities: "beam:coder:length_prefix:v1"
      capabilities: "beam:coder:global_window:v1"
      capabilities: "beam:coder:interval_window:v1"
      capabilities: "beam:coder:custom_window:v1"
      capabilities: "beam:coder:windowed_value:v1"
      capabilities: "beam:coder:double:v1"
      capabilities: "beam:coder:row:v1"
      capabilities: "beam:coder:param_windowed_value:v1"
      capabilities: "beam:coder:state_backed_iterable:v1"
      capabilities: "beam:coder:sharded_key:v1"
      capabilities: "beam:coder:nullable:v1"
      capabilities: "beam:protocol:multi_core_bundle_processing:v1"
      capabilities: "beam:protocol:progress_reporting:v1"
      capabilities: "beam:protocol:harness_monitoring_infos:v1"
      capabilities: "beam:protocol:control_request_elements_embedding:v1"
      capabilities: "beam:protocol:state_caching:v1"
      capabilities: "beam:version:sdk_base:apache/beam_java8_sdk:2.46.0.dev"
      capabilities: "beam:transform:sdf_truncate_sized_restrictions:v1"
      capabilities: "beam:transform:to_string:v1"
      dependencies: <
        type_urn: "beam:artifact:type:file:v1"
        type_payload: "\nL/tmp/artifacts/icedtea-sound-5xFkOD7aUmX8Jiw7lPqhn75zkNGCyUOfOuqi2rClWKM.jar\022@e71164383eda5265fc262c3b94faa19fbe7390d182c9439f3aeaa2dab0a558a3"
        role_urn: "beam:artifact:role:staging_to:v1"
        role_payload: "\n=icedtea-sound-5xFkOD7aUmX8Jiw7lPqhn75zkNGCyUOfOuqi2rClWKM.jar"
      >
      dependencies: <
        type_urn: "beam:artifact:type:file:v1"
        type_payload: "\nF/tmp/artifacts/jaccess-Rlp7GfuSFOBCBGdO8af2XxrTz5LqaQqwSMAXumdbHN0.jar\022@465a7b19fb9214e04204674ef1a7f65f1ad3cf92ea690ab048c017ba675b1cdd"
        role_urn: "beam:artifact:role:staging_to:v1"
        role_payload: "\n7jaccess-Rlp7GfuSFOBCBGdO8af2XxrTz5LqaQqwSMAXumdbHN0.jar"
      >
      dependencies: <
        type_urn: "beam:artifact:type:file:v1"
        type_payload: "\nI/tmp/artifacts/localedata-Nuzln2shadVmT-PppqaNc7GHBbUyMUb9pXsJTjRiAzs.jar\022@36ece59f6b2169d5664fe3e9a6a68d73b18705b5323146fda57b094e3462033b"
        role_urn: "beam:artifact:role:staging_to:v1"
        role_payload: "\n:localedata-Nuzln2shadVmT-PppqaNc7GHBbUyMUb9pXsJTjRiAzs.jar"
      >
      dependencies: <
        type_urn: "beam:artifact:type:file:v1"
        type_payload: "\nF/tmp/artifacts/nashorn-1iQRhJvU2nRCSB4ucg6f4b69TGiwE1yq0_LGG2MU5N0.jar\022@d62411849bd4da7442481e2e720e9fe1bebd4c68b0135caad3f2c61b6314e4dd"
        role_urn: "beam:artifact:role:staging_to:v1"
        role_payload: "\n7nashorn-1iQRhJvU2nRCSB4ucg6f4b69TGiwE1yq0_LGG2MU5N0.jar"
      >
      dependencies: <
        type_urn: "beam:artifact:type:file:v1"
        type_payload: "\nG/tmp/artifacts/cldrdata-MTK3mMuUzlWYlYkweGQNzI7dFpuLG0_8F8oxT0khQDc.jar\022@3132b798cb94ce559895893078640dcc8edd169b8b1b4ffc17ca314f49214037"
        role_urn: "beam:artifact:role:staging_to:v1"
        role_payload: "\n8cldrdata-MTK3mMuUzlWYlYkweGQNzI7dFpuLG0_8F8oxT0khQDc.jar"
      >
      dependencies: <
        type_urn: "beam:artifact:type:file:v1"
        type_payload: "\nD/tmp/artifacts/dnsns-YTF3f6B-OG4FmXLRf2ckHBi4VJnspBZTyIQCz-6Spwk.jar\022@6131777fa07e386e059972d17f67241c18b85499eca41653c88402cfee92a709"
        role_urn: "beam:artifact:role:staging_to:v1"
        role_payload: "\n5dnsns-YTF3f6B-OG4FmXLRf2ckHBi4VJnspBZTyIQCz-6Spwk.jar"
      >
      dependencies: <
        type_urn: "beam:artifact:type:file:v1"
        type_payload: "\n\203\001/tmp/artifacts/beam-sdks-java-extensions-schemaio-expansion-service-2.46.0-SNAPSHOT-DwH92z8588-gan1rT1S5iR10aHCc63SXaytQurDVluo.jar\022@0f01fddb3f39f3cfa06a7d6b4f54b9891d7468709ceb74976b2b50bab0d596ea"
        role_urn: "beam:artifact:role:staging_to:v1"
        role_payload: "\ntbeam-sdks-java-extensions-schemaio-expansion-service-2.46.0-SNAPSHOT-DwH92z8588-gan1rT1S5iR10aHCc63SXaytQurDVluo.jar"
      >
    >
  >
  environments: <
    key: "go"
    value: <
      urn: "beam:env:docker:v1"
      payload: "\n\026apache/beam_go_sdk:dev"
      capabilities: "beam:protocol:progress_reporting:v1"
      capabilities: "beam:protocol:multi_core_bundle_processing:v1"
      capabilities: "beam:transform:sdf_truncate_sized_restrictions:v1"
      capabilities: "beam:protocol:worker_status:v1"
      capabilities: "beam:protocol:monitoring_info_short_ids:v1"
      capabilities: "beam:version:sdk_base:go:apache/beam_go_sdk:2.46.0.dev"
      capabilities: "beam:coder:bytes:v1"
      capabilities: "beam:coder:bool:v1"
      capabilities: "beam:coder:varint:v1"
      capabilities: "beam:coder:double:v1"
      capabilities: "beam:coder:string_utf8:v1"
      capabilities: "beam:coder:length_prefix:v1"
      capabilities: "beam:coder:kv:v1"
      capabilities: "beam:coder:iterable:v1"
      capabilities: "beam:coder:state_backed_iterable:v1"
      capabilities: "beam:coder:windowed_value:v1"
      capabilities: "beam:coder:global_window:v1"
      capabilities: "beam:coder:interval_window:v1"
      capabilities: "beam:coder:row:v1"
      capabilities: "beam:coder:nullable:v1"
      dependencies: <
        type_urn: "beam:artifact:type:file:v1"
        role_urn: "beam:artifact:role:go_worker_binary:v1"
      >
    >
  >
>
root_transform_ids: "s1"
root_transform_ids: "e2"
root_transform_ids: "e3"
root_transform_ids: "s3"
requirements: "beam:requirement:pardo:splittable_dofn:v1"
2023/02/10 04:38:59 Cross-compiling <https://ci-beam.apache.org/job/beam_PostCommit_XVR_Flink/ws/src/sdks/go/test/integration/io/xlang/jdbc/jdbc_test.go> as /tmp/worker-4-1676003939383754935
2023/02/10 04:39:01 Prepared job with id: go-testjdbcio_postgresreadwrite-889_b8d20330-b771-4bfb-a421-c9e74a3248b1 and staging token: go-testjdbcio_postgresreadwrite-889_b8d20330-b771-4bfb-a421-c9e74a3248b1
2023/02/10 04:39:01 Staged binary artifact with token: 
2023/02/10 04:39:02 Submitted job: go0testjdbcio0postgresreadwrite0889-jenkins-0210043901-d936fe26_ab3d2d06-619d-4f16-85f2-46746a7e9671
2023/02/10 04:39:02 Job state: STOPPED
2023/02/10 04:39:02 Job state: STARTING
2023/02/10 04:39:02 Job state: RUNNING
2023/02/10 04:39:23 Job state: DONE
2023/02/10 04:39:23 Warning: 6 errors during metrics processing: [failed to deduce Step from MonitoringInfo: urn:"beam:metric:element_count:v1" type:"beam:metrics:sum_int64:v1" payload:"\x01" labels:{key:"PCOLLECTION" value:"RuZmxVKUAsExternal/JdbcIO.ReadRows/JdbcIO.Read/Create.Values/Read(CreateSource)/ParDo(OutputSingleSource)/ParMultiDo(OutputSingleSource).output/SplitAndSize0"} failed to deduce Step from MonitoringInfo: urn:"beam:metric:element_count:v1" type:"beam:metrics:sum_int64:v1" payload:"\x01" labels:{key:"PCOLLECTION" value:"RuZmxVKUAsExternal/JdbcIO.ReadRows/JdbcIO.Read/Create.Values/Read(CreateSource)/ParDo(OutputSingleSource)/ParMultiDo(OutputSingleSource).output/PairWithRestriction0"} failed to deduce Step from MonitoringInfo: urn:"beam:metric:sampled_byte_size:v1" type:"beam:metrics:distribution_int64:v1" payload:"\x01\xfe\x08\xfe\x08\xfe\x08" labels:{key:"PCOLLECTION" value:"RuZmxVKUAsExternal/JdbcIO.ReadRows/JdbcIO.Read/Create.Values/Read(CreateSource)/ParDo(OutputSingleSource)/ParMultiDo(OutputSingleSource).output/SplitAndSize0"} failed to deduce Step from MonitoringInfo: urn:"beam:metric:sampled_byte_size:v1" type:"beam:metrics:distribution_int64:v1" payload:"\x01\xf6\x08\xf6\x08\xf6\x08" labels:{key:"PCOLLECTION" value:"RuZmxVKUAsExternal/JdbcIO.ReadRows/JdbcIO.Read/Create.Values/Read(CreateSource)/ParDo(OutputSingleSource)/ParMultiDo(OutputSingleSource).output/PairWithRestriction0"} failed to deduce Step from MonitoringInfo: urn:"beam:metric:element_count:v1" type:"beam:metrics:sum_int64:v1" payload:"\x01" labels:{key:"PCOLLECTION" value:"RuZmxVKUAsExternal/JdbcIO.ReadRows/JdbcIO.Read/Create.Values/Read(CreateSource)/ParDo(OutputSingleSource)/ParMultiDo(OutputSingleSource).output/SplitAndSize0"} failed to deduce Step from MonitoringInfo: urn:"beam:metric:sampled_byte_size:v1" type:"beam:metrics:distribution_int64:v1" payload:"\x01\x83\t\x83\t\x83\t" labels:{key:"PCOLLECTION" value:"RuZmxVKUAsExternal/JdbcIO.ReadRows/JdbcIO.Read/Create.Values/Read(CreateSource)/ParDo(OutputSingleSource)/ParMultiDo(OutputSingleSource).output/SplitAndSize0"}]
2023/02/10 04:39:23 Warning: 6 errors during metrics processing: [failed to deduce Step from MonitoringInfo: urn:"beam:metric:element_count:v1" type:"beam:metrics:sum_int64:v1" payload:"\x01" labels:{key:"PCOLLECTION" value:"RuZmxVKUAsExternal/JdbcIO.ReadRows/JdbcIO.Read/Create.Values/Read(CreateSource)/ParDo(OutputSingleSource)/ParMultiDo(OutputSingleSource).output/SplitAndSize0"} failed to deduce Step from MonitoringInfo: urn:"beam:metric:element_count:v1" type:"beam:metrics:sum_int64:v1" payload:"\x01" labels:{key:"PCOLLECTION" value:"RuZmxVKUAsExternal/JdbcIO.ReadRows/JdbcIO.Read/Create.Values/Read(CreateSource)/ParDo(OutputSingleSource)/ParMultiDo(OutputSingleSource).output/PairWithRestriction0"} failed to deduce Step from MonitoringInfo: urn:"beam:metric:sampled_byte_size:v1" type:"beam:metrics:distribution_int64:v1" payload:"\x01\xfe\x08\xfe\x08\xfe\x08" labels:{key:"PCOLLECTION" value:"RuZmxVKUAsExternal/JdbcIO.ReadRows/JdbcIO.Read/Create.Values/Read(CreateSource)/ParDo(OutputSingleSource)/ParMultiDo(OutputSingleSource).output/SplitAndSize0"} failed to deduce Step from MonitoringInfo: urn:"beam:metric:sampled_byte_size:v1" type:"beam:metrics:distribution_int64:v1" payload:"\x01\xf6\x08\xf6\x08\xf6\x08" labels:{key:"PCOLLECTION" value:"RuZmxVKUAsExternal/JdbcIO.ReadRows/JdbcIO.Read/Create.Values/Read(CreateSource)/ParDo(OutputSingleSource)/ParMultiDo(OutputSingleSource).output/PairWithRestriction0"} failed to deduce Step from MonitoringInfo: urn:"beam:metric:element_count:v1" type:"beam:metrics:sum_int64:v1" payload:"\x01" labels:{key:"PCOLLECTION" value:"RuZmxVKUAsExternal/JdbcIO.ReadRows/JdbcIO.Read/Create.Values/Read(CreateSource)/ParDo(OutputSingleSource)/ParMultiDo(OutputSingleSource).output/SplitAndSize0"} failed to deduce Step from MonitoringInfo: urn:"beam:metric:sampled_byte_size:v1" type:"beam:metrics:distribution_int64:v1" payload:"\x01\x83\t\x83\t\x83\t" labels:{key:"PCOLLECTION" value:"RuZmxVKUAsExternal/JdbcIO.ReadRows/JdbcIO.Read/Create.Values/Read(CreateSource)/ParDo(OutputSingleSource)/ParMultiDo(OutputSingleSource).output/SplitAndSize0"}]
--- PASS: TestJDBCIO_PostgresReadWrite (48.52s)
PASS
ok  	github.com/apache/beam/sdks/v2/go/test/integration/io/xlang/jdbc	126.321s
=== RUN   TestKafkaIO_BasicReadWrite
--- FAIL: TestKafkaIO_BasicReadWrite (0.01s)
panic: 	tried cross-language for beam:transform:org.apache.beam:kafka_write:v1 against localhost:42301 and failed
	expanding external transform
	expanding transform with ExpansionRequest: components:{pcollections:{key:"n4" value:{unique_name:"n4" coder_id:"c1@wsZUzTMDFS" is_bounded:BOUNDED windowing_strategy_id:"w0@wsZUzTMDFS"}} windowing_strategies:{key:"w0@wsZUzTMDFS" value:{window_fn:{urn:"beam:window_fn:global_windows:v1"} merge_status:NON_MERGING window_coder_id:"c2@wsZUzTMDFS" trigger:{default:{}} accumulation_mode:DISCARDING output_time:END_OF_WINDOW closing_behavior:EMIT_IF_NONEMPTY on_time_behavior:FIRE_IF_NONEMPTY environment_id:"go"}} coders:{key:"c0@wsZUzTMDFS" value:{spec:{urn:"beam:coder:bytes:v1"}}} coders:{key:"c1@wsZUzTMDFS" value:{spec:{urn:"beam:coder:kv:v1"} component_coder_ids:"c0@wsZUzTMDFS" component_coder_ids:"c0@wsZUzTMDFS"}} coders:{key:"c2@wsZUzTMDFS" value:{spec:{urn:"beam:coder:global_window:v1"}}}} transform:{unique_name:"External" spec:{urn:"beam:transform:org.apache.beam:kafka_write:v1" payload:"\n}\n\x1c\n\x0eProducerConfig\x1a\n*\x08\n\x02\x10\x07\x12\x02\x10\x07\n\x0b\n\x05Topic\x1a\x02\x10\x07\n\x13\n\rKeySerializer\x1a\x02\x10\x07\n\x15\n\x0fValueSerializer\x1a\x02\x10\x07\x12$d97fbd8d-dde2-46d8-babd-f5372b6ab5e6\x12\xda\x01\x04\x00\x00\x00\x00\x01\x11bootstrap.servers\x0flocalhost:43735=xlang_kafkaio_basic_test_e110c4a4-c70d-4326-946c-1d8afc4fb9899org.apache.kafka.common.serialization.ByteArraySerializer9org.apache.kafka.common.serialization.ByteArraySerializer"} inputs:{key:"i0" value:"n4"} environment_id:"go"} namespace:"wsZUzTMDFS"
expansion failed
	caused by:
rpc error: code = Unavailable desc = connection error: desc = "transport: Error while dialing dial tcp 127.0.0.1:42301: connect: connection refused" [recovered]
	panic: 	tried cross-language for beam:transform:org.apache.beam:kafka_write:v1 against localhost:42301 and failed
	expanding external transform
	expanding transform with ExpansionRequest: components:{pcollections:{key:"n4" value:{unique_name:"n4" coder_id:"c1@wsZUzTMDFS" is_bounded:BOUNDED windowing_strategy_id:"w0@wsZUzTMDFS"}} windowing_strategies:{key:"w0@wsZUzTMDFS" value:{window_fn:{urn:"beam:window_fn:global_windows:v1"} merge_status:NON_MERGING window_coder_id:"c2@wsZUzTMDFS" trigger:{default:{}} accumulation_mode:DISCARDING output_time:END_OF_WINDOW closing_behavior:EMIT_IF_NONEMPTY on_time_behavior:FIRE_IF_NONEMPTY environment_id:"go"}} coders:{key:"c0@wsZUzTMDFS" value:{spec:{urn:"beam:coder:bytes:v1"}}} coders:{key:"c1@wsZUzTMDFS" value:{spec:{urn:"beam:coder:kv:v1"} component_coder_ids:"c0@wsZUzTMDFS" component_coder_ids:"c0@wsZUzTMDFS"}} coders:{key:"c2@wsZUzTMDFS" value:{spec:{urn:"beam:coder:global_window:v1"}}}} transform:{unique_name:"External" spec:{urn:"beam:transform:org.apache.beam:kafka_write:v1" payload:"\n}\n\x1c\n\x0eProducerConfig\x1a\n*\x08\n\x02\x10\x07\x12\x02\x10\x07\n\x0b\n\x05Topic\x1a\x02\x10\x07\n\x13\n\rKeySerializer\x1a\x02\x10\x07\n\x15\n\x0fValueSerializer\x1a\x02\x10\x07\x12$d97fbd8d-dde2-46d8-babd-f5372b6ab5e6\x12\xda\x01\x04\x00\x00\x00\x00\x01\x11bootstrap.servers\x0flocalhost:43735=xlang_kafkaio_basic_test_e110c4a4-c70d-4326-946c-1d8afc4fb9899org.apache.kafka.common.serialization.ByteArraySerializer9org.apache.kafka.common.serialization.ByteArraySerializer"} inputs:{key:"i0" value:"n4"} environment_id:"go"} namespace:"wsZUzTMDFS"
expansion failed
	caused by:
rpc error: code = Unavailable desc = connection error: desc = "transport: Error while dialing dial tcp 127.0.0.1:42301: connect: connection refused"

goroutine 41 [running]:
testing.tRunner.func1.2({0xdd09a0, 0xc00059e340})
	/home/jenkins/sdk/go1.19.3/src/testing/testing.go:1396 +0x24e
testing.tRunner.func1()
	/home/jenkins/sdk/go1.19.3/src/testing/testing.go:1399 +0x39f
panic({0xdd09a0, 0xc00059e340})
	/home/jenkins/sdk/go1.19.3/src/runtime/panic.go:884 +0x212
github.com/apache/beam/sdks/v2/go/pkg/beam.CrossLanguage({0xc0000a4380?, 0xc0001176d0?}, {0xf112dd, 0x2d}, {0xc0001ae6e0?, 0xd23740?, 0xc0001a8e30?}, {0xc000468eb0, 0xf}, 0xc0001ddc60, ...)
	<https://ci-beam.apache.org/job/beam_PostCommit_XVR_Flink/ws/src/sdks/go/pkg/beam/xlang.go>:165 +0x136
github.com/apache/beam/sdks/v2/go/pkg/beam/io/xlang/kafkaio.Write({0xc0001ef840?, 0xc0001176d0?}, {0xc000468eb0, 0xf}, {0xc000468e70, 0xf}, {0xc00066acc0, 0x3d}, {0xc0001dde60?}, {0x0, ...})
	<https://ci-beam.apache.org/job/beam_PostCommit_XVR_Flink/ws/src/sdks/go/pkg/beam/io/xlang/kafkaio/kafka.go>:279 +0x4cb
github.com/apache/beam/sdks/v2/go/test/integration/io/xlang/kafka.writeInts({0xc0001ef820?, 0xc0001176d0?}, {0xc000468eb0, 0xf}, {0xc000468e70, 0xf}, {0xc00066acc0, 0x3d}, {0xc0000dc000, 0x3e8, ...})
	<https://ci-beam.apache.org/job/beam_PostCommit_XVR_Flink/ws/src/sdks/go/test/integration/io/xlang/kafka/kafka.go>:48 +0x24d
github.com/apache/beam/sdks/v2/go/test/integration/io/xlang/kafka.WritePipeline({0xc000468eb0, 0xf}, {0xc000468e70, 0xf}, {0xc00066acc0, 0x3d}, {0xc0000dc000, 0x3e8, 0x3e8})
	<https://ci-beam.apache.org/job/beam_PostCommit_XVR_Flink/ws/src/sdks/go/test/integration/io/xlang/kafka/kafka.go>:70 +0x157
github.com/apache/beam/sdks/v2/go/test/integration/io/xlang/kafka.TestKafkaIO_BasicReadWrite(0xc000102ea0)
	<https://ci-beam.apache.org/job/beam_PostCommit_XVR_Flink/ws/src/sdks/go/test/integration/io/xlang/kafka/kafka_test.go>:61 +0xed
testing.tRunner(0xc000102ea0, 0xf4c868)
	/home/jenkins/sdk/go1.19.3/src/testing/testing.go:1446 +0x10b
created by testing.(*T).Run
	/home/jenkins/sdk/go1.19.3/src/testing/testing.go:1493 +0x35f
FAIL	github.com/apache/beam/sdks/v2/go/test/integration/io/xlang/kafka	6.061s
FAIL

> Task :runners:flink:1.15:job-server:validatesCrossLanguageRunnerGoUsingJava FAILED
> Task :runners:flink:1.15:job-server:validatesCrossLanguageRunnerJavaUsingPython
INFO:root:Default Python SDK image for environment is apache/beam_python3.8_sdk:2.45.0rc1
INFO:root:No image given, using default Python SDK image
INFO:root:Default Python SDK image for environment is apache/beam_python3.8_sdk:2.45.0rc1
INFO:root:Python SDK container image set to "apache/beam_python3.8_sdk:2.45.0rc1" for Docker environment
INFO:__main__:Listening for expansion requests at 46597
INFO:root:Missing pipeline option (runner). Executing pipeline using the default runner: DirectRunner.
INFO:__main__:Shutting down expansion service.
INFO:apache_beam.runners.portability.stager:Executing command: ['/home/jenkins/.apache_beam/cache/venvs/py-3.8-beam-2.45.0rc1-743bdccef67087512a7a190820e727aab7bdcb14/bin/python', '-m', 'pip', 'download', '--dest', '/tmp/dataflow-requirements-cache', '-r', '/tmp/tmp4kju466g/tmp_requirements.txt', '--exists-action', 'i', '--no-deps', '--implementation', 'cp', '--abi', 'cp38', '--platform', 'manylinux2014_x86_64']
INFO:root:Default Python SDK image for environment is apache/beam_python3.8_sdk:2.45.0rc1
INFO:root:No image given, using default Python SDK image
INFO:root:Default Python SDK image for environment is apache/beam_python3.8_sdk:2.45.0rc1
INFO:root:Python SDK container image set to "apache/beam_python3.8_sdk:2.45.0rc1" for Docker environment
INFO:__main__:Listening for expansion requests at 44415
INFO:root:Missing pipeline option (runner). Executing pipeline using the default runner: DirectRunner.
INFO:__main__:Shutting down expansion service.

> Task :runners:flink:1.15:job-server:validatesCrossLanguageRunnerPythonUsingJava
> Task :runners:flink:1.15:job-server:validatesCrossLanguageRunnerPythonUsingSql
> Task :runners:flink:1.15:job-server:flinkJobServerCleanup
> Task :runners:flink:1.15:job-server:validatesCrossLanguageRunnerCleanup

FAILURE: Build failed with an exception.

* Where:
Build file '<https://ci-beam.apache.org/job/beam_PostCommit_XVR_Flink/ws/src/sdks/go/test/build.gradle'> line: 193

* What went wrong:
Execution failed for task ':runners:flink:1.15:job-server:validatesCrossLanguageRunnerGoUsingJava'.
> Process 'command 'sh'' finished with non-zero exit value 1

* Try:
> Run with --stacktrace option to get the stack trace.
> Run with --info or --debug option to get more log output.

* Get more help at https://help.gradle.org

Deprecated Gradle features were used in this build, making it incompatible with Gradle 8.0.

You can use '--warning-mode all' to show the individual deprecation warnings and determine if they come from your own scripts or plugins.

See https://docs.gradle.org/7.5.1/userguide/command_line_interface.html#sec:command_line_warnings

Execution optimizations have been disabled for 1 invalid unit(s) of work during this build to ensure correctness.
Please consult deprecation warnings for more details.

BUILD FAILED in 42m 4s
271 actionable tasks: 187 executed, 72 from cache, 12 up-to-date

Publishing build scan...
https://gradle.com/s/cmjy6xv6kbbl4

Build step 'Invoke Gradle script' changed build result to FAILURE
Build step 'Invoke Gradle script' marked build as failure

---------------------------------------------------------------------
To unsubscribe, e-mail: builds-unsubscribe@beam.apache.org
For additional commands, e-mail: builds-help@beam.apache.org