You are viewing a plain text version of this content. The canonical link for it is here.
Posted to builds@solr.apache.org by Apache Jenkins Server <je...@builds.apache.org> on 2025/12/05 14:00:19 UTC

[JENKINS] Solr » Solr-Test-9.10 - Build # 361 - Still Failing!

Build: https://ci-builds.apache.org/job/Solr/job/Solr-Test-9.10/361/

No tests ran.

Build Log:
[...truncated 184 lines...]
BUILD FAILED in 1m 26s
60 actionable tasks: 60 executed

Publishing build scan...
https://develocity.apache.org/s/3vvua7dqpb5o6

Build step 'Invoke Gradle script' changed build result to FAILURE
Build step 'Invoke Gradle script' marked build as failure
Archiving artifacts
Recording test results
ERROR: Step ‘Publish JUnit test result report’ failed: No test report files were found. Configuration error?
Email was triggered for: Failure - Any
Sending email for trigger: Failure - Any

[JENKINS] Solr » Solr-Test-9.10 - Build # 362 - Still Failing!

Posted by Apache Jenkins Server <je...@builds.apache.org>.
Build: https://ci-builds.apache.org/job/Solr/job/Solr-Test-9.10/362/

No tests ran.

Build Log:
[...truncated 184 lines...]
BUILD FAILED in 1m 22s
60 actionable tasks: 60 executed

Publishing build scan...
https://develocity.apache.org/s/vk5xfvrfir632

Build step 'Invoke Gradle script' changed build result to FAILURE
Build step 'Invoke Gradle script' marked build as failure
Archiving artifacts
Recording test results
ERROR: Step ‘Publish JUnit test result report’ failed: No test report files were found. Configuration error?
Email was triggered for: Failure - Any
Sending email for trigger: Failure - Any