You are viewing a plain text version of this content. The canonical link for it is here.
Posted to commits@phoenix.apache.org by Apache Jenkins Server <je...@builds.apache.org> on 2020/02/19 03:39:38 UTC

Build failed in Jenkins: Phoenix-4.x-HBase-1.5 #277

See <https://builds.apache.org/job/Phoenix-4.x-HBase-1.5/277/display/redirect?page=changes>

Changes:

[Rajeshbabu Chintaguntla] PHOENIX-5731 Loading bulkload hfiles should not be blocked if the upsert


------------------------------------------
Started by an SCM change
Running as SYSTEM
[EnvInject] - Loading node environment variables.
Building remotely on H27 (ubuntu) in workspace <https://builds.apache.org/job/Phoenix-4.x-HBase-1.5/ws/>
No credentials specified
 > git rev-parse --is-inside-work-tree # timeout=10
Fetching changes from the remote Git repository
 > git config remote.origin.url https://gitbox.apache.org/repos/asf/phoenix.git # timeout=10
Fetching upstream changes from https://gitbox.apache.org/repos/asf/phoenix.git
 > git --version # timeout=10
 > git fetch --tags --progress -- https://gitbox.apache.org/repos/asf/phoenix.git +refs/heads/*:refs/remotes/origin/*
 > git rev-parse origin/4.x-HBase-1.5^{commit} # timeout=10
Checking out Revision 6c1a1c731ee66b5859a161284b99c6395ee60e8c (origin/4.x-HBase-1.5)
 > git config core.sparsecheckout # timeout=10
 > git checkout -f 6c1a1c731ee66b5859a161284b99c6395ee60e8c
Commit message: "PHOENIX-5731 Loading bulkload hfiles should not be blocked if the upsert select happening for differet table.(Rajeshbabu)"
 > git rev-list --no-walk 1622ef974ccd7d4ecd5d73058a6ff91a18b900c3 # timeout=10
No emails were triggered.
[EnvInject] - Executing scripts and injecting environment variables after the SCM step.
[EnvInject] - Injecting as environment variables the properties content 
MAVEN_OPTS=-Xmx3G

[EnvInject] - Variables injected successfully.
[Phoenix-4.x-HBase-1.5] $ /bin/bash -xe /tmp/jenkins1516043682936190129.sh
[Phoenix-4.x-HBase-1.5] $ /home/jenkins/tools/maven/latest3/bin/mvn -U clean install -Dcheckstyle.skip=true
[INFO] Scanning for projects...
[WARNING] 
[WARNING] Some problems were encountered while building the effective model for org.apache.phoenix:phoenix-assembly:pom:4.16.0-HBase-1.5-SNAPSHOT
[WARNING] 'build.plugins.plugin.version' for org.codehaus.mojo:exec-maven-plugin is missing. @ line 40, column 15
[WARNING] 
[WARNING] It is highly recommended to fix these problems because they threaten the stability of your build.
[WARNING] 
[WARNING] For this reason, future Maven versions might no longer support building such malformed projects.
[WARNING] 
[INFO] ------------------------------------------------------------------------
[INFO] Reactor Build Order:
[INFO] 
[INFO] Apache Phoenix                                                     [pom]
[INFO] Phoenix Core                                                       [jar]
[INFO] Phoenix - Pherf                                                    [jar]
[INFO] Phoenix Client                                                     [jar]
[INFO] Phoenix Server                                                     [jar]
[INFO] Phoenix Assembly                                                   [pom]
[INFO] Phoenix - Tracing Web Application                                  [jar]
[INFO] 
[INFO] ---------------------< org.apache.phoenix:phoenix >---------------------
[INFO] Building Apache Phoenix 4.16.0-HBase-1.5-SNAPSHOT                  [1/7]
[INFO] --------------------------------[ pom ]---------------------------------
[INFO] 
[INFO] --- maven-clean-plugin:3.1.0:clean (default-clean) @ phoenix ---
[INFO] Deleting <https://builds.apache.org/job/Phoenix-4.x-HBase-1.5/ws/target>
[INFO] 
[INFO] --- maven-enforcer-plugin:1.4.1:enforce (enforce-maven-version) @ phoenix ---
[INFO] 
[INFO] --- maven-checkstyle-plugin:3.1.0:check (validate) @ phoenix ---
[INFO] 
[INFO] --- maven-remote-resources-plugin:1.5:process (process-resource-bundles) @ phoenix ---
[INFO] 
[INFO] --- maven-source-plugin:3.0.1:jar-no-fork (attach-sources) @ phoenix ---
[INFO] 
[INFO] --- maven-jar-plugin:3.1.0:test-jar (default) @ phoenix ---
[WARNING] JAR will be empty - no content was marked for inclusion!
[INFO] Building jar: <https://builds.apache.org/job/Phoenix-4.x-HBase-1.5/ws/target/phoenix-4.16.0-HBase-1.5-SNAPSHOT-tests.jar>
[INFO] 
[INFO] --- maven-site-plugin:3.7.1:attach-descriptor (attach-descriptor) @ phoenix ---
[INFO] No site descriptor found: nothing to attach.
[INFO] 
[INFO] --- maven-install-plugin:2.5.2:install (default-install) @ phoenix ---
[INFO] Installing <https://builds.apache.org/job/Phoenix-4.x-HBase-1.5/ws/pom.xml> to /home/jenkins/.m2/repository/org/apache/phoenix/phoenix/4.16.0-HBase-1.5-SNAPSHOT/phoenix-4.16.0-HBase-1.5-SNAPSHOT.pom
[INFO] Installing <https://builds.apache.org/job/Phoenix-4.x-HBase-1.5/ws/target/phoenix-4.16.0-HBase-1.5-SNAPSHOT-tests.jar> to /home/jenkins/.m2/repository/org/apache/phoenix/phoenix/4.16.0-HBase-1.5-SNAPSHOT/phoenix-4.16.0-HBase-1.5-SNAPSHOT-tests.jar
[INFO] 
[INFO] ------------------< org.apache.phoenix:phoenix-core >-------------------
[INFO] Building Phoenix Core 4.16.0-HBase-1.5-SNAPSHOT                    [2/7]
[INFO] --------------------------------[ jar ]---------------------------------
[INFO] 
[INFO] --- maven-clean-plugin:3.1.0:clean (default-clean) @ phoenix-core ---
[INFO] Deleting <https://builds.apache.org/job/Phoenix-4.x-HBase-1.5/ws/phoenix-core/target>
[INFO] 
[INFO] --- maven-enforcer-plugin:1.4.1:enforce (enforce-maven-version) @ phoenix-core ---
[INFO] 
[INFO] --- maven-checkstyle-plugin:3.1.0:check (validate) @ phoenix-core ---
[INFO] 
[INFO] --- build-helper-maven-plugin:1.9.1:add-test-source (add-test-source) @ phoenix-core ---
[INFO] Test Source directory: <https://builds.apache.org/job/Phoenix-4.x-HBase-1.5/ws/phoenix-core/src/it/java> added.
[INFO] 
[INFO] --- build-helper-maven-plugin:1.9.1:add-test-resource (add-test-resource) @ phoenix-core ---
[INFO] 
[INFO] --- build-helper-maven-plugin:1.9.1:add-source (add-source) @ phoenix-core ---
[INFO] Source directory: <https://builds.apache.org/job/Phoenix-4.x-HBase-1.5/ws/phoenix-core/target/generated-sources/antlr3> added.
[INFO] Source directory: <https://builds.apache.org/job/Phoenix-4.x-HBase-1.5/ws/phoenix-core/src/main/antlr3> added.
[INFO] 
[INFO] --- antlr3-maven-plugin:3.5.2:antlr (default) @ phoenix-core ---
[INFO] ANTLR: Processing source directory <https://builds.apache.org/job/Phoenix-4.x-HBase-1.5/ws/phoenix-core/src/main/antlr3>
ANTLR Parser Generator  Version 3.5.2
Output file <https://builds.apache.org/job/Phoenix-4.x-HBase-1.5/ws/phoenix-core/target/generated-sources/antlr3/org/apache/phoenix/parse/PhoenixSQLParser.java> does not exist: must build <https://builds.apache.org/job/Phoenix-4.x-HBase-1.5/ws/phoenix-core/src/main/antlr3/PhoenixSQL.g>
PhoenixSQL.g
[INFO] 
[INFO] --- maven-dependency-plugin:3.1.1:build-classpath (create-phoenix-generated-classpath) @ phoenix-core ---
[INFO] Wrote classpath file '<https://builds.apache.org/job/Phoenix-4.x-HBase-1.5/ws/phoenix-core/target/cached_classpath.txt'.>
[INFO] 
[INFO] --- maven-remote-resources-plugin:1.5:process (process-resource-bundles) @ phoenix-core ---
[INFO] 
[INFO] --- maven-resources-plugin:3.1.0:resources (default-resources) @ phoenix-core ---
[INFO] Using 'UTF-8' encoding to copy filtered resources.
[INFO] Copying 3 resources
[INFO] Copying 3 resources
[INFO] 
[INFO] --- maven-compiler-plugin:3.7.0:compile (default-compile) @ phoenix-core ---
[INFO] Changes detected - recompiling the module!
[INFO] Compiling 1151 source files to <https://builds.apache.org/job/Phoenix-4.x-HBase-1.5/ws/phoenix-core/target/classes>
[INFO] <https://builds.apache.org/job/Phoenix-4.x-HBase-1.5/ws/phoenix-core/src/main/java/org/apache/phoenix/query/ConnectionQueryServices.java>: Some input files use or override a deprecated API.
[INFO] <https://builds.apache.org/job/Phoenix-4.x-HBase-1.5/ws/phoenix-core/src/main/java/org/apache/phoenix/query/ConnectionQueryServices.java>: Recompile with -Xlint:deprecation for details.
[INFO] <https://builds.apache.org/job/Phoenix-4.x-HBase-1.5/ws/phoenix-core/src/main/java/org/apache/phoenix/expression/function/SingleAggregateFunction.java>: Some input files use unchecked or unsafe operations.
[INFO] <https://builds.apache.org/job/Phoenix-4.x-HBase-1.5/ws/phoenix-core/src/main/java/org/apache/phoenix/expression/function/SingleAggregateFunction.java>: Recompile with -Xlint:unchecked for details.
[INFO] -------------------------------------------------------------
[WARNING] COMPILATION WARNING : 
[INFO] -------------------------------------------------------------
[WARNING] <https://builds.apache.org/job/Phoenix-4.x-HBase-1.5/ws/phoenix-core/src/main/java/org/apache/phoenix/execute/DescVarLengthFastByteComparisons.java>:[25,16] sun.misc.Unsafe is internal proprietary API and may be removed in a future release
[WARNING] <https://builds.apache.org/job/Phoenix-4.x-HBase-1.5/ws/phoenix-core/src/main/java/org/apache/phoenix/execute/DescVarLengthFastByteComparisons.java>:[116,26] sun.misc.Unsafe is internal proprietary API and may be removed in a future release
[WARNING] <https://builds.apache.org/job/Phoenix-4.x-HBase-1.5/ws/phoenix-core/src/main/java/org/apache/phoenix/execute/DescVarLengthFastByteComparisons.java>:[122,30] sun.misc.Unsafe is internal proprietary API and may be removed in a future release
[WARNING] <https://builds.apache.org/job/Phoenix-4.x-HBase-1.5/ws/phoenix-core/src/main/java/org/apache/phoenix/execute/DescVarLengthFastByteComparisons.java>:[126,39] sun.misc.Unsafe is internal proprietary API and may be removed in a future release
[INFO] 4 warnings 
[INFO] -------------------------------------------------------------
[INFO] -------------------------------------------------------------
[ERROR] COMPILATION ERROR : 
[INFO] -------------------------------------------------------------
[ERROR] <https://builds.apache.org/job/Phoenix-4.x-HBase-1.5/ws/phoenix-core/src/main/java/org/apache/phoenix/coprocessor/UngroupedAggregateRegionObserver.java>:[533,61] cannot find symbol
  symbol:   method getTableDescriptor()
  location: variable region of type org.apache.hadoop.hbase.regionserver.Region
[INFO] 1 error
[INFO] -------------------------------------------------------------
[INFO] ------------------------------------------------------------------------
[INFO] Reactor Summary for Apache Phoenix 4.16.0-HBase-1.5-SNAPSHOT:
[INFO] 
[INFO] Apache Phoenix ..................................... SUCCESS [  2.248 s]
[INFO] Phoenix Core ....................................... FAILURE [ 33.442 s]
[INFO] Phoenix - Pherf .................................... SKIPPED
[INFO] Phoenix Client ..................................... SKIPPED
[INFO] Phoenix Server ..................................... SKIPPED
[INFO] Phoenix Assembly ................................... SKIPPED
[INFO] Phoenix - Tracing Web Application .................. SKIPPED
[INFO] ------------------------------------------------------------------------
[INFO] BUILD FAILURE
[INFO] ------------------------------------------------------------------------
[INFO] Total time:  36.639 s
[INFO] Finished at: 2020-02-19T03:39:35Z
[INFO] ------------------------------------------------------------------------
[ERROR] Failed to execute goal org.apache.maven.plugins:maven-compiler-plugin:3.7.0:compile (default-compile) on project phoenix-core: Compilation failure
[ERROR] <https://builds.apache.org/job/Phoenix-4.x-HBase-1.5/ws/phoenix-core/src/main/java/org/apache/phoenix/coprocessor/UngroupedAggregateRegionObserver.java>:[533,61] cannot find symbol
[ERROR]   symbol:   method getTableDescriptor()
[ERROR]   location: variable region of type org.apache.hadoop.hbase.regionserver.Region
[ERROR] 
[ERROR] -> [Help 1]
[ERROR] 
[ERROR] To see the full stack trace of the errors, re-run Maven with the -e switch.
[ERROR] Re-run Maven using the -X switch to enable full debug logging.
[ERROR] 
[ERROR] For more information about the errors and possible solutions, please read the following articles:
[ERROR] [Help 1] http://cwiki.apache.org/confluence/display/MAVEN/MojoFailureException
[ERROR] 
[ERROR] After correcting the problems, you can resume the build with the command
[ERROR]   mvn <args> -rf :phoenix-core
Build step 'Invoke top-level Maven targets' marked build as failure
[JIRA] Updating issue PHOENIX-5731
Recording test results
ERROR: Step ?Publish JUnit test result report? failed: Test reports were found but none of them are new. Did leafNodes run? 
For example, <https://builds.apache.org/job/Phoenix-4.x-HBase-1.5/ws/phoenix-pherf/target/failsafe-reports/TEST-org.apache.phoenix.pherf.DataIngestIT.xml> is 2 hr 3 min old

Not sending mail to unregistered user Rajeshbabu Chintaguntla

Jenkins build is back to normal : Phoenix-4.x-HBase-1.5 #278

Posted by Apache Jenkins Server <je...@builds.apache.org>.
See <https://builds.apache.org/job/Phoenix-4.x-HBase-1.5/278/display/redirect?page=changes>