You are viewing a plain text version of this content. The canonical link for it is here.
Posted to mapreduce-dev@hadoop.apache.org by Apache Jenkins Server <je...@builds.apache.org> on 2011/10/26 05:25:43 UTC
Hadoop-Mapreduce-0.23-Commit - Build # 51 - Still Failing
See https://builds.apache.org/job/Hadoop-Mapreduce-0.23-Commit/51/
###################################################################################
########################## LAST 60 LINES OF THE CONSOLE ###########################
[...truncated 14410 lines...]
[junit] Tests run: 3, Failures: 0, Errors: 0, Time elapsed: 3.853 sec
[junit] Running org.apache.hadoop.mapred.TestMapRed
[junit] Tests run: 5, Failures: 0, Errors: 0, Time elapsed: 24.263 sec
[junit] Running org.apache.hadoop.mapred.TestMiniMRDFSCaching
[junit] Tests run: 1, Failures: 0, Errors: 0, Time elapsed: 31.524 sec
[junit] Running org.apache.hadoop.mapred.TestQueueAclsForCurrentUser
[junit] Tests run: 3, Failures: 0, Errors: 0, Time elapsed: 0.617 sec
[junit] Running org.apache.hadoop.mapred.TestRackAwareTaskPlacement
[junit] Tests run: 1, Failures: 0, Errors: 0, Time elapsed: 1.525 sec
[junit] Running org.apache.hadoop.mapred.TestReduceFetchFromPartialMem
[junit] Tests run: 1, Failures: 0, Errors: 0, Time elapsed: 30.275 sec
[junit] Running org.apache.hadoop.mapred.TestReduceTask
[junit] Tests run: 2, Failures: 0, Errors: 0, Time elapsed: 0.644 sec
[junit] Running org.apache.hadoop.mapred.TestSequenceFileAsBinaryInputFormat
[junit] Tests run: 1, Failures: 0, Errors: 0, Time elapsed: 0.777 sec
[junit] Running org.apache.hadoop.mapred.TestSequenceFileAsBinaryOutputFormat
[junit] Tests run: 3, Failures: 0, Errors: 0, Time elapsed: 1.05 sec
[junit] Running org.apache.hadoop.mapred.TestSequenceFileInputFormat
[junit] Tests run: 1, Failures: 0, Errors: 0, Time elapsed: 6.138 sec
[junit] Running org.apache.hadoop.mapred.TestSeveral
[junit] Tests run: 3, Failures: 1, Errors: 0, Time elapsed: 56.722 sec
[junit] Test org.apache.hadoop.mapred.TestSeveral FAILED
[junit] Running org.apache.hadoop.mapred.TestSpeculativeExecution
[junit] Tests run: 5, Failures: 0, Errors: 0, Time elapsed: 4.339 sec
[junit] Running org.apache.hadoop.mapred.TestTaskLimits
[junit] Tests run: 3, Failures: 0, Errors: 0, Time elapsed: 3.912 sec
[junit] Running org.apache.hadoop.mapred.TestTaskTrackerBlacklisting
[junit] Tests run: 7, Failures: 0, Errors: 0, Time elapsed: 1.795 sec
[junit] Running org.apache.hadoop.mapred.TestTextInputFormat
[junit] Tests run: 8, Failures: 0, Errors: 0, Time elapsed: 100.802 sec
[junit] Running org.apache.hadoop.mapred.TestTextOutputFormat
[junit] Tests run: 2, Failures: 0, Errors: 0, Time elapsed: 0.19 sec
[junit] Running org.apache.hadoop.mapred.TestTrackerBlacklistAcrossJobs
[junit] Tests run: 1, Failures: 0, Errors: 0, Time elapsed: 41.983 sec
[junit] Running org.apache.hadoop.mapreduce.TestCounters
[junit] Tests run: 2, Failures: 0, Errors: 0, Time elapsed: 0.345 sec
[junit] Running org.apache.hadoop.mapreduce.TestMapCollection
[junit] Tests run: 11, Failures: 0, Errors: 0, Time elapsed: 21.599 sec
[junit] Running org.apache.hadoop.mapreduce.TestMapReduceLocal
[junit] Tests run: 1, Failures: 0, Errors: 0, Time elapsed: 28.876 sec
[junit] Running org.apache.hadoop.mapreduce.lib.input.TestFileInputFormat
[junit] Tests run: 2, Failures: 0, Errors: 0, Time elapsed: 0.979 sec
[junit] Running org.apache.hadoop.mapreduce.lib.output.TestFileOutputCommitter
[junit] Tests run: 3, Failures: 0, Errors: 0, Time elapsed: 0.636 sec
checkfailure:
[touch] Creating /home/jenkins/jenkins-slave/workspace/Hadoop-Mapreduce-0.23-Commit/trunk/hadoop-mapreduce-project/build/test/testsfailed
BUILD FAILED
/home/jenkins/jenkins-slave/workspace/Hadoop-Mapreduce-0.23-Commit/trunk/hadoop-mapreduce-project/build.xml:792: The following error occurred while executing this line:
/home/jenkins/jenkins-slave/workspace/Hadoop-Mapreduce-0.23-Commit/trunk/hadoop-mapreduce-project/build.xml:755: The following error occurred while executing this line:
/home/jenkins/jenkins-slave/workspace/Hadoop-Mapreduce-0.23-Commit/trunk/hadoop-mapreduce-project/build.xml:816: Tests failed!
Total time: 7 minutes 45 seconds
Build step 'Execute shell' marked build as failure
Recording test results
Updating MAPREDUCE-2977
Email was triggered for: Failure
Sending email for trigger: Failure
###################################################################################
############################## FAILED TESTS (if any) ##############################
All tests passed