You are viewing a plain text version of this content. The canonical link for it is here.
Posted to builds@beam.apache.org by Apache Jenkins Server <je...@builds.apache.org> on 2021/05/20 12:14:59 UTC

Build failed in Jenkins: beam_PostCommit_XVR_Dataflow #747

See <https://ci-beam.apache.org/job/beam_PostCommit_XVR_Dataflow/747/display/redirect>

Changes:


------------------------------------------
[...truncated 664.27 KB...]
    return self.pipeline.apply(ptransform, self)
  File "<https://ci-beam.apache.org/job/beam_PostCommit_XVR_Dataflow/ws/src/sdks/python/apache_beam/pipeline.py",> line 694, in apply
    pvalueish_result = self.runner.apply(transform, pvalueish, self._options)
  File "<https://ci-beam.apache.org/job/beam_PostCommit_XVR_Dataflow/ws/src/sdks/python/apache_beam/runners/dataflow/dataflow_runner.py",> line 141, in apply
    return super(DataflowRunner, self).apply(transform, input, options)
  File "<https://ci-beam.apache.org/job/beam_PostCommit_XVR_Dataflow/ws/src/sdks/python/apache_beam/runners/runner.py",> line 185, in apply
    return m(transform, input, options)
  File "<https://ci-beam.apache.org/job/beam_PostCommit_XVR_Dataflow/ws/src/sdks/python/apache_beam/runners/runner.py",> line 215, in apply_PTransform
    return transform.expand(input)
  File "<https://ci-beam.apache.org/job/beam_PostCommit_XVR_Dataflow/ws/src/sdks/python/apache_beam/transforms/external.py",> line 295, in expand
    response = service.Expand(request)
  File "<https://ci-beam.apache.org/job/beam_PostCommit_XVR_Dataflow/ws/src/build/gradleenv/1922375555/lib/python3.6/site-packages/grpc/_channel.py",> line 946, in __call__
    return _end_unary_response_blocking(state, call, False, None)
  File "<https://ci-beam.apache.org/job/beam_PostCommit_XVR_Dataflow/ws/src/build/gradleenv/1922375555/lib/python3.6/site-packages/grpc/_channel.py",> line 849, in _end_unary_response_blocking
    raise _InactiveRpcError(state)
grpc._channel._InactiveRpcError: <_InactiveRpcError of RPC that terminated with:
	status = StatusCode.UNIMPLEMENTED
	details = "Method not found: org.apache.beam.model.expansion.v1.ExpansionService/Expand"
	debug_error_string = "{"created":"@1621512894.164755886","description":"Error received from peer ipv4:127.0.0.1:18091","file":"src/core/lib/surface/call.cc","file_line":1067,"grpc_message":"Method not found: org.apache.beam.model.expansion.v1.ExpansionService/Expand","grpc_status":12}"
>

======================================================================
ERROR: test_group_by_key (apache_beam.transforms.validate_runner_xlang_test.ValidateRunnerXlangTest)
----------------------------------------------------------------------
Traceback (most recent call last):
  File "<https://ci-beam.apache.org/job/beam_PostCommit_XVR_Dataflow/ws/src/sdks/python/apache_beam/transforms/validate_runner_xlang_test.py",> line 262, in test_group_by_key
    test_pipeline or self.create_pipeline())
  File "<https://ci-beam.apache.org/job/beam_PostCommit_XVR_Dataflow/ws/src/sdks/python/apache_beam/transforms/validate_runner_xlang_test.py",> line 140, in run_group_by_key
    | beam.Map(lambda x: "{}:{}".format(x[0], ','.join(sorted(x[1])))))
  File "<https://ci-beam.apache.org/job/beam_PostCommit_XVR_Dataflow/ws/src/sdks/python/apache_beam/pvalue.py",> line 142, in __or__
    return self.pipeline.apply(ptransform, self)
  File "<https://ci-beam.apache.org/job/beam_PostCommit_XVR_Dataflow/ws/src/sdks/python/apache_beam/pipeline.py",> line 694, in apply
    pvalueish_result = self.runner.apply(transform, pvalueish, self._options)
  File "<https://ci-beam.apache.org/job/beam_PostCommit_XVR_Dataflow/ws/src/sdks/python/apache_beam/runners/dataflow/dataflow_runner.py",> line 141, in apply
    return super(DataflowRunner, self).apply(transform, input, options)
  File "<https://ci-beam.apache.org/job/beam_PostCommit_XVR_Dataflow/ws/src/sdks/python/apache_beam/runners/runner.py",> line 185, in apply
    return m(transform, input, options)
  File "<https://ci-beam.apache.org/job/beam_PostCommit_XVR_Dataflow/ws/src/sdks/python/apache_beam/runners/runner.py",> line 215, in apply_PTransform
    return transform.expand(input)
  File "<https://ci-beam.apache.org/job/beam_PostCommit_XVR_Dataflow/ws/src/sdks/python/apache_beam/transforms/external.py",> line 295, in expand
    response = service.Expand(request)
  File "<https://ci-beam.apache.org/job/beam_PostCommit_XVR_Dataflow/ws/src/build/gradleenv/1922375555/lib/python3.6/site-packages/grpc/_channel.py",> line 946, in __call__
    return _end_unary_response_blocking(state, call, False, None)
  File "<https://ci-beam.apache.org/job/beam_PostCommit_XVR_Dataflow/ws/src/build/gradleenv/1922375555/lib/python3.6/site-packages/grpc/_channel.py",> line 849, in _end_unary_response_blocking
    raise _InactiveRpcError(state)
grpc._channel._InactiveRpcError: <_InactiveRpcError of RPC that terminated with:
	status = StatusCode.UNIMPLEMENTED
	details = "Method not found: org.apache.beam.model.expansion.v1.ExpansionService/Expand"
	debug_error_string = "{"created":"@1621512894.164745275","description":"Error received from peer ipv4:127.0.0.1:18091","file":"src/core/lib/surface/call.cc","file_line":1067,"grpc_message":"Method not found: org.apache.beam.model.expansion.v1.ExpansionService/Expand","grpc_status":12}"
>

======================================================================
ERROR: test_combine_per_key (apache_beam.transforms.validate_runner_xlang_test.ValidateRunnerXlangTest)
----------------------------------------------------------------------
Traceback (most recent call last):
  File "<https://ci-beam.apache.org/job/beam_PostCommit_XVR_Dataflow/ws/src/sdks/python/apache_beam/transforms/validate_runner_xlang_test.py",> line 274, in test_combine_per_key
    test_pipeline or self.create_pipeline())
  File "<https://ci-beam.apache.org/job/beam_PostCommit_XVR_Dataflow/ws/src/sdks/python/apache_beam/transforms/validate_runner_xlang_test.py",> line 200, in run_combine_per_key
    TEST_COMPK_URN, None, self.expansion_service))
  File "<https://ci-beam.apache.org/job/beam_PostCommit_XVR_Dataflow/ws/src/sdks/python/apache_beam/pvalue.py",> line 142, in __or__
    return self.pipeline.apply(ptransform, self)
  File "<https://ci-beam.apache.org/job/beam_PostCommit_XVR_Dataflow/ws/src/sdks/python/apache_beam/pipeline.py",> line 694, in apply
    pvalueish_result = self.runner.apply(transform, pvalueish, self._options)
  File "<https://ci-beam.apache.org/job/beam_PostCommit_XVR_Dataflow/ws/src/sdks/python/apache_beam/runners/dataflow/dataflow_runner.py",> line 141, in apply
    return super(DataflowRunner, self).apply(transform, input, options)
  File "<https://ci-beam.apache.org/job/beam_PostCommit_XVR_Dataflow/ws/src/sdks/python/apache_beam/runners/runner.py",> line 185, in apply
    return m(transform, input, options)
  File "<https://ci-beam.apache.org/job/beam_PostCommit_XVR_Dataflow/ws/src/sdks/python/apache_beam/runners/runner.py",> line 215, in apply_PTransform
    return transform.expand(input)
  File "<https://ci-beam.apache.org/job/beam_PostCommit_XVR_Dataflow/ws/src/sdks/python/apache_beam/transforms/external.py",> line 295, in expand
    response = service.Expand(request)
  File "<https://ci-beam.apache.org/job/beam_PostCommit_XVR_Dataflow/ws/src/build/gradleenv/1922375555/lib/python3.6/site-packages/grpc/_channel.py",> line 946, in __call__
    return _end_unary_response_blocking(state, call, False, None)
  File "<https://ci-beam.apache.org/job/beam_PostCommit_XVR_Dataflow/ws/src/build/gradleenv/1922375555/lib/python3.6/site-packages/grpc/_channel.py",> line 849, in _end_unary_response_blocking
    raise _InactiveRpcError(state)
grpc._channel._InactiveRpcError: <_InactiveRpcError of RPC that terminated with:
	status = StatusCode.UNIMPLEMENTED
	details = "Method not found: org.apache.beam.model.expansion.v1.ExpansionService/Expand"
	debug_error_string = "{"created":"@1621512894.164727563","description":"Error received from peer ipv4:127.0.0.1:18091","file":"src/core/lib/surface/call.cc","file_line":1067,"grpc_message":"Method not found: org.apache.beam.model.expansion.v1.ExpansionService/Expand","grpc_status":12}"
>

======================================================================
ERROR: test_multi_input_output_with_sideinput (apache_beam.transforms.validate_runner_xlang_test.ValidateRunnerXlangTest)
----------------------------------------------------------------------
Traceback (most recent call last):
  File "<https://ci-beam.apache.org/job/beam_PostCommit_XVR_Dataflow/ws/src/sdks/python/apache_beam/transforms/validate_runner_xlang_test.py",> line 258, in test_multi_input_output_with_sideinput
    test_pipeline or self.create_pipeline())
  File "<https://ci-beam.apache.org/job/beam_PostCommit_XVR_Dataflow/ws/src/sdks/python/apache_beam/transforms/validate_runner_xlang_test.py",> line 119, in run_multi_input_output_with_sideinput
    TEST_MULTI_URN, None, self.expansion_service)
  File "<https://ci-beam.apache.org/job/beam_PostCommit_XVR_Dataflow/ws/src/sdks/python/apache_beam/transforms/ptransform.py",> line 601, in __ror__
    result = p.apply(self, pvalueish, label)
  File "<https://ci-beam.apache.org/job/beam_PostCommit_XVR_Dataflow/ws/src/sdks/python/apache_beam/pipeline.py",> line 694, in apply
    pvalueish_result = self.runner.apply(transform, pvalueish, self._options)
  File "<https://ci-beam.apache.org/job/beam_PostCommit_XVR_Dataflow/ws/src/sdks/python/apache_beam/runners/dataflow/dataflow_runner.py",> line 141, in apply
    return super(DataflowRunner, self).apply(transform, input, options)
  File "<https://ci-beam.apache.org/job/beam_PostCommit_XVR_Dataflow/ws/src/sdks/python/apache_beam/runners/runner.py",> line 185, in apply
    return m(transform, input, options)
  File "<https://ci-beam.apache.org/job/beam_PostCommit_XVR_Dataflow/ws/src/sdks/python/apache_beam/runners/runner.py",> line 215, in apply_PTransform
    return transform.expand(input)
  File "<https://ci-beam.apache.org/job/beam_PostCommit_XVR_Dataflow/ws/src/sdks/python/apache_beam/transforms/external.py",> line 295, in expand
    response = service.Expand(request)
  File "<https://ci-beam.apache.org/job/beam_PostCommit_XVR_Dataflow/ws/src/build/gradleenv/1922375555/lib/python3.6/site-packages/grpc/_channel.py",> line 946, in __call__
    return _end_unary_response_blocking(state, call, False, None)
  File "<https://ci-beam.apache.org/job/beam_PostCommit_XVR_Dataflow/ws/src/build/gradleenv/1922375555/lib/python3.6/site-packages/grpc/_channel.py",> line 849, in _end_unary_response_blocking
    raise _InactiveRpcError(state)
grpc._channel._InactiveRpcError: <_InactiveRpcError of RPC that terminated with:
	status = StatusCode.UNIMPLEMENTED
	details = "Method not found: org.apache.beam.model.expansion.v1.ExpansionService/Expand"
	debug_error_string = "{"created":"@1621512894.177561379","description":"Error received from peer ipv4:127.0.0.1:18091","file":"src/core/lib/surface/call.cc","file_line":1067,"grpc_message":"Method not found: org.apache.beam.model.expansion.v1.ExpansionService/Expand","grpc_status":12}"
>

======================================================================
ERROR: test_partition (apache_beam.transforms.validate_runner_xlang_test.ValidateRunnerXlangTest)
----------------------------------------------------------------------
Traceback (most recent call last):
  File "<https://ci-beam.apache.org/job/beam_PostCommit_XVR_Dataflow/ws/src/sdks/python/apache_beam/transforms/validate_runner_xlang_test.py",> line 282, in test_partition
    test_pipeline or self.create_pipeline())
  File "<https://ci-beam.apache.org/job/beam_PostCommit_XVR_Dataflow/ws/src/sdks/python/apache_beam/transforms/validate_runner_xlang_test.py",> line 235, in run_partition
    TEST_PARTITION_URN, None, self.expansion_service))
  File "<https://ci-beam.apache.org/job/beam_PostCommit_XVR_Dataflow/ws/src/sdks/python/apache_beam/pvalue.py",> line 142, in __or__
    return self.pipeline.apply(ptransform, self)
  File "<https://ci-beam.apache.org/job/beam_PostCommit_XVR_Dataflow/ws/src/sdks/python/apache_beam/pipeline.py",> line 694, in apply
    pvalueish_result = self.runner.apply(transform, pvalueish, self._options)
  File "<https://ci-beam.apache.org/job/beam_PostCommit_XVR_Dataflow/ws/src/sdks/python/apache_beam/runners/dataflow/dataflow_runner.py",> line 141, in apply
    return super(DataflowRunner, self).apply(transform, input, options)
  File "<https://ci-beam.apache.org/job/beam_PostCommit_XVR_Dataflow/ws/src/sdks/python/apache_beam/runners/runner.py",> line 185, in apply
    return m(transform, input, options)
  File "<https://ci-beam.apache.org/job/beam_PostCommit_XVR_Dataflow/ws/src/sdks/python/apache_beam/runners/runner.py",> line 215, in apply_PTransform
    return transform.expand(input)
  File "<https://ci-beam.apache.org/job/beam_PostCommit_XVR_Dataflow/ws/src/sdks/python/apache_beam/transforms/external.py",> line 295, in expand
    response = service.Expand(request)
  File "<https://ci-beam.apache.org/job/beam_PostCommit_XVR_Dataflow/ws/src/build/gradleenv/1922375555/lib/python3.6/site-packages/grpc/_channel.py",> line 946, in __call__
    return _end_unary_response_blocking(state, call, False, None)
  File "<https://ci-beam.apache.org/job/beam_PostCommit_XVR_Dataflow/ws/src/build/gradleenv/1922375555/lib/python3.6/site-packages/grpc/_channel.py",> line 849, in _end_unary_response_blocking
    raise _InactiveRpcError(state)
grpc._channel._InactiveRpcError: <_InactiveRpcError of RPC that terminated with:
	status = StatusCode.UNIMPLEMENTED
	details = "Method not found: org.apache.beam.model.expansion.v1.ExpansionService/Expand"
	debug_error_string = "{"created":"@1621512894.236818668","description":"Error received from peer ipv4:127.0.0.1:18091","file":"src/core/lib/surface/call.cc","file_line":1067,"grpc_message":"Method not found: org.apache.beam.model.expansion.v1.ExpansionService/Expand","grpc_status":12}"
>

======================================================================
ERROR: test_prefix (apache_beam.transforms.validate_runner_xlang_test.ValidateRunnerXlangTest)
----------------------------------------------------------------------
Traceback (most recent call last):
  File "<https://ci-beam.apache.org/job/beam_PostCommit_XVR_Dataflow/ws/src/sdks/python/apache_beam/transforms/validate_runner_xlang_test.py",> line 254, in test_prefix
    test_pipeline or self.create_pipeline())
  File "<https://ci-beam.apache.org/job/beam_PostCommit_XVR_Dataflow/ws/src/sdks/python/apache_beam/transforms/validate_runner_xlang_test.py",> line 98, in run_prefix
    self.expansion_service))
  File "<https://ci-beam.apache.org/job/beam_PostCommit_XVR_Dataflow/ws/src/sdks/python/apache_beam/pvalue.py",> line 142, in __or__
    return self.pipeline.apply(ptransform, self)
  File "<https://ci-beam.apache.org/job/beam_PostCommit_XVR_Dataflow/ws/src/sdks/python/apache_beam/pipeline.py",> line 694, in apply
    pvalueish_result = self.runner.apply(transform, pvalueish, self._options)
  File "<https://ci-beam.apache.org/job/beam_PostCommit_XVR_Dataflow/ws/src/sdks/python/apache_beam/runners/dataflow/dataflow_runner.py",> line 141, in apply
    return super(DataflowRunner, self).apply(transform, input, options)
  File "<https://ci-beam.apache.org/job/beam_PostCommit_XVR_Dataflow/ws/src/sdks/python/apache_beam/runners/runner.py",> line 185, in apply
    return m(transform, input, options)
  File "<https://ci-beam.apache.org/job/beam_PostCommit_XVR_Dataflow/ws/src/sdks/python/apache_beam/runners/runner.py",> line 215, in apply_PTransform
    return transform.expand(input)
  File "<https://ci-beam.apache.org/job/beam_PostCommit_XVR_Dataflow/ws/src/sdks/python/apache_beam/transforms/external.py",> line 295, in expand
    response = service.Expand(request)
  File "<https://ci-beam.apache.org/job/beam_PostCommit_XVR_Dataflow/ws/src/build/gradleenv/1922375555/lib/python3.6/site-packages/grpc/_channel.py",> line 946, in __call__
    return _end_unary_response_blocking(state, call, False, None)
  File "<https://ci-beam.apache.org/job/beam_PostCommit_XVR_Dataflow/ws/src/build/gradleenv/1922375555/lib/python3.6/site-packages/grpc/_channel.py",> line 849, in _end_unary_response_blocking
    raise _InactiveRpcError(state)
grpc._channel._InactiveRpcError: <_InactiveRpcError of RPC that terminated with:
	status = StatusCode.UNIMPLEMENTED
	details = "Method not found: org.apache.beam.model.expansion.v1.ExpansionService/Expand"
	debug_error_string = "{"created":"@1621512894.251852878","description":"Error received from peer ipv4:127.0.0.1:18091","file":"src/core/lib/surface/call.cc","file_line":1067,"grpc_message":"Method not found: org.apache.beam.model.expansion.v1.ExpansionService/Expand","grpc_status":12}"
>

----------------------------------------------------------------------
XML: nosetests-xlangValidateRunner.xml
----------------------------------------------------------------------
XML: <https://ci-beam.apache.org/job/beam_PostCommit_XVR_Dataflow/ws/src/sdks/python/nosetests.xml>
----------------------------------------------------------------------
Ran 8 tests in 5.492s

FAILED (errors=8)

> Task :runners:google-cloud-dataflow-java:validatesCrossLanguageRunnerPythonUsingJava FAILED

> Task :runners:google-cloud-dataflow-java:validatesCrossLanguageRunnerCleanup
Skipping invalid pid: 25116.
Stopping expansion service pid: 25119.

> Task :runners:google-cloud-dataflow-java:cleanUpDockerImages
Untagged: us.gcr.io/apache-beam-testing/java-postcommit-it/java:20210520120047
Untagged: us.gcr.io/apache-beam-testing/java-postcommit-it/java@sha256:c7116c989e7896be8261ad24d6b2912fcbcfe210236b2abb258b11b6d3b08b9f
Deleted: sha256:0dcd6233b33c6ac967dfab83d52ce3020fc36492dfc83b0bc7400856df3afcfe
Deleted: sha256:b31f3656712679602e4fdc7c4450d92c17a2b62545f52614e625be2c3683eee5
Deleted: sha256:70890abf1905c48ec944502b936b5ed8b9d3b0f42c976753cb77e8d7b375fb42
Deleted: sha256:85f67e7b39649f4f9b9ba94204957baa71784c466d5dd5565cff33dfd0530feb
Deleted: sha256:4260e04256505525fc828f6beed9423d807048949a7054a9f29267acde84ebcc
Deleted: sha256:a7de8bb9cc4241bb73cc1d2674b6985f0e0c54f5b4a05445d47b4026d1aa0593
Deleted: sha256:516469f96fb050de504ca74049aba3a6cf43ded89b5a4e45bd889ff9f1c0fae5
Deleted: sha256:27c945920c1e7d07f0d25e0aa16d2f7685d2d1755121575a7a519eb0bed4a82c
Deleted: sha256:2e36fff64f2b38a9e3805784384598d2bf979e5af961d66f70b59347cb72a8f0
Deleted: sha256:f9a0f9ed3a1c13ae6e09505bdfb4822c7343ffa08c9665fc49f218d9dc4a7ece
Deleted: sha256:172a14cfb86e03af8bbf2eea4cf9b56d99f3f11e728b761efb1515f51ea4f48e
Deleted: sha256:ed8dbfaaaaea712099bfa7fbb1c1de12cc6f03b6f56bb62ba3bc0373cc095b16
Deleted: sha256:056a6b004fe17e6286ebfa934f5f3015bed81d93449cafb352aa506f2261a3cc
Deleted: sha256:06a4a45da8b8b729abecc849b32247ac78e345fb8bad37c238fc6f5fe8b05289
Deleted: sha256:6b324f3279572ef21db5dd39247c5d81245e9423c325c319196e704d4c0bbe26
Deleted: sha256:70a0e3362a2d1d3f8e149998a8868c65b295c696d8783b7e22586c5b3cc23751
Deleted: sha256:29d395a3ddad70f5c03da191e5c588bfce192612f2ac01f1d6262ff0973b1be5
Deleted: sha256:f1d8eee85417849f002ea1201c622df191a60d4c30923efea86eb222d0997c24
Deleted: sha256:4408a8140fb1f80aa70c24f6ad6220831394aada95a1052a3997c6bf3af6dc9d
Deleted: sha256:66ca8b8acf23ff418ea8c2510a8bba1f2d8e1a2775f55be3e9cc02264bd79576
Deleted: sha256:33b317b4ed8963eb54fa0a1a9bade5444db8c23893009fd4c53e4ceaaedf1ebc
Deleted: sha256:5260627804f7065460b3304cc081dbe92db69ad45f7525a4afd6f5c0e92d6517
Deleted: sha256:b7c742e9d18f94f729c913ad51481e5ed213d73f41b1c908478f86e54644091e
Deleted: sha256:dc3f885ad7e3dcef28c437195bfa7a45e7dcb666defb18b0db222e4f5f731e81
Deleted: sha256:b184be11df075f227f87e61a9ce041463e3b1d47ac7414a4485cfd5b3c179b4b
Deleted: sha256:739aacc05dbf817b993b24a4962ace984872e0a42d32145feef84b0faf67ba83
Deleted: sha256:3cb854821746de792149782fe7c9c0c3d557af749facb0755ac006e6d2ce4a7f
Deleted: sha256:e025eb89044c0df6b0d54a53c924411054a055a8c54104a9c94e2d857853ef91
Digests:
- us.gcr.io/apache-beam-testing/java-postcommit-it/java@sha256:c7116c989e7896be8261ad24d6b2912fcbcfe210236b2abb258b11b6d3b08b9f
  Associated tags:
 - 20210520120047
Tags:
- us.gcr.io/apache-beam-testing/java-postcommit-it/java:20210520120047
Deleted [us.gcr.io/apache-beam-testing/java-postcommit-it/java:20210520120047].
Deleted [us.gcr.io/apache-beam-testing/java-postcommit-it/java@sha256:c7116c989e7896be8261ad24d6b2912fcbcfe210236b2abb258b11b6d3b08b9f].

FAILURE: Build failed with an exception.

* What went wrong:
Execution failed for task ':runners:google-cloud-dataflow-java:validatesCrossLanguageRunnerPythonUsingJava'.
> Process 'command 'sh'' finished with non-zero exit value 1

* Try:
Run with --stacktrace option to get the stack trace. Run with --info or --debug option to get more log output. Run with --scan to get full insights.

* Get more help at https://help.gradle.org

Deprecated Gradle features were used in this build, making it incompatible with Gradle 7.0.
Use '--warning-mode all' to show the individual deprecation warnings.
See https://docs.gradle.org/6.8.3/userguide/command_line_interface.html#sec:command_line_warnings

BUILD FAILED in 14m 32s
113 actionable tasks: 84 executed, 25 from cache, 4 up-to-date

Publishing build scan...
https://gradle.com/s/s2ydpl5lzz5xe

Build step 'Invoke Gradle script' changed build result to FAILURE
Build step 'Invoke Gradle script' marked build as failure

---------------------------------------------------------------------
To unsubscribe, e-mail: builds-unsubscribe@beam.apache.org
For additional commands, e-mail: builds-help@beam.apache.org


Jenkins build is back to normal : beam_PostCommit_XVR_Dataflow #748

Posted by Apache Jenkins Server <je...@builds.apache.org>.
See <https://ci-beam.apache.org/job/beam_PostCommit_XVR_Dataflow/748/display/redirect>


---------------------------------------------------------------------
To unsubscribe, e-mail: builds-unsubscribe@beam.apache.org
For additional commands, e-mail: builds-help@beam.apache.org