You are viewing a plain text version of this content. The canonical link for it is here.
Posted to builds@beam.apache.org by Apache Jenkins Server <je...@builds.apache.org> on 2023/02/21 12:49:33 UTC

Build failed in Jenkins: beam_PostCommit_Python310 #502

See <https://ci-beam.apache.org/job/beam_PostCommit_Python310/502/display/redirect>

Changes:


------------------------------------------
[...truncated 9.61 MB...]
../../build/gradleenv/2050596098/lib/python3.10/site-packages/tenacity/_asyncio.py:42
../../build/gradleenv/2050596098/lib/python3.10/site-packages/tenacity/_asyncio.py:42
../../build/gradleenv/2050596098/lib/python3.10/site-packages/tenacity/_asyncio.py:42
../../build/gradleenv/2050596098/lib/python3.10/site-packages/tenacity/_asyncio.py:42
../../build/gradleenv/2050596098/lib/python3.10/site-packages/tenacity/_asyncio.py:42
../../build/gradleenv/2050596098/lib/python3.10/site-packages/tenacity/_asyncio.py:42
  <https://ci-beam.apache.org/job/beam_PostCommit_Python310/ws/src/build/gradleenv/2050596098/lib/python3.10/site-packages/tenacity/_asyncio.py>:42: DeprecationWarning: "@coroutine" decorator is deprecated since Python 3.8, use "async def" instead
    def call(self, fn, *args, **kwargs):

apache_beam/typehints/pandas_type_compatibility_test.py:67
apache_beam/typehints/pandas_type_compatibility_test.py:67
apache_beam/typehints/pandas_type_compatibility_test.py:67
apache_beam/typehints/pandas_type_compatibility_test.py:67
apache_beam/typehints/pandas_type_compatibility_test.py:67
apache_beam/typehints/pandas_type_compatibility_test.py:67
apache_beam/typehints/pandas_type_compatibility_test.py:67
apache_beam/typehints/pandas_type_compatibility_test.py:67
  <https://ci-beam.apache.org/job/beam_PostCommit_Python310/ws/src/sdks/python/apache_beam/typehints/pandas_type_compatibility_test.py>:67: FutureWarning: pandas.Int64Index is deprecated and will be removed from pandas in a future version. Use pandas.Index with the appropriate dtype instead.
    }).set_index(pd.Int64Index(range(123, 223), name='an_index')),

apache_beam/typehints/pandas_type_compatibility_test.py:90
apache_beam/typehints/pandas_type_compatibility_test.py:90
apache_beam/typehints/pandas_type_compatibility_test.py:90
apache_beam/typehints/pandas_type_compatibility_test.py:90
apache_beam/typehints/pandas_type_compatibility_test.py:90
apache_beam/typehints/pandas_type_compatibility_test.py:90
apache_beam/typehints/pandas_type_compatibility_test.py:90
apache_beam/typehints/pandas_type_compatibility_test.py:90
  <https://ci-beam.apache.org/job/beam_PostCommit_Python310/ws/src/sdks/python/apache_beam/typehints/pandas_type_compatibility_test.py>:90: FutureWarning: pandas.Int64Index is deprecated and will be removed from pandas in a future version. Use pandas.Index with the appropriate dtype instead.
    pd.Int64Index(range(123, 223), name='an_index'),

apache_beam/typehints/pandas_type_compatibility_test.py:91
apache_beam/typehints/pandas_type_compatibility_test.py:91
apache_beam/typehints/pandas_type_compatibility_test.py:91
apache_beam/typehints/pandas_type_compatibility_test.py:91
apache_beam/typehints/pandas_type_compatibility_test.py:91
apache_beam/typehints/pandas_type_compatibility_test.py:91
apache_beam/typehints/pandas_type_compatibility_test.py:91
apache_beam/typehints/pandas_type_compatibility_test.py:91
  <https://ci-beam.apache.org/job/beam_PostCommit_Python310/ws/src/sdks/python/apache_beam/typehints/pandas_type_compatibility_test.py>:91: FutureWarning: pandas.Int64Index is deprecated and will be removed from pandas in a future version. Use pandas.Index with the appropriate dtype instead.
    pd.Int64Index(range(475, 575), name='another_index'),

apache_beam/dataframe/io_it_test.py: 3 warnings
apache_beam/examples/cookbook/bigquery_tornadoes_it_test.py: 1 warning
apache_beam/examples/dataframe/flight_delays_it_test.py: 1 warning
apache_beam/io/gcp/big_query_query_to_table_it_test.py: 4 warnings
apache_beam/io/gcp/bigquery_read_it_test.py: 7 warnings
apache_beam/io/gcp/bigquery_json_it_test.py: 3 warnings
apache_beam/io/gcp/bigquery_io_read_it_test.py: 2 warnings
  <https://ci-beam.apache.org/job/beam_PostCommit_Python310/ws/src/sdks/python/apache_beam/io/gcp/bigquery.py>:2485: BeamDeprecationWarning: options is deprecated since First stable release. References to <pipeline>.options will not be supported
    temp_location = pcoll.pipeline.options.view_as(

apache_beam/dataframe/io_it_test.py: 3 warnings
apache_beam/examples/cookbook/bigquery_tornadoes_it_test.py: 1 warning
apache_beam/examples/dataframe/flight_delays_it_test.py: 1 warning
apache_beam/io/gcp/big_query_query_to_table_it_test.py: 4 warnings
apache_beam/io/gcp/bigquery_read_it_test.py: 7 warnings
apache_beam/io/gcp/bigquery_json_it_test.py: 3 warnings
apache_beam/io/gcp/bigquery_io_read_it_test.py: 2 warnings
  <https://ci-beam.apache.org/job/beam_PostCommit_Python310/ws/src/sdks/python/apache_beam/io/gcp/bigquery.py>:2487: BeamDeprecationWarning: options is deprecated since First stable release. References to <pipeline>.options will not be supported
    job_name = pcoll.pipeline.options.view_as(GoogleCloudOptions).job_name

apache_beam/dataframe/io_it_test.py: 3 warnings
apache_beam/examples/cookbook/bigquery_tornadoes_it_test.py: 1 warning
apache_beam/examples/dataframe/flight_delays_it_test.py: 1 warning
apache_beam/io/gcp/big_query_query_to_table_it_test.py: 4 warnings
apache_beam/io/gcp/bigquery_read_it_test.py: 7 warnings
apache_beam/io/gcp/bigquery_json_it_test.py: 3 warnings
apache_beam/io/gcp/bigquery_io_read_it_test.py: 2 warnings
  <https://ci-beam.apache.org/job/beam_PostCommit_Python310/ws/src/sdks/python/apache_beam/io/gcp/bigquery.py>:2511: BeamDeprecationWarning: options is deprecated since First stable release. References to <pipeline>.options will not be supported
    pipeline_options=pcoll.pipeline.options,

apache_beam/examples/complete/game/game_stats_it_test.py::GameStatsIT::test_game_stats_it
apache_beam/examples/complete/game/hourly_team_score_it_test.py::HourlyTeamScoreIT::test_hourly_team_score_it
apache_beam/examples/complete/game/leader_board_it_test.py::LeaderBoardIT::test_leader_board_it
apache_beam/io/gcp/bigquery_test.py::PubSubBigQueryIT::test_file_loads
apache_beam/io/gcp/bigquery_test.py::PubSubBigQueryIT::test_streaming_inserts
  <https://ci-beam.apache.org/job/beam_PostCommit_Python310/ws/src/sdks/python/apache_beam/io/gcp/tests/utils.py>:63: PendingDeprecationWarning: Client.dataset is deprecated and will be removed in a future version. Use a string like 'my_project.my_dataset' or a cloud.google.bigquery.DatasetReference object, instead.
    dataset_ref = client.dataset(unique_dataset_name, project=project)

apache_beam/examples/complete/game/game_stats_it_test.py: 2 warnings
apache_beam/examples/cookbook/bigquery_tornadoes_it_test.py: 1 warning
apache_beam/examples/complete/game/hourly_team_score_it_test.py: 1 warning
apache_beam/examples/complete/game/leader_board_it_test.py: 2 warnings
apache_beam/io/gcp/bigquery_file_loads_test.py: 3 warnings
apache_beam/io/gcp/big_query_query_to_table_it_test.py: 4 warnings
apache_beam/io/gcp/bigquery_write_it_test.py: 4 warnings
apache_beam/io/gcp/bigquery_test.py: 6 warnings
apache_beam/io/gcp/bigquery_json_it_test.py: 2 warnings
  <https://ci-beam.apache.org/job/beam_PostCommit_Python310/ws/src/sdks/python/apache_beam/io/gcp/bigquery.py>:1992: BeamDeprecationWarning: options is deprecated since First stable release. References to <pipeline>.options will not be supported
    is_streaming_pipeline = p.options.view_as(StandardOptions).streaming

apache_beam/examples/complete/game/game_stats_it_test.py: 2 warnings
apache_beam/examples/cookbook/bigquery_tornadoes_it_test.py: 1 warning
apache_beam/examples/complete/game/hourly_team_score_it_test.py: 1 warning
apache_beam/examples/complete/game/leader_board_it_test.py: 2 warnings
apache_beam/io/gcp/bigquery_file_loads_test.py: 3 warnings
apache_beam/io/gcp/big_query_query_to_table_it_test.py: 4 warnings
apache_beam/io/gcp/bigquery_write_it_test.py: 4 warnings
apache_beam/io/gcp/bigquery_test.py: 6 warnings
apache_beam/io/gcp/bigquery_json_it_test.py: 2 warnings
  <https://ci-beam.apache.org/job/beam_PostCommit_Python310/ws/src/sdks/python/apache_beam/io/gcp/bigquery.py>:1998: BeamDeprecationWarning: options is deprecated since First stable release. References to <pipeline>.options will not be supported
    experiments = p.options.view_as(DebugOptions).experiments or []

apache_beam/dataframe/io_it_test.py: 2 warnings
apache_beam/io/gcp/bigquery_json_it_test.py: 1 warning
apache_beam/io/gcp/bigquery_read_it_test.py: 9 warnings
  <https://ci-beam.apache.org/job/beam_PostCommit_Python310/ws/src/sdks/python/apache_beam/io/gcp/bigquery.py>:2529: BeamDeprecationWarning: options is deprecated since First stable release. References to <pipeline>.options will not be supported
    project_id = pcoll.pipeline.options.view_as(GoogleCloudOptions).project

apache_beam/dataframe/io_it_test.py: 2 warnings
apache_beam/io/gcp/bigquery_json_it_test.py: 1 warning
apache_beam/io/gcp/bigquery_read_it_test.py: 9 warnings
  <https://ci-beam.apache.org/job/beam_PostCommit_Python310/ws/src/sdks/python/apache_beam/io/gcp/bigquery.py>:2550: BeamDeprecationWarning: options is deprecated since First stable release. References to <pipeline>.options will not be supported
    pipeline_options=pcoll.pipeline.options,

apache_beam/examples/cookbook/bigquery_tornadoes_it_test.py: 1 warning
apache_beam/io/gcp/big_query_query_to_table_it_test.py: 4 warnings
apache_beam/io/gcp/bigquery_write_it_test.py: 4 warnings
apache_beam/io/gcp/bigquery_test.py: 2 warnings
  <https://ci-beam.apache.org/job/beam_PostCommit_Python310/ws/src/sdks/python/apache_beam/io/gcp/bigquery.py>:1988: BeamDeprecationWarning: options is deprecated since First stable release. References to <pipeline>.options will not be supported
    self.table_reference.projectId = pcoll.pipeline.options.view_as(

apache_beam/examples/cookbook/bigquery_tornadoes_it_test.py: 1 warning
apache_beam/io/gcp/bigquery_file_loads_test.py: 3 warnings
apache_beam/io/gcp/big_query_query_to_table_it_test.py: 4 warnings
apache_beam/io/gcp/bigquery_write_it_test.py: 3 warnings
apache_beam/io/gcp/bigquery_test.py: 3 warnings
  <https://ci-beam.apache.org/job/beam_PostCommit_Python310/ws/src/sdks/python/apache_beam/io/gcp/bigquery_file_loads.py>:1166: BeamDeprecationWarning: options is deprecated since First stable release. References to <pipeline>.options will not be supported
    self.project = self.project or p.options.view_as(GoogleCloudOptions).project

apache_beam/examples/cookbook/bigquery_tornadoes_it_test.py: 1 warning
apache_beam/examples/complete/game/hourly_team_score_it_test.py: 1 warning
apache_beam/io/gcp/bigquery_file_loads_test.py: 3 warnings
apache_beam/io/gcp/big_query_query_to_table_it_test.py: 4 warnings
apache_beam/io/gcp/bigquery_write_it_test.py: 3 warnings
apache_beam/io/gcp/bigquery_test.py: 3 warnings
  <https://ci-beam.apache.org/job/beam_PostCommit_Python310/ws/src/sdks/python/apache_beam/io/gcp/bigquery_file_loads.py>:1173: BeamDeprecationWarning: options is deprecated since First stable release. References to <pipeline>.options will not be supported
    temp_location = p.options.view_as(GoogleCloudOptions).temp_location

apache_beam/examples/cookbook/bigquery_tornadoes_it_test.py: 1 warning
apache_beam/examples/complete/game/hourly_team_score_it_test.py: 1 warning
apache_beam/io/gcp/bigquery_file_loads_test.py: 3 warnings
apache_beam/io/gcp/big_query_query_to_table_it_test.py: 4 warnings
apache_beam/io/gcp/bigquery_write_it_test.py: 3 warnings
apache_beam/io/gcp/bigquery_test.py: 3 warnings
  <https://ci-beam.apache.org/job/beam_PostCommit_Python310/ws/src/sdks/python/apache_beam/io/gcp/bigquery_file_loads.py>:1175: BeamDeprecationWarning: options is deprecated since First stable release. References to <pipeline>.options will not be supported
    p.options.view_as(GoogleCloudOptions).job_name or 'AUTOMATIC_JOB_NAME')

apache_beam/examples/cookbook/bigquery_tornadoes_it_test.py::BigqueryTornadoesIT::test_bigquery_tornadoes_it
  <https://ci-beam.apache.org/job/beam_PostCommit_Python310/ws/src/sdks/python/apache_beam/io/gcp/tests/utils.py>:100: PendingDeprecationWarning: Client.dataset is deprecated and will be removed in a future version. Use a string like 'my_project.my_dataset' or a cloud.google.bigquery.DatasetReference object, instead.
    table_ref = client.dataset(dataset_id).table(table_id)

apache_beam/examples/dataframe/flight_delays_it_test.py::FlightDelaysTest::test_flight_delays
  <https://ci-beam.apache.org/job/beam_PostCommit_Python310/ws/src/sdks/python/apache_beam/examples/dataframe/flight_delays.py>:47: FutureWarning: The default value of numeric_only in DataFrame.mean is deprecated. In a future version, it will default to False. In addition, specifying 'numeric_only=None' is deprecated. Select only valid columns or specify the value of numeric_only to silence this warning.
    return airline_df[at_top_airports].mean()

apache_beam/examples/dataframe/flight_delays_it_test.py::FlightDelaysTest::test_flight_delays
apache_beam/examples/dataframe/taxiride_it_test.py::TaxirideIT::test_aggregation
apache_beam/examples/dataframe/taxiride_it_test.py::TaxirideIT::test_enrich
  <https://ci-beam.apache.org/job/beam_PostCommit_Python310/ws/src/sdks/python/apache_beam/dataframe/io.py>:659: FutureWarning: WriteToFiles is experimental.
    return pcoll | fileio.WriteToFiles(

apache_beam/examples/dataframe/flight_delays_it_test.py::FlightDelaysTest::test_flight_delays
apache_beam/examples/dataframe/taxiride_it_test.py::TaxirideIT::test_aggregation
apache_beam/examples/dataframe/taxiride_it_test.py::TaxirideIT::test_enrich
  <https://ci-beam.apache.org/job/beam_PostCommit_Python310/ws/src/sdks/python/apache_beam/io/fileio.py>:593: BeamDeprecationWarning: options is deprecated since First stable release. References to <pipeline>.options will not be supported
    p.options.view_as(GoogleCloudOptions).temp_location or

apache_beam/io/gcp/bigquery_test.py::BigQueryStreamingInsertTransformIntegrationTests::test_multiple_destinations_transform
  <https://ci-beam.apache.org/job/beam_PostCommit_Python310/ws/src/sdks/python/apache_beam/io/gcp/bigquery_test.py>:1690: BeamDeprecationWarning: options is deprecated since First stable release. References to <pipeline>.options will not be supported
    streaming = self.test_pipeline.options.view_as(StandardOptions).streaming

apache_beam/io/gcp/bigquery_read_it_test.py::ReadTests::test_native_source
  <https://ci-beam.apache.org/job/beam_PostCommit_Python310/ws/src/sdks/python/apache_beam/io/gcp/bigquery_read_it_test.py>:170: BeamDeprecationWarning: BigQuerySource is deprecated since 2.25.0. Use ReadFromBigQuery instead.
    beam.io.BigQuerySource(query=self.query, use_standard_sql=True)))

apache_beam/ml/gcp/cloud_dlp_it_test.py::CloudDLPIT::test_deidentification
  <https://ci-beam.apache.org/job/beam_PostCommit_Python310/ws/src/sdks/python/apache_beam/ml/gcp/cloud_dlp_it_test.py>:74: FutureWarning: MaskDetectedDetails is experimental.
    | MaskDetectedDetails(

apache_beam/ml/gcp/cloud_dlp_it_test.py::CloudDLPIT::test_inspection
  <https://ci-beam.apache.org/job/beam_PostCommit_Python310/ws/src/sdks/python/apache_beam/ml/gcp/cloud_dlp_it_test.py>:85: FutureWarning: InspectForDetails is experimental.
    | InspectForDetails(

apache_beam/ml/inference/sklearn_inference_it_test.py::SklearnInference::test_sklearn_regression
  <https://ci-beam.apache.org/job/beam_PostCommit_Python310/ws/src/sdks/python/apache_beam/examples/inference/sklearn_japanese_housing_regression.py>:128: FutureWarning: SklearnModelHandlerPandas is experimental. No backwards-compatibility guarantees.
    model_loader = SklearnModelHandlerPandas(

apache_beam/ml/inference/sklearn_inference_it_test.py::SklearnInference::test_sklearn_regression
  <https://ci-beam.apache.org/job/beam_PostCommit_Python310/ws/src/build/gradleenv/2050596098/lib/python3.10/site-packages/dill/_dill.py>:472: FutureWarning: SklearnModelHandlerPandas is experimental. No backwards-compatibility guarantees.
    obj = StockUnpickler.load(self)

apache_beam/io/gcp/bigquery_read_it_test.py::ReadNewTypesTests::test_native_source
  <https://ci-beam.apache.org/job/beam_PostCommit_Python310/ws/src/sdks/python/apache_beam/io/gcp/bigquery_read_it_test.py>:693: BeamDeprecationWarning: BigQuerySource is deprecated since 2.25.0. Use ReadFromBigQuery instead.
    beam.io.BigQuerySource(query=self.query, use_standard_sql=True)))

apache_beam/io/gcp/bigquery_read_it_test.py::ReadAllBQTests::test_read_queries
  <https://ci-beam.apache.org/job/beam_PostCommit_Python310/ws/src/sdks/python/apache_beam/io/gcp/bigquery_read_it_test.py>:808: FutureWarning: ReadAllFromBigQuery is experimental.
    | beam.io.ReadAllFromBigQuery())

apache_beam/io/gcp/bigquery_read_it_test.py::ReadAllBQTests::test_read_queries
  <https://ci-beam.apache.org/job/beam_PostCommit_Python310/ws/src/sdks/python/apache_beam/io/gcp/bigquery.py>:2658: BeamDeprecationWarning: options is deprecated since First stable release. References to <pipeline>.options will not be supported
    job_name = pcoll.pipeline.options.view_as(GoogleCloudOptions).job_name

apache_beam/io/gcp/bigquery_read_it_test.py::ReadAllBQTests::test_read_queries
  <https://ci-beam.apache.org/job/beam_PostCommit_Python310/ws/src/sdks/python/apache_beam/io/gcp/bigquery.py>:2659: BeamDeprecationWarning: options is deprecated since First stable release. References to <pipeline>.options will not be supported
    project = pcoll.pipeline.options.view_as(GoogleCloudOptions).project

apache_beam/io/gcp/bigquery_read_it_test.py::ReadAllBQTests::test_read_queries
  <https://ci-beam.apache.org/job/beam_PostCommit_Python310/ws/src/sdks/python/apache_beam/io/gcp/bigquery.py>:2672: BeamDeprecationWarning: options is deprecated since First stable release. References to <pipeline>.options will not be supported
    options=pcoll.pipeline.options,

-- Docs: https://docs.pytest.org/en/stable/how-to/capture-warnings.html
- generated xml file: <https://ci-beam.apache.org/job/beam_PostCommit_Python310/ws/src/sdks/python/pytest_postCommitIT-df-py310.xml> -
========== 85 passed, 27 skipped, 616 warnings in 12973.29s (3:36:13) ==========

FAILURE: Build failed with an exception.

* Where:
Script '<https://ci-beam.apache.org/job/beam_PostCommit_Python310/ws/src/sdks/python/test-suites/portable/common.gradle'> line: 326

* What went wrong:
Execution failed for task ':sdks:python:test-suites:portable:py310:postCommitPy310IT'.
> Process 'command 'sh'' finished with non-zero exit value 1

* Try:
> Run with --stacktrace option to get the stack trace.
> Run with --info or --debug option to get more log output.

* Get more help at https://help.gradle.org

Deprecated Gradle features were used in this build, making it incompatible with Gradle 8.0.

You can use '--warning-mode all' to show the individual deprecation warnings and determine if they come from your own scripts or plugins.

See https://docs.gradle.org/7.5.1/userguide/command_line_interface.html#sec:command_line_warnings

Execution optimizations have been disabled for 1 invalid unit(s) of work during this build to ensure correctness.
Please consult deprecation warnings for more details.

BUILD FAILED in 3h 38m 33s
204 actionable tasks: 140 executed, 58 from cache, 6 up-to-date

Publishing build scan...
https://gradle.com/s/qoga3v3ahcqqy

Build step 'Invoke Gradle script' changed build result to FAILURE
Build step 'Invoke Gradle script' marked build as failure

---------------------------------------------------------------------
To unsubscribe, e-mail: builds-unsubscribe@beam.apache.org
For additional commands, e-mail: builds-help@beam.apache.org


Build failed in Jenkins: beam_PostCommit_Python310 #503

Posted by Apache Jenkins Server <je...@builds.apache.org>.
See <https://ci-beam.apache.org/job/beam_PostCommit_Python310/503/display/redirect>

Changes:


------------------------------------------
[...truncated 10.60 MB...]
INFO:root:Default Python SDK image for environment is apache/beam_python3.10_sdk:2.46.0.dev
INFO:apache_beam.utils.subprocess_server:23/02/21 15:18:54 INFO org.apache.beam.runners.fnexecution.control.FnApiControlClientPoolService: getProcessBundleDescriptor request with id 1-12
INFO:root:Default Python SDK image for environment is apache/beam_python3.10_sdk:2.46.0.dev
INFO:apache_beam.utils.subprocess_server:23/02/21 15:18:54 INFO org.apache.beam.runners.fnexecution.control.FnApiControlClientPoolService: getProcessBundleDescriptor request with id 1-13
INFO:root:Default Python SDK image for environment is apache/beam_python3.10_sdk:2.46.0.dev
INFO:apache_beam.utils.subprocess_server:23/02/21 15:18:54 WARN software.amazon.awssdk.regions.internal.util.EC2MetadataUtils: Unable to retrieve the requested metadata.
INFO:apache_beam.utils.subprocess_server:23/02/21 15:18:54 WARN software.amazon.awssdk.regions.internal.util.EC2MetadataUtils: Unable to retrieve the requested metadata.
INFO:apache_beam.utils.subprocess_server:23/02/21 15:18:54 WARN software.amazon.awssdk.regions.internal.util.EC2MetadataUtils: Unable to retrieve the requested metadata.
INFO:apache_beam.utils.subprocess_server:23/02/21 15:18:54 WARN software.amazon.awssdk.regions.internal.util.EC2MetadataUtils: Unable to retrieve the requested metadata.
INFO:apache_beam.utils.subprocess_server:23/02/21 15:18:54 INFO org.apache.beam.runners.fnexecution.control.FnApiControlClientPoolService: getProcessBundleDescriptor request with id 1-14
INFO:root:Default Python SDK image for environment is apache/beam_python3.10_sdk:2.46.0.dev
INFO:apache_beam.utils.subprocess_server:23/02/21 15:18:54 WARN software.amazon.awssdk.regions.internal.util.EC2MetadataUtils: Unable to retrieve the requested metadata.
INFO:apache_beam.utils.subprocess_server:23/02/21 15:18:54 WARN software.amazon.awssdk.regions.internal.util.EC2MetadataUtils: Unable to retrieve the requested metadata.
INFO:apache_beam.utils.subprocess_server:23/02/21 15:18:54 WARN software.amazon.awssdk.regions.internal.util.EC2MetadataUtils: Unable to retrieve the requested metadata.
INFO:apache_beam.utils.subprocess_server:23/02/21 15:18:54 WARN software.amazon.awssdk.regions.internal.util.EC2MetadataUtils: Unable to retrieve the requested metadata.
INFO:apache_beam.utils.subprocess_server:23/02/21 15:18:54 INFO org.apache.beam.runners.fnexecution.control.FnApiControlClientPoolService: getProcessBundleDescriptor request with id 1-15
INFO:root:Default Python SDK image for environment is apache/beam_python3.10_sdk:2.46.0.dev
INFO:apache_beam.utils.subprocess_server:23/02/21 15:18:54 INFO org.apache.beam.runners.spark.SparkPipelineRunner: Job BeamApp-jenkins-0221151849-566a415e_92f4f511-c5c7-447e-8279-fe278bf8916d: Pipeline translated successfully. Computing outputs
INFO:apache_beam.utils.subprocess_server:23/02/21 15:18:54 WARN software.amazon.awssdk.regions.internal.util.EC2MetadataUtils: Unable to retrieve the requested metadata.
INFO:apache_beam.utils.subprocess_server:23/02/21 15:18:54 WARN software.amazon.awssdk.regions.internal.util.EC2MetadataUtils: Unable to retrieve the requested metadata.
INFO:apache_beam.utils.subprocess_server:23/02/21 15:18:54 WARN software.amazon.awssdk.regions.internal.util.EC2MetadataUtils: Unable to retrieve the requested metadata.
INFO:apache_beam.utils.subprocess_server:23/02/21 15:18:54 WARN software.amazon.awssdk.regions.internal.util.EC2MetadataUtils: Unable to retrieve the requested metadata.
INFO:apache_beam.utils.subprocess_server:23/02/21 15:18:54 INFO org.apache.beam.runners.fnexecution.control.FnApiControlClientPoolService: getProcessBundleDescriptor request with id 1-16
INFO:root:Default Python SDK image for environment is apache/beam_python3.10_sdk:2.46.0.dev
INFO:apache_beam.io.filebasedsink:Starting finalize_write threads with num_shards: 4 (skipped: 0), batches: 4, num_threads: 4
INFO:apache_beam.io.filebasedsink:Renamed 4 shards in 0.01 seconds.
INFO:apache_beam.utils.subprocess_server:23/02/21 15:18:54 INFO org.apache.beam.runners.spark.SparkPipelineRunner: Job BeamApp-jenkins-0221151849-566a415e_92f4f511-c5c7-447e-8279-fe278bf8916d finished.
INFO:apache_beam.utils.subprocess_server:23/02/21 15:18:54 INFO org.sparkproject.jetty.server.AbstractConnector: Stopped Spark@e350206{HTTP/1.1, (http/1.1)}{127.0.0.1:4040}
INFO:apache_beam.runners.portability.portable_runner:Job state changed to DONE
Exception in thread read_state:
Traceback (most recent call last):
  File "/usr/lib/python3.10/threading.py", line 1009, in _bootstrap_inner
Exception in thread run_worker_1-1:
Traceback (most recent call last):
  File "/usr/lib/python3.10/threading.py", line 1009, in _bootstrap_inner
    self.run()
  File "/usr/lib/python3.10/threading.py", line 946, in run
    self._target(*self._args, **self._kwargs)
  File "/home/jenkins/jenkins-slave/workspace/beam_PostCommit_Python310/src/sdks/python/apache_beam/runners/worker/sdk_worker.py", line 1034, in pull_responses
ERROR:apache_beam.runners.worker.data_plane:Failed to read inputs in the data plane.
Traceback (most recent call last):
  File "/home/jenkins/jenkins-slave/workspace/beam_PostCommit_Python310/src/sdks/python/apache_beam/runners/worker/data_plane.py", line 654, in _read_inputs
    for elements in elements_iterator:
  File "/home/jenkins/jenkins-slave/workspace/beam_PostCommit_Python310/src/build/gradleenv/-1720702907/lib/python3.10/site-packages/grpc/_channel.py", line 426, in __next__
    return self._next()
  File "/home/jenkins/jenkins-slave/workspace/beam_PostCommit_Python310/src/build/gradleenv/-1720702907/lib/python3.10/site-packages/grpc/_channel.py", line 826, in _next
    raise self
grpc._channel._MultiThreadedRendezvous: <_MultiThreadedRendezvous of RPC that terminated with:
	status = StatusCode.UNAVAILABLE
	details = "recvmsg:Connection reset by peer"
	debug_error_string = "UNKNOWN:Error received from peer ipv6:%5B::1%5D:38049 {grpc_message:"recvmsg:Connection reset by peer", grpc_status:14, created_time:"2023-02-21T15:18:55.442537775+00:00"}"
>
Exception in thread read_grpc_client_inputs:
Traceback (most recent call last):
  File "/usr/lib/python3.10/threading.py", line 1009, in _bootstrap_inner
    for response in responses:
  File "/home/jenkins/jenkins-slave/workspace/beam_PostCommit_Python310/src/build/gradleenv/-1720702907/lib/python3.10/site-packages/grpc/_channel.py", line 426, in __next__
    self.run()
    self.run()
  File "/usr/lib/python3.10/threading.py", line 946, in run
  File "/usr/lib/python3.10/threading.py", line 946, in run
    return self._next()
  File "/home/jenkins/jenkins-slave/workspace/beam_PostCommit_Python310/src/build/gradleenv/-1720702907/lib/python3.10/site-packages/grpc/_channel.py", line 826, in _next
    self._target(*self._args, **self._kwargs)
    raise self
  File "/home/jenkins/jenkins-slave/workspace/beam_PostCommit_Python310/src/sdks/python/apache_beam/runners/worker/data_plane.py", line 671, in <lambda>
    self._target(*self._args, **self._kwargs)
  File "/home/jenkins/jenkins-slave/workspace/beam_PostCommit_Python310/src/sdks/python/apache_beam/runners/worker/sdk_worker.py", line 259, in run
    target=lambda: self._read_inputs(elements_iterator),
  File "/home/jenkins/jenkins-slave/workspace/beam_PostCommit_Python310/src/sdks/python/apache_beam/runners/worker/data_plane.py", line 654, in _read_inputs
grpc._channel._MultiThreadedRendezvous: <_MultiThreadedRendezvous of RPC that terminated with:
	status = StatusCode.UNAVAILABLE
	details = "recvmsg:Connection reset by peer"
	debug_error_string = "UNKNOWN:Error received from peer ipv6:%5B::1%5D:41421 {created_time:"2023-02-21T15:18:55.442666111+00:00", grpc_status:14, grpc_message:"recvmsg:Connection reset by peer"}"
>    for elements in elements_iterator:
  File "/home/jenkins/jenkins-slave/workspace/beam_PostCommit_Python310/src/build/gradleenv/-1720702907/lib/python3.10/site-packages/grpc/_channel.py", line 426, in __next__
    for work_request in self._control_stub.Control(get_responses()):

  File "/home/jenkins/jenkins-slave/workspace/beam_PostCommit_Python310/src/build/gradleenv/-1720702907/lib/python3.10/site-packages/grpc/_channel.py", line 426, in __next__
    return self._next()
    return self._next()
  File "/home/jenkins/jenkins-slave/workspace/beam_PostCommit_Python310/src/build/gradleenv/-1720702907/lib/python3.10/site-packages/grpc/_channel.py", line 826, in _next
  File "/home/jenkins/jenkins-slave/workspace/beam_PostCommit_Python310/src/build/gradleenv/-1720702907/lib/python3.10/site-packages/grpc/_channel.py", line 826, in _next
    raise self
grpc._channel._MultiThreadedRendezvous: <_MultiThreadedRendezvous of RPC that terminated with:
	status = StatusCode.UNAVAILABLE
	details = "recvmsg:Connection reset by peer"
	debug_error_string = "UNKNOWN:Error received from peer ipv6:%5B::1%5D:38049 {grpc_message:"recvmsg:Connection reset by peer", grpc_status:14, created_time:"2023-02-21T15:18:55.442537775+00:00"}"
>
    raise self
grpc._channel._MultiThreadedRendezvous: <_MultiThreadedRendezvous of RPC that terminated with:
	status = StatusCode.UNAVAILABLE
	details = "Socket closed"
	debug_error_string = "UNKNOWN:Error received from peer ipv6:%5B::1%5D:32997 {grpc_message:"Socket closed", grpc_status:14, created_time:"2023-02-21T15:18:55.442657599+00:00"}"
>

> Task :sdks:python:test-suites:portable:py310:postCommitPy310

> Task :sdks:python:test-suites:dataflow:py310:postCommitIT
warning: sdist: standard file not found: should have one of README, README.rst, README.txt, README.md

warning: check: missing required meta-data: url

warning: check: missing meta-data: either (author and author_email) or (maintainer and maintainer_email) should be supplied


[gw4] PASSED apache_beam/examples/complete/game/game_stats_it_test.py::GameStatsIT::test_game_stats_it 
apache_beam/examples/cookbook/bigtableio_it_test.py::BigtableIOWriteTest::test_bigtable_write 
[gw5] PASSED apache_beam/examples/wordcount_it_test.py::WordCountIT::test_wordcount_impersonation_it 
apache_beam/examples/wordcount_it_test.py::WordCountIT::test_wordcount_it 
[gw0] PASSED apache_beam/dataframe/io_it_test.py::ReadUsingReadGbqTests::test_ReadGbq_direct_read 
apache_beam/dataframe/io_it_test.py::ReadUsingReadGbqTests::test_ReadGbq_direct_read_with_project 
[gw7] PASSED apache_beam/examples/cookbook/bigquery_tornadoes_it_test.py::BigqueryTornadoesIT::test_bigquery_tornadoes_it 
apache_beam/examples/dataframe/taxiride_it_test.py::TaxirideIT::test_aggregation 
[gw2] PASSED apache_beam/examples/fastavro_it_test.py::FastavroIT::test_avro_it 
apache_beam/examples/complete/game/leader_board_it_test.py::LeaderBoardIT::test_leader_board_it 
[gw1] PASSED apache_beam/examples/complete/game/user_score_it_test.py::UserScoreIT::test_user_score_it 
apache_beam/examples/dataframe/flight_delays_it_test.py::FlightDelaysTest::test_flight_delays 
[gw6] PASSED apache_beam/examples/complete/game/hourly_team_score_it_test.py::HourlyTeamScoreIT::test_hourly_team_score_it 
apache_beam/examples/cookbook/datastore_wordcount_it_test.py::DatastoreWordCountIT::test_datastore_wordcount_it 
[gw3] PASSED apache_beam/examples/complete/juliaset/juliaset/juliaset_test_it.py::JuliaSetTestIT::test_run_example_with_setup_file 
apache_beam/io/fileio_test.py::MatchIntegrationTest::test_transform_on_gcs 
[gw4] PASSED apache_beam/examples/cookbook/bigtableio_it_test.py::BigtableIOWriteTest::test_bigtable_write 
apache_beam/io/parquetio_it_test.py::TestParquetIT::test_parquetio_it 
[gw5] PASSED apache_beam/examples/wordcount_it_test.py::WordCountIT::test_wordcount_it 
apache_beam/examples/inference/tfx_bsl/tfx_bsl_inference_it_test.py::TFXRunInferenceTests::test_tfx_run_inference_mobilenetv2 
[gw5] SKIPPED apache_beam/examples/inference/tfx_bsl/tfx_bsl_inference_it_test.py::TFXRunInferenceTests::test_tfx_run_inference_mobilenetv2 
apache_beam/io/gcp/big_query_query_to_table_it_test.py::BigQueryQueryToTableIT::test_big_query_legacy_sql 
[gw0] PASSED apache_beam/dataframe/io_it_test.py::ReadUsingReadGbqTests::test_ReadGbq_direct_read_with_project 
apache_beam/dataframe/io_it_test.py::ReadUsingReadGbqTests::test_ReadGbq_export_with_project 
[gw7] PASSED apache_beam/examples/dataframe/taxiride_it_test.py::TaxirideIT::test_aggregation 
apache_beam/examples/dataframe/taxiride_it_test.py::TaxirideIT::test_enrich 
[gw3] PASSED apache_beam/io/fileio_test.py::MatchIntegrationTest::test_transform_on_gcs 
apache_beam/io/gcp/bigquery_test.py::BigQueryStreamingInsertTransformIntegrationTests::test_multiple_destinations_transform 
[gw6] PASSED apache_beam/examples/cookbook/datastore_wordcount_it_test.py::DatastoreWordCountIT::test_datastore_wordcount_it 
apache_beam/io/gcp/bigquery_read_it_test.py::ReadTests::test_iobase_source 
[gw2] PASSED apache_beam/examples/complete/game/leader_board_it_test.py::LeaderBoardIT::test_leader_board_it 
apache_beam/io/gcp/bigquery_io_read_it_test.py::BigqueryIOReadIT::test_bigquery_read_1M_python 
[gw1] PASSED apache_beam/examples/dataframe/flight_delays_it_test.py::FlightDelaysTest::test_flight_delays 
apache_beam/io/gcp/bigquery_json_it_test.py::BigQueryJsonIT::test_direct_read 
[gw4] PASSED apache_beam/io/parquetio_it_test.py::TestParquetIT::test_parquetio_it 
apache_beam/io/gcp/bigquery_write_it_test.py::BigQueryWriteIntegrationTests::test_big_query_write 
[gw5] PASSED apache_beam/io/gcp/big_query_query_to_table_it_test.py::BigQueryQueryToTableIT::test_big_query_legacy_sql 
apache_beam/io/gcp/big_query_query_to_table_it_test.py::BigQueryQueryToTableIT::test_big_query_new_types 
[gw0] PASSED apache_beam/dataframe/io_it_test.py::ReadUsingReadGbqTests::test_ReadGbq_export_with_project 
apache_beam/dataframe/io_it_test.py::ReadUsingReadGbqTests::test_ReadGbq_with_computation 
[gw3] PASSED apache_beam/io/gcp/bigquery_test.py::BigQueryStreamingInsertTransformIntegrationTests::test_multiple_destinations_transform 
apache_beam/io/gcp/bigquery_test.py::BigQueryStreamingInsertTransformIntegrationTests::test_value_provider_transform 
[gw6] PASSED apache_beam/io/gcp/bigquery_read_it_test.py::ReadTests::test_iobase_source 
apache_beam/io/gcp/bigquery_read_it_test.py::ReadTests::test_native_source 
[gw2] PASSED apache_beam/io/gcp/bigquery_io_read_it_test.py::BigqueryIOReadIT::test_bigquery_read_1M_python 
apache_beam/io/gcp/bigquery_io_read_it_test.py::BigqueryIOReadIT::test_bigquery_read_custom_1M_python 
[gw1] PASSED apache_beam/io/gcp/bigquery_json_it_test.py::BigQueryJsonIT::test_direct_read 
apache_beam/io/gcp/bigquery_json_it_test.py::BigQueryJsonIT::test_export_read 
[gw4] PASSED apache_beam/io/gcp/bigquery_write_it_test.py::BigQueryWriteIntegrationTests::test_big_query_write 
apache_beam/io/gcp/bigquery_write_it_test.py::BigQueryWriteIntegrationTests::test_big_query_write_insert_errors_reporting 
[gw0] PASSED apache_beam/dataframe/io_it_test.py::ReadUsingReadGbqTests::test_ReadGbq_with_computation 
apache_beam/io/gcp/dicomio_integration_test.py::DICOMIoIntegrationTest::test_dicom_search_instances 
[gw5] PASSED apache_beam/io/gcp/big_query_query_to_table_it_test.py::BigQueryQueryToTableIT::test_big_query_new_types 
apache_beam/io/gcp/big_query_query_to_table_it_test.py::BigQueryQueryToTableIT::test_big_query_new_types_avro 
[gw1] PASSED apache_beam/io/gcp/bigquery_json_it_test.py::BigQueryJsonIT::test_export_read 
apache_beam/io/gcp/bigquery_json_it_test.py::BigQueryJsonIT::test_file_loads_write 
[gw1] PASSED apache_beam/io/gcp/bigquery_json_it_test.py::BigQueryJsonIT::test_file_loads_write 
apache_beam/io/gcp/bigquery_json_it_test.py::BigQueryJsonIT::test_query_read 
[gw2] PASSED apache_beam/io/gcp/bigquery_io_read_it_test.py::BigqueryIOReadIT::test_bigquery_read_custom_1M_python 
apache_beam/io/gcp/gcsio_integration_test.py::GcsIOIntegrationTest::test_copy 
[gw2] PASSED apache_beam/io/gcp/gcsio_integration_test.py::GcsIOIntegrationTest::test_copy 
apache_beam/io/gcp/gcsio_integration_test.py::GcsIOIntegrationTest::test_copy_batch 
[gw2] PASSED apache_beam/io/gcp/gcsio_integration_test.py::GcsIOIntegrationTest::test_copy_batch 
apache_beam/io/gcp/gcsio_integration_test.py::GcsIOIntegrationTest::test_copy_batch_kms 
[gw2] PASSED apache_beam/io/gcp/gcsio_integration_test.py::GcsIOIntegrationTest::test_copy_batch_kms 
apache_beam/io/gcp/gcsio_integration_test.py::GcsIOIntegrationTest::test_copy_batch_rewrite_token 
[gw6] PASSED apache_beam/io/gcp/bigquery_read_it_test.py::ReadTests::test_native_source 
apache_beam/io/gcp/bigquery_read_it_test.py::ReadTests::test_table_schema_retrieve 
[gw4] PASSED apache_beam/io/gcp/bigquery_write_it_test.py::BigQueryWriteIntegrationTests::test_big_query_write_insert_errors_reporting 
apache_beam/io/gcp/bigquery_write_it_test.py::BigQueryWriteIntegrationTests::test_big_query_write_new_types 
[gw2] PASSED apache_beam/io/gcp/gcsio_integration_test.py::GcsIOIntegrationTest::test_copy_batch_rewrite_token 
apache_beam/io/gcp/gcsio_integration_test.py::GcsIOIntegrationTest::test_copy_kms 
[gw2] PASSED apache_beam/io/gcp/gcsio_integration_test.py::GcsIOIntegrationTest::test_copy_kms 
apache_beam/io/gcp/gcsio_integration_test.py::GcsIOIntegrationTest::test_copy_rewrite_token 
[gw3] PASSED apache_beam/io/gcp/bigquery_test.py::BigQueryStreamingInsertTransformIntegrationTests::test_value_provider_transform 
apache_beam/io/gcp/bigquery_test.py::PubSubBigQueryIT::test_file_loads 
[gw2] PASSED apache_beam/io/gcp/gcsio_integration_test.py::GcsIOIntegrationTest::test_copy_rewrite_token 
apache_beam/ml/gcp/naturallanguageml_test_it.py::NaturalLanguageMlTestIT::test_analyzing_syntax 
[gw0] PASSED apache_beam/io/gcp/dicomio_integration_test.py::DICOMIoIntegrationTest::test_dicom_search_instances 
apache_beam/io/gcp/dicomio_integration_test.py::DICOMIoIntegrationTest::test_dicom_store_instance_from_gcs 
[gw5] PASSED apache_beam/io/gcp/big_query_query_to_table_it_test.py::BigQueryQueryToTableIT::test_big_query_new_types_avro 
apache_beam/io/gcp/big_query_query_to_table_it_test.py::BigQueryQueryToTableIT::test_big_query_standard_sql 
[gw4] PASSED apache_beam/io/gcp/bigquery_write_it_test.py::BigQueryWriteIntegrationTests::test_big_query_write_new_types 
apache_beam/io/gcp/bigquery_write_it_test.py::BigQueryWriteIntegrationTests::test_big_query_write_schema_autodetect 
[gw4] SKIPPED apache_beam/io/gcp/bigquery_write_it_test.py::BigQueryWriteIntegrationTests::test_big_query_write_schema_autodetect 
apache_beam/io/gcp/bigquery_write_it_test.py::BigQueryWriteIntegrationTests::test_big_query_write_without_schema 
[gw1] PASSED apache_beam/io/gcp/bigquery_json_it_test.py::BigQueryJsonIT::test_query_read 
apache_beam/io/gcp/bigquery_json_it_test.py::BigQueryJsonIT::test_streaming_inserts 
[gw7] PASSED apache_beam/examples/dataframe/taxiride_it_test.py::TaxirideIT::test_enrich 
apache_beam/io/gcp/bigquery_file_loads_test.py::BigQueryFileLoadsIT::test_bqfl_streaming 
[gw7] SKIPPED apache_beam/io/gcp/bigquery_file_loads_test.py::BigQueryFileLoadsIT::test_bqfl_streaming 
apache_beam/io/gcp/bigquery_file_loads_test.py::BigQueryFileLoadsIT::test_bqfl_streaming_with_copy_jobs 
[gw7] SKIPPED apache_beam/io/gcp/bigquery_file_loads_test.py::BigQueryFileLoadsIT::test_bqfl_streaming_with_copy_jobs 
apache_beam/io/gcp/bigquery_file_loads_test.py::BigQueryFileLoadsIT::test_bqfl_streaming_with_dynamic_destinations 
[gw7] SKIPPED apache_beam/io/gcp/bigquery_file_loads_test.py::BigQueryFileLoadsIT::test_bqfl_streaming_with_dynamic_destinations 
apache_beam/io/gcp/bigquery_file_loads_test.py::BigQueryFileLoadsIT::test_multiple_destinations_transform 
[gw2] PASSED apache_beam/ml/gcp/naturallanguageml_test_it.py::NaturalLanguageMlTestIT::test_analyzing_syntax 
apache_beam/ml/gcp/recommendations_ai_test_it.py::RecommendationAIIT::test_create_catalog_item 
[gw6] PASSED apache_beam/io/gcp/bigquery_read_it_test.py::ReadTests::test_table_schema_retrieve 
apache_beam/io/gcp/bigquery_read_it_test.py::ReadTests::test_table_schema_retrieve_specifying_only_table 
[gw3] PASSED apache_beam/io/gcp/bigquery_test.py::PubSubBigQueryIT::test_file_loads 
apache_beam/io/gcp/bigquery_test.py::PubSubBigQueryIT::test_streaming_inserts 
[gw0] PASSED apache_beam/io/gcp/dicomio_integration_test.py::DICOMIoIntegrationTest::test_dicom_store_instance_from_gcs 
apache_beam/io/gcp/pubsub_integration_test.py::PubSubIntegrationTest::test_streaming_data_only 
[gw4] PASSED apache_beam/io/gcp/bigquery_write_it_test.py::BigQueryWriteIntegrationTests::test_big_query_write_without_schema 
apache_beam/ml/gcp/visionml_test_it.py::VisionMlTestIT::test_text_detection_with_language_hint 
[gw5] PASSED apache_beam/io/gcp/big_query_query_to_table_it_test.py::BigQueryQueryToTableIT::test_big_query_standard_sql 
apache_beam/io/gcp/datastore/v1new/datastore_write_it_test.py::DatastoreWriteIT::test_datastore_write_limit 
[gw7] PASSED apache_beam/io/gcp/bigquery_file_loads_test.py::BigQueryFileLoadsIT::test_multiple_destinations_transform 
apache_beam/io/gcp/bigquery_file_loads_test.py::BigQueryFileLoadsIT::test_one_job_fails_all_jobs_fail 
[gw2] PASSED apache_beam/ml/gcp/recommendations_ai_test_it.py::RecommendationAIIT::test_create_catalog_item 
apache_beam/ml/gcp/recommendations_ai_test_it.py::RecommendationAIIT::test_create_user_event 
[gw6] PASSED apache_beam/io/gcp/bigquery_read_it_test.py::ReadTests::test_table_schema_retrieve_specifying_only_table 
apache_beam/io/gcp/bigquery_read_it_test.py::ReadTests::test_table_schema_retrieve_with_direct_read FATAL: command execution failed
java.io.IOException: Backing channel 'apache-beam-jenkins-14' is disconnected.
	at hudson.remoting.RemoteInvocationHandler.channelOrFail(RemoteInvocationHandler.java:215)
	at hudson.remoting.RemoteInvocationHandler.invoke(RemoteInvocationHandler.java:285)
	at com.sun.proxy.$Proxy143.isAlive(Unknown Source)
	at hudson.Launcher$RemoteLauncher$ProcImpl.isAlive(Launcher.java:1215)
	at hudson.Launcher$RemoteLauncher$ProcImpl.join(Launcher.java:1207)
	at hudson.Launcher$ProcStarter.join(Launcher.java:524)
	at hudson.plugins.gradle.Gradle.perform(Gradle.java:317)
	at hudson.tasks.BuildStepMonitor$1.perform(BuildStepMonitor.java:20)
	at hudson.model.AbstractBuild$AbstractBuildExecution.perform(AbstractBuild.java:814)
	at hudson.model.Build$BuildExecution.build(Build.java:199)
	at hudson.model.Build$BuildExecution.doRun(Build.java:164)
	at hudson.model.AbstractBuild$AbstractBuildExecution.run(AbstractBuild.java:522)
	at hudson.model.Run.execute(Run.java:1896)
	at hudson.model.FreeStyleBuild.run(FreeStyleBuild.java:44)
	at hudson.model.ResourceController.execute(ResourceController.java:101)
	at hudson.model.Executor.run(Executor.java:442)
Caused by: java.io.IOException: Pipe closed after 0 cycles
	at org.apache.sshd.common.channel.ChannelPipedInputStream.read(ChannelPipedInputStream.java:126)
	at org.apache.sshd.common.channel.ChannelPipedInputStream.read(ChannelPipedInputStream.java:105)
	at hudson.remoting.FlightRecorderInputStream.read(FlightRecorderInputStream.java:94)
	at hudson.remoting.ChunkedInputStream.readHeader(ChunkedInputStream.java:75)
	at hudson.remoting.ChunkedInputStream.readUntilBreak(ChunkedInputStream.java:105)
	at hudson.remoting.ChunkedCommandTransport.readBlock(ChunkedCommandTransport.java:39)
	at hudson.remoting.AbstractSynchronousByteArrayCommandTransport.read(AbstractSynchronousByteArrayCommandTransport.java:34)
	at hudson.remoting.SynchronousCommandTransport$ReaderThread.run(SynchronousCommandTransport.java:61)
Build step 'Invoke Gradle script' changed build result to FAILURE
Build step 'Invoke Gradle script' marked build as failure
ERROR: apache-beam-jenkins-14 is offline; cannot locate jdk_1.8_latest

---------------------------------------------------------------------
To unsubscribe, e-mail: builds-unsubscribe@beam.apache.org
For additional commands, e-mail: builds-help@beam.apache.org


Jenkins build is back to normal : beam_PostCommit_Python310 #504

Posted by Apache Jenkins Server <je...@builds.apache.org>.
See <https://ci-beam.apache.org/job/beam_PostCommit_Python310/504/display/redirect?page=changes>


---------------------------------------------------------------------
To unsubscribe, e-mail: builds-unsubscribe@beam.apache.org
For additional commands, e-mail: builds-help@beam.apache.org