You are viewing a plain text version of this content. The canonical link for it is here.
Posted to builds@solr.apache.org by Apache Jenkins Server <je...@builds.apache.org> on 2022/10/09 00:45:21 UTC
[JENKINS] Solr » OWASP-9.x - Build # 83 - Still Failing!
Build: https://ci-builds.apache.org/job/Solr/job/OWASP-9.x/83/
No tests ran.
Build Log:
[...truncated 99 lines...]
BUILD FAILED in 1m 4s
3 actionable tasks: 3 executed
Build step 'Invoke Gradle script' changed build result to FAILURE
Build step 'Invoke Gradle script' marked build as failure
Archiving artifacts
Recording test results
ERROR: Step ‘Publish JUnit test result report’ failed: No test report files were found. Configuration error?
Email was triggered for: Failure - Any
Sending email for trigger: Failure - Any
[JENKINS] Solr » OWASP-9.x - Build # 101 - Still Failing!
Posted by Apache Jenkins Server <je...@builds.apache.org>.
Build: https://ci-builds.apache.org/job/Solr/job/OWASP-9.x/101/
No tests ran.
Build Log:
[...truncated 98 lines...]
BUILD FAILED in 45s
3 actionable tasks: 3 executed
Build step 'Invoke Gradle script' changed build result to FAILURE
Build step 'Invoke Gradle script' marked build as failure
Archiving artifacts
Email was triggered for: Failure - Any
Sending email for trigger: Failure - Any
[JENKINS] Solr » OWASP-9.x - Build # 100 - Still Failing!
Posted by Apache Jenkins Server <je...@builds.apache.org>.
Build: https://ci-builds.apache.org/job/Solr/job/OWASP-9.x/100/
No tests ran.
Build Log:
[...truncated 99 lines...]
BUILD FAILED in 1m 15s
3 actionable tasks: 3 executed
Build step 'Invoke Gradle script' changed build result to FAILURE
Build step 'Invoke Gradle script' marked build as failure
Archiving artifacts
Recording test results
ERROR: Step ‘Publish JUnit test result report’ failed: No test report files were found. Configuration error?
Email was triggered for: Failure - Any
Sending email for trigger: Failure - Any
[JENKINS] Solr » OWASP-9.x - Build # 99 - Still Failing!
Posted by Apache Jenkins Server <je...@builds.apache.org>.
Build: https://ci-builds.apache.org/job/Solr/job/OWASP-9.x/99/
No tests ran.
Build Log:
[...truncated 99 lines...]
BUILD FAILED in 39s
3 actionable tasks: 3 executed
Build step 'Invoke Gradle script' changed build result to FAILURE
Build step 'Invoke Gradle script' marked build as failure
Archiving artifacts
Recording test results
ERROR: Step ‘Publish JUnit test result report’ failed: No test report files were found. Configuration error?
Email was triggered for: Failure - Any
Sending email for trigger: Failure - Any
[JENKINS] Solr » OWASP-9.x - Build # 98 - Still Failing!
Posted by Apache Jenkins Server <je...@builds.apache.org>.
Build: https://ci-builds.apache.org/job/Solr/job/OWASP-9.x/98/
No tests ran.
Build Log:
[...truncated 99 lines...]
BUILD FAILED in 2m 12s
3 actionable tasks: 3 executed
Build step 'Invoke Gradle script' changed build result to FAILURE
Build step 'Invoke Gradle script' marked build as failure
Archiving artifacts
Recording test results
ERROR: Step ‘Publish JUnit test result report’ failed: No test report files were found. Configuration error?
Email was triggered for: Failure - Any
Sending email for trigger: Failure - Any
[JENKINS] Solr » OWASP-9.x - Build # 97 - Still Failing!
Posted by Apache Jenkins Server <je...@builds.apache.org>.
Build: https://ci-builds.apache.org/job/Solr/job/OWASP-9.x/97/
No tests ran.
Build Log:
[...truncated 100 lines...]
BUILD FAILED in 2m 15s
3 actionable tasks: 3 executed
Build step 'Invoke Gradle script' changed build result to FAILURE
Build step 'Invoke Gradle script' marked build as failure
Archiving artifacts
Recording test results
ERROR: Step ‘Publish JUnit test result report’ failed: No test report files were found. Configuration error?
Email was triggered for: Failure - Any
Sending email for trigger: Failure - Any
[JENKINS] Solr » OWASP-9.x - Build # 96 - Still Failing!
Posted by Apache Jenkins Server <je...@builds.apache.org>.
Build: https://ci-builds.apache.org/job/Solr/job/OWASP-9.x/96/
No tests ran.
Build Log:
[...truncated 101 lines...]
BUILD FAILED in 1m 11s
3 actionable tasks: 3 executed
Build step 'Invoke Gradle script' changed build result to FAILURE
Build step 'Invoke Gradle script' marked build as failure
Archiving artifacts
Recording test results
ERROR: Step ‘Publish JUnit test result report’ failed: No test report files were found. Configuration error?
Email was triggered for: Failure - Any
Sending email for trigger: Failure - Any
[JENKINS] Solr » OWASP-9.x - Build # 95 - Still Failing!
Posted by Apache Jenkins Server <je...@builds.apache.org>.
Build: https://ci-builds.apache.org/job/Solr/job/OWASP-9.x/95/
No tests ran.
Build Log:
[...truncated 98 lines...]
BUILD FAILED in 1m
3 actionable tasks: 3 executed
Build step 'Invoke Gradle script' changed build result to FAILURE
Build step 'Invoke Gradle script' marked build as failure
Archiving artifacts
Recording test results
ERROR: Step ‘Publish JUnit test result report’ failed: No test report files were found. Configuration error?
Email was triggered for: Failure - Any
Sending email for trigger: Failure - Any
[JENKINS] Solr » OWASP-9.x - Build # 94 - Still Failing!
Posted by Apache Jenkins Server <je...@builds.apache.org>.
Build: https://ci-builds.apache.org/job/Solr/job/OWASP-9.x/94/
No tests ran.
Build Log:
[...truncated 98 lines...]
BUILD FAILED in 41s
3 actionable tasks: 3 executed
Build step 'Invoke Gradle script' changed build result to FAILURE
Build step 'Invoke Gradle script' marked build as failure
Archiving artifacts
Recording test results
ERROR: Step ‘Publish JUnit test result report’ failed: No test report files were found. Configuration error?
Email was triggered for: Failure - Any
Sending email for trigger: Failure - Any
[JENKINS] Solr » OWASP-9.x - Build # 93 - Still Failing!
Posted by Apache Jenkins Server <je...@builds.apache.org>.
Build: https://ci-builds.apache.org/job/Solr/job/OWASP-9.x/93/
No tests ran.
Build Log:
[...truncated 99 lines...]
BUILD FAILED in 41s
3 actionable tasks: 3 executed
Build step 'Invoke Gradle script' changed build result to FAILURE
Build step 'Invoke Gradle script' marked build as failure
Archiving artifacts
Recording test results
ERROR: Step ‘Publish JUnit test result report’ failed: No test report files were found. Configuration error?
Email was triggered for: Failure - Any
Sending email for trigger: Failure - Any
[JENKINS] Solr » OWASP-9.x - Build # 92 - Still Failing!
Posted by Apache Jenkins Server <je...@builds.apache.org>.
Build: https://ci-builds.apache.org/job/Solr/job/OWASP-9.x/92/
No tests ran.
Build Log:
[...truncated 100 lines...]
BUILD FAILED in 1m 27s
3 actionable tasks: 3 executed
Build step 'Invoke Gradle script' changed build result to FAILURE
Build step 'Invoke Gradle script' marked build as failure
Archiving artifacts
Recording test results
ERROR: Step ‘Publish JUnit test result report’ failed: No test report files were found. Configuration error?
Email was triggered for: Failure - Any
Sending email for trigger: Failure - Any
[JENKINS] Solr » OWASP-9.x - Build # 91 - Still Failing!
Posted by Apache Jenkins Server <je...@builds.apache.org>.
Build: https://ci-builds.apache.org/job/Solr/job/OWASP-9.x/91/
No tests ran.
Build Log:
[...truncated 99 lines...]
BUILD FAILED in 1m 16s
3 actionable tasks: 3 executed
Build step 'Invoke Gradle script' changed build result to FAILURE
Build step 'Invoke Gradle script' marked build as failure
Archiving artifacts
Recording test results
ERROR: Step ‘Publish JUnit test result report’ failed: No test report files were found. Configuration error?
Email was triggered for: Failure - Any
Sending email for trigger: Failure - Any
[JENKINS] Solr » OWASP-9.x - Build # 90 - Still Failing!
Posted by Apache Jenkins Server <je...@builds.apache.org>.
Build: https://ci-builds.apache.org/job/Solr/job/OWASP-9.x/90/
No tests ran.
Build Log:
[...truncated 99 lines...]
BUILD FAILED in 1m 19s
3 actionable tasks: 3 executed
Build step 'Invoke Gradle script' changed build result to FAILURE
Build step 'Invoke Gradle script' marked build as failure
Archiving artifacts
Recording test results
ERROR: Step ‘Publish JUnit test result report’ failed: No test report files were found. Configuration error?
Email was triggered for: Failure - Any
Sending email for trigger: Failure - Any
[JENKINS] Solr » OWASP-9.x - Build # 89 - Still Failing!
Posted by Apache Jenkins Server <je...@builds.apache.org>.
Build: https://ci-builds.apache.org/job/Solr/job/OWASP-9.x/89/
No tests ran.
Build Log:
[...truncated 98 lines...]
BUILD FAILED in 41s
3 actionable tasks: 3 executed
Build step 'Invoke Gradle script' changed build result to FAILURE
Build step 'Invoke Gradle script' marked build as failure
Archiving artifacts
Recording test results
ERROR: Step ‘Publish JUnit test result report’ failed: No test report files were found. Configuration error?
Email was triggered for: Failure - Any
Sending email for trigger: Failure - Any
[JENKINS] Solr » OWASP-9.x - Build # 88 - Still Failing!
Posted by Apache Jenkins Server <je...@builds.apache.org>.
Build: https://ci-builds.apache.org/job/Solr/job/OWASP-9.x/88/
No tests ran.
Build Log:
[...truncated 99 lines...]
BUILD FAILED in 1m 44s
3 actionable tasks: 3 executed
Build step 'Invoke Gradle script' changed build result to FAILURE
Build step 'Invoke Gradle script' marked build as failure
Archiving artifacts
Recording test results
ERROR: Step ‘Publish JUnit test result report’ failed: No test report files were found. Configuration error?
Email was triggered for: Failure - Any
Sending email for trigger: Failure - Any
[JENKINS] Solr » OWASP-9.x - Build # 87 - Still Failing!
Posted by Apache Jenkins Server <je...@builds.apache.org>.
Build: https://ci-builds.apache.org/job/Solr/job/OWASP-9.x/87/
No tests ran.
Build Log:
[...truncated 99 lines...]
BUILD FAILED in 41s
3 actionable tasks: 3 executed
Build step 'Invoke Gradle script' changed build result to FAILURE
Build step 'Invoke Gradle script' marked build as failure
Archiving artifacts
Recording test results
ERROR: Step ‘Publish JUnit test result report’ failed: No test report files were found. Configuration error?
Email was triggered for: Failure - Any
Sending email for trigger: Failure - Any
[JENKINS] Solr » OWASP-9.x - Build # 86 - Still Failing!
Posted by Apache Jenkins Server <je...@builds.apache.org>.
Build: https://ci-builds.apache.org/job/Solr/job/OWASP-9.x/86/
No tests ran.
Build Log:
[...truncated 98 lines...]
BUILD FAILED in 1m 40s
3 actionable tasks: 3 executed
Build step 'Invoke Gradle script' changed build result to FAILURE
Build step 'Invoke Gradle script' marked build as failure
Archiving artifacts
Recording test results
ERROR: Step ‘Publish JUnit test result report’ failed: No test report files were found. Configuration error?
Email was triggered for: Failure - Any
Sending email for trigger: Failure - Any
[JENKINS] Solr » OWASP-9.x - Build # 85 - Still Failing!
Posted by Apache Jenkins Server <je...@builds.apache.org>.
Build: https://ci-builds.apache.org/job/Solr/job/OWASP-9.x/85/
No tests ran.
Build Log:
[...truncated 100 lines...]
BUILD FAILED in 51s
3 actionable tasks: 3 executed
Build step 'Invoke Gradle script' changed build result to FAILURE
Build step 'Invoke Gradle script' marked build as failure
Archiving artifacts
Recording test results
ERROR: Step ‘Publish JUnit test result report’ failed: No test report files were found. Configuration error?
Email was triggered for: Failure - Any
Sending email for trigger: Failure - Any
[JENKINS] Solr » OWASP-9.x - Build # 84 - Still Failing!
Posted by Apache Jenkins Server <je...@builds.apache.org>.
Build: https://ci-builds.apache.org/job/Solr/job/OWASP-9.x/84/
No tests ran.
Build Log:
[...truncated 100 lines...]
BUILD FAILED in 1m 38s
3 actionable tasks: 3 executed
Build step 'Invoke Gradle script' changed build result to FAILURE
Build step 'Invoke Gradle script' marked build as failure
Archiving artifacts
Recording test results
ERROR: Step ‘Publish JUnit test result report’ failed: No test report files were found. Configuration error?
Email was triggered for: Failure - Any
Sending email for trigger: Failure - Any