You are viewing a plain text version of this content. The canonical link for it is here.
Posted to commits@tomee.apache.org by Apache Jenkins Server <je...@builds.apache.org> on 2026/10/14 07:06:15 UTC

Build failed in Jenkins: TomEE » master-build-full #2317

See <https://ci-builds.apache.org/job/Tomee/job/master-build-full/2317/display/redirect>

Changes:


------------------------------------------
Started by user Richard Zowalla
Running as SYSTEM
[EnvInject] - Loading node environment variables.
Building remotely on builds37 (ubuntu) in workspace <https://ci-builds.apache.org/job/Tomee/job/master-build-full/ws/>
The recommended git tool is: NONE
No credentials specified
 > git rev-parse --resolve-git-dir <https://ci-builds.apache.org/job/Tomee/job/master-build-full/ws/.git> # timeout=10
Fetching changes from the remote Git repository
 > git config remote.origin.url https://github.com/apache/tomee # timeout=10
Cleaning workspace
 > git rev-parse --verify HEAD # timeout=10
Resetting working tree
 > git reset --hard # timeout=10
 > git clean -fdx # timeout=10
Fetching upstream changes from https://github.com/apache/tomee
 > git --version # timeout=10
 > git --version # 'git version 2.34.1'
 > git fetch --tags --force --progress -- https://github.com/apache/tomee +refs/heads/*:refs/remotes/origin/* # timeout=10
 > git rev-parse refs/remotes/origin/main^{commit} # timeout=10
Checking out Revision 1d72919b50ebd447fe839d9b9dfa36add82e206e (refs/remotes/origin/main)
 > git config core.sparsecheckout # timeout=10
 > git checkout -f 1d72919b50ebd447fe839d9b9dfa36add82e206e # timeout=10
Commit message: "make the scan exclusion and async MP-JWT tests independent of their environment (#3088)"
 > git rev-list --no-walk 1d72919b50ebd447fe839d9b9dfa36add82e206e # timeout=10
Parsing POMs
ERROR: Failed to parse POMs
hudson.remoting.ProxyException: hudson.maven.MavenModuleSetBuild$MavenExecutionException: org.apache.maven.project.ProjectBuildingException: Some problems were encountered while processing the POMs:
[FATAL] Non-readable POM /home/jenkins/.m2/repository/org/apache/maven/maven-parent/43/maven-parent-43.pom: input contained no data @ /home/jenkins/.m2/repository/org/apache/maven/maven-parent/43/maven-parent-43.pom
[ERROR] 'dependencies.dependency.version' for org.jboss.shrinkwrap.resolver:shrinkwrap-resolver-depchain:pom is missing. @ line 98, column 17
[FATAL] Non-readable POM /home/jenkins/.m2/repository/org/apache/maven/maven-parent/43/maven-parent-43.pom: input contained no data @ /home/jenkins/.m2/repository/org/apache/maven/maven-parent/43/maven-parent-43.pom
[ERROR] 'dependencies.dependency.version' for org.jboss.shrinkwrap.resolver:shrinkwrap-resolver-depchain:pom is missing. @ line 121, column 17
[FATAL] Non-readable POM /home/jenkins/.m2/repository/org/apache/maven/maven-parent/43/maven-parent-43.pom: input contained no data @ /home/jenkins/.m2/repository/org/apache/maven/maven-parent/43/maven-parent-43.pom
[ERROR] 'dependencies.dependency.version' for org.jboss.shrinkwrap.resolver:shrinkwrap-resolver-depchain:pom is missing. @ line 146, column 17
[FATAL] Non-readable POM /home/jenkins/.m2/repository/org/apache/maven/maven-parent/43/maven-parent-43.pom: input contained no data @ /home/jenkins/.m2/repository/org/apache/maven/maven-parent/43/maven-parent-43.pom
[ERROR] 'dependencies.dependency.version' for org.jboss.shrinkwrap.resolver:shrinkwrap-resolver-depchain:pom is missing. @ line 111, column 21
[FATAL] Non-readable POM /home/jenkins/.m2/repository/org/apache/maven/maven-parent/43/maven-parent-43.pom: input contained no data @ /home/jenkins/.m2/repository/org/apache/maven/maven-parent/43/maven-parent-43.pom
[ERROR] 'dependencies.dependency.version' for org.jboss.shrinkwrap.resolver:shrinkwrap-resolver-depchain:pom is missing. @ line 129, column 17
[FATAL] Non-readable POM /home/jenkins/.m2/repository/org/apache/maven/maven-parent/43/maven-parent-43.pom: input contained no data @ /home/jenkins/.m2/repository/org/apache/maven/maven-parent/43/maven-parent-43.pom
[ERROR] 'dependencies.dependency.version' for org.jboss.shrinkwrap.resolver:shrinkwrap-resolver-depchain:pom is missing. @ line 129, column 17
[FATAL] Non-readable POM /home/jenkins/.m2/repository/org/apache/maven/maven-parent/43/maven-parent-43.pom: input contained no data @ /home/jenkins/.m2/repository/org/apache/maven/maven-parent/43/maven-parent-43.pom
[ERROR] 'dependencies.dependency.version' for org.jboss.shrinkwrap.resolver:shrinkwrap-resolver-depchain:pom is missing. @ line 125, column 17
[FATAL] Non-readable POM /home/jenkins/.m2/repository/org/apache/maven/maven-parent/43/maven-parent-43.pom: input contained no data @ /home/jenkins/.m2/repository/org/apache/maven/maven-parent/43/maven-parent-43.pom
[ERROR] 'dependencies.dependency.version' for org.jboss.shrinkwrap.resolver:shrinkwrap-resolver-depchain:pom is missing. @ line 154, column 17
[FATAL] Non-readable POM /home/jenkins/.m2/repository/org/apache/maven/maven-parent/43/maven-parent-43.pom: input contained no data @ /home/jenkins/.m2/repository/org/apache/maven/maven-parent/43/maven-parent-43.pom
[ERROR] 'dependencies.dependency.version' for org.jboss.shrinkwrap.resolver:shrinkwrap-resolver-depchain:pom is missing. @ line 112, column 17
[WARNING] 'build.plugins.plugin.version' for org.codehaus.mojo:build-helper-maven-plugin is missing. @ line 42, column 15
[WARNING] 'build.plugins.plugin.version' for org.codehaus.mojo:build-helper-maven-plugin is missing. @ line 45, column 15
[FATAL] Non-readable POM /home/jenkins/.m2/repository/org/apache/maven/maven-parent/43/maven-parent-43.pom: input contained no data @ /home/jenkins/.m2/repository/org/apache/maven/maven-parent/43/maven-parent-43.pom
[ERROR] 'dependencies.dependency.version' for org.jboss.shrinkwrap.resolver:shrinkwrap-resolver-depchain:pom is missing. @ line 77, column 17
[FATAL] Non-readable POM /home/jenkins/.m2/repository/org/apache/maven/maven-parent/43/maven-parent-43.pom: input contained no data @ /home/jenkins/.m2/repository/org/apache/maven/maven-parent/43/maven-parent-43.pom
[ERROR] 'dependencies.dependency.version' for org.jboss.shrinkwrap.resolver:shrinkwrap-resolver-depchain:pom is missing. @ line 186, column 17
[FATAL] Non-readable POM /home/jenkins/.m2/repository/org/apache/maven/maven-parent/43/maven-parent-43.pom: input contained no data @ /home/jenkins/.m2/repository/org/apache/maven/maven-parent/43/maven-parent-43.pom
[ERROR] 'dependencies.dependency.version' for org.jboss.shrinkwrap.resolver:shrinkwrap-resolver-depchain:pom is missing. @ line 169, column 17
[FATAL] Non-readable POM /home/jenkins/.m2/repository/org/apache/maven/maven-parent/43/maven-parent-43.pom: input contained no data @ /home/jenkins/.m2/repository/org/apache/maven/maven-parent/43/maven-parent-43.pom
[ERROR] 'dependencies.dependency.version' for org.jboss.shrinkwrap.resolver:shrinkwrap-resolver-depchain:pom is missing. @ line 124, column 17
[WARNING] 'dependencies.dependency.scope' for org.junit:junit-bom:pom must be one of [provided, compile, runtime, test, system] but is 'import'. @ line 43, column 20
[WARNING] 'dependencies.dependency.scope' for org.junit:junit-bom:pom must be one of [provided, compile, runtime, test, system] but is 'import'. @ line 44, column 20

	at PluginClassLoader for maven-plugin//hudson.maven.MavenModuleSetBuild$PomParser.invoke(MavenModuleSetBuild.java:1391)
	at PluginClassLoader for maven-plugin//hudson.maven.MavenModuleSetBuild$PomParser.invoke(MavenModuleSetBuild.java:1124)
	at hudson.FilePath$FileCallableWrapper.call(FilePath.java:3614)
	at hudson.remoting.UserRequest.perform(UserRequest.java:225)
	at hudson.remoting.UserRequest.perform(UserRequest.java:50)
	at hudson.remoting.Request$2.run(Request.java:391)
	at hudson.remoting.InterceptingExecutorService.lambda$wrap$0(InterceptingExecutorService.java:81)
	at java.base/java.util.concurrent.FutureTask.run(FutureTask.java:264)
	at java.base/java.util.concurrent.ThreadPoolExecutor.runWorker(ThreadPoolExecutor.java:1136)
	at java.base/java.util.concurrent.ThreadPoolExecutor$Worker.run(ThreadPoolExecutor.java:635)
	at java.base/java.lang.Thread.run(Thread.java:840)
	Suppressed: hudson.remoting.Channel$CallSiteStackTrace: Remote call to builds37
		at hudson.remoting.Channel.attachCallSiteStackTrace(Channel.java:1923)
		at hudson.remoting.UserRequest$ExceptionResponse.retrieve(UserRequest.java:384)
		at hudson.remoting.Channel.call(Channel.java:1112)
		at hudson.FilePath.act(FilePath.java:1228)
		at hudson.FilePath.act(FilePath.java:1217)
		at PluginClassLoader for maven-plugin//hudson.maven.MavenModuleSetBuild$MavenModuleSetBuildExecution.parsePoms(MavenModuleSetBuild.java:985)
		at PluginClassLoader for maven-plugin//hudson.maven.MavenModuleSetBuild$MavenModuleSetBuildExecution.doRun(MavenModuleSetBuild.java:689)
		at hudson.model.AbstractBuild$AbstractBuildExecution.run(AbstractBuild.java:527)
		at hudson.model.Run.execute(Run.java:1833)
		at PluginClassLoader for maven-plugin//hudson.maven.MavenModuleSetBuild.run(MavenModuleSetBuild.java:543)
		at hudson.model.ResourceController.execute(ResourceController.java:101)
		at hudson.model.Executor.run(Executor.java:446)
Caused by: hudson.remoting.ProxyException: org.apache.maven.project.ProjectBuildingException: Some problems were encountered while processing the POMs:
[FATAL] Non-readable POM /home/jenkins/.m2/repository/org/apache/maven/maven-parent/43/maven-parent-43.pom: input contained no data @ /home/jenkins/.m2/repository/org/apache/maven/maven-parent/43/maven-parent-43.pom
[ERROR] 'dependencies.dependency.version' for org.jboss.shrinkwrap.resolver:shrinkwrap-resolver-depchain:pom is missing. @ line 98, column 17
[FATAL] Non-readable POM /home/jenkins/.m2/repository/org/apache/maven/maven-parent/43/maven-parent-43.pom: input contained no data @ /home/jenkins/.m2/repository/org/apache/maven/maven-parent/43/maven-parent-43.pom
[ERROR] 'dependencies.dependency.version' for org.jboss.shrinkwrap.resolver:shrinkwrap-resolver-depchain:pom is missing. @ line 121, column 17
[FATAL] Non-readable POM /home/jenkins/.m2/repository/org/apache/maven/maven-parent/43/maven-parent-43.pom: input contained no data @ /home/jenkins/.m2/repository/org/apache/maven/maven-parent/43/maven-parent-43.pom
[ERROR] 'dependencies.dependency.version' for org.jboss.shrinkwrap.resolver:shrinkwrap-resolver-depchain:pom is missing. @ line 146, column 17
[FATAL] Non-readable POM /home/jenkins/.m2/repository/org/apache/maven/maven-parent/43/maven-parent-43.pom: input contained no data @ /home/jenkins/.m2/repository/org/apache/maven/maven-parent/43/maven-parent-43.pom
[ERROR] 'dependencies.dependency.version' for org.jboss.shrinkwrap.resolver:shrinkwrap-resolver-depchain:pom is missing. @ line 111, column 21
[FATAL] Non-readable POM /home/jenkins/.m2/repository/org/apache/maven/maven-parent/43/maven-parent-43.pom: input contained no data @ /home/jenkins/.m2/repository/org/apache/maven/maven-parent/43/maven-parent-43.pom
[ERROR] 'dependencies.dependency.version' for org.jboss.shrinkwrap.resolver:shrinkwrap-resolver-depchain:pom is missing. @ line 129, column 17
[FATAL] Non-readable POM /home/jenkins/.m2/repository/org/apache/maven/maven-parent/43/maven-parent-43.pom: input contained no data @ /home/jenkins/.m2/repository/org/apache/maven/maven-parent/43/maven-parent-43.pom
[ERROR] 'dependencies.dependency.version' for org.jboss.shrinkwrap.resolver:shrinkwrap-resolver-depchain:pom is missing. @ line 129, column 17
[FATAL] Non-readable POM /home/jenkins/.m2/repository/org/apache/maven/maven-parent/43/maven-parent-43.pom: input contained no data @ /home/jenkins/.m2/repository/org/apache/maven/maven-parent/43/maven-parent-43.pom
[ERROR] 'dependencies.dependency.version' for org.jboss.shrinkwrap.resolver:shrinkwrap-resolver-depchain:pom is missing. @ line 125, column 17
[FATAL] Non-readable POM /home/jenkins/.m2/repository/org/apache/maven/maven-parent/43/maven-parent-43.pom: input contained no data @ /home/jenkins/.m2/repository/org/apache/maven/maven-parent/43/maven-parent-43.pom
[ERROR] 'dependencies.dependency.version' for org.jboss.shrinkwrap.resolver:shrinkwrap-resolver-depchain:pom is missing. @ line 154, column 17
[FATAL] Non-readable POM /home/jenkins/.m2/repository/org/apache/maven/maven-parent/43/maven-parent-43.pom: input contained no data @ /home/jenkins/.m2/repository/org/apache/maven/maven-parent/43/maven-parent-43.pom
[ERROR] 'dependencies.dependency.version' for org.jboss.shrinkwrap.resolver:shrinkwrap-resolver-depchain:pom is missing. @ line 112, column 17
[WARNING] 'build.plugins.plugin.version' for org.codehaus.mojo:build-helper-maven-plugin is missing. @ line 42, column 15
[WARNING] 'build.plugins.plugin.version' for org.codehaus.mojo:build-helper-maven-plugin is missing. @ line 45, column 15
[FATAL] Non-readable POM /home/jenkins/.m2/repository/org/apache/maven/maven-parent/43/maven-parent-43.pom: input contained no data @ /home/jenkins/.m2/repository/org/apache/maven/maven-parent/43/maven-parent-43.pom
[ERROR] 'dependencies.dependency.version' for org.jboss.shrinkwrap.resolver:shrinkwrap-resolver-depchain:pom is missing. @ line 77, column 17
[FATAL] Non-readable POM /home/jenkins/.m2/repository/org/apache/maven/maven-parent/43/maven-parent-43.pom: input contained no data @ /home/jenkins/.m2/repository/org/apache/maven/maven-parent/43/maven-parent-43.pom
[ERROR] 'dependencies.dependency.version' for org.jboss.shrinkwrap.resolver:shrinkwrap-resolver-depchain:pom is missing. @ line 186, column 17
[FATAL] Non-readable POM /home/jenkins/.m2/repository/org/apache/maven/maven-parent/43/maven-parent-43.pom: input contained no data @ /home/jenkins/.m2/repository/org/apache/maven/maven-parent/43/maven-parent-43.pom
[ERROR] 'dependencies.dependency.version' for org.jboss.shrinkwrap.resolver:shrinkwrap-resolver-depchain:pom is missing. @ line 169, column 17
[FATAL] Non-readable POM /home/jenkins/.m2/repository/org/apache/maven/maven-parent/43/maven-parent-43.pom: input contained no data @ /home/jenkins/.m2/repository/org/apache/maven/maven-parent/43/maven-parent-43.pom
[ERROR] 'dependencies.dependency.version' for org.jboss.shrinkwrap.resolver:shrinkwrap-resolver-depchain:pom is missing. @ line 124, column 17
[WARNING] 'dependencies.dependency.scope' for org.junit:junit-bom:pom must be one of [provided, compile, runtime, test, system] but is 'import'. @ line 43, column 20
[WARNING] 'dependencies.dependency.scope' for org.junit:junit-bom:pom must be one of [provided, compile, runtime, test, system] but is 'import'. @ line 44, column 20

	at PluginClassLoader for maven-plugin//org.apache.maven.project.DefaultProjectBuilder.build(DefaultProjectBuilder.java:397)
	at PluginClassLoader for maven-plugin//hudson.maven.MavenEmbedder.buildProjects(MavenEmbedder.java:370)
	at PluginClassLoader for maven-plugin//hudson.maven.MavenEmbedder.readProjects(MavenEmbedder.java:340)
	at PluginClassLoader for maven-plugin//hudson.maven.MavenModuleSetBuild$PomParser.invoke(MavenModuleSetBuild.java:1330)
	... 10 more

Jenkins build is back to stable : TomEE » master-build-full #2324

Posted by Apache Jenkins Server <je...@builds.apache.org>.
See <https://ci-builds.apache.org/job/Tomee/job/master-build-full/2324/display/redirect>


Jenkins build is still unstable: TomEE » master-build-full #2323

Posted by Apache Jenkins Server <je...@builds.apache.org>.
See <https://ci-builds.apache.org/job/Tomee/job/master-build-full/2323/display/redirect?page=changes>


Jenkins build is unstable: TomEE » master-build-full #2322

Posted by Apache Jenkins Server <je...@builds.apache.org>.
See <https://ci-builds.apache.org/job/Tomee/job/master-build-full/2322/display/redirect>


Build failed in Jenkins: TomEE » master-build-full #2321

Posted by Apache Jenkins Server <je...@builds.apache.org>.
See <https://ci-builds.apache.org/job/Tomee/job/master-build-full/2321/display/redirect>

Changes:


------------------------------------------
Started by timer
Running as SYSTEM
[EnvInject] - Loading node environment variables.
Building remotely on builds37 (ubuntu) in workspace <https://ci-builds.apache.org/job/Tomee/job/master-build-full/ws/>
The recommended git tool is: NONE
No credentials specified
 > git rev-parse --resolve-git-dir <https://ci-builds.apache.org/job/Tomee/job/master-build-full/ws/.git> # timeout=10
Fetching changes from the remote Git repository
 > git config remote.origin.url https://github.com/apache/tomee # timeout=10
Cleaning workspace
 > git rev-parse --verify HEAD # timeout=10
Resetting working tree
 > git reset --hard # timeout=10
 > git clean -fdx # timeout=10
Fetching upstream changes from https://github.com/apache/tomee
 > git --version # timeout=10
 > git --version # 'git version 2.34.1'
 > git fetch --tags --force --progress -- https://github.com/apache/tomee +refs/heads/*:refs/remotes/origin/* # timeout=10
 > git rev-parse refs/remotes/origin/main^{commit} # timeout=10
Checking out Revision c90600ece534802be81f9fc1b5008cd3a37333f1 (refs/remotes/origin/main)
 > git config core.sparsecheckout # timeout=10
 > git checkout -f c90600ece534802be81f9fc1b5008cd3a37333f1 # timeout=10
Commit message: "use properties for the Hibernate libraries of the Jakarta Data TCK"
 > git rev-list --no-walk c90600ece534802be81f9fc1b5008cd3a37333f1 # timeout=10
[master-build-full] $ /bin/sh -xe /tmp/jenkins11363571841441769986.sh
+ rm -rf /home/jenkins/.m2/repository/org/apache
Parsing POMs
Downloaded artifact https://repository.apache.org/content/repositories/releases/org/apache/apache/40/apache-40.pom
Downloaded artifact https://repo.maven.apache.org/maven2/org/apache/maven/maven/3.5.2/maven-3.5.2.pom
Downloaded artifact https://repo.maven.apache.org/maven2/org/apache/maven/maven-parent/27/maven-parent-27.pom
Downloaded artifact https://repo.maven.apache.org/maven2/org/apache/apache/17/apache-17.pom
Downloaded artifact https://repo.maven.apache.org/maven2/org/apache/maven/maven/3.9.9/maven-3.9.9.pom
Downloaded artifact https://repo.maven.apache.org/maven2/org/apache/maven/maven-parent/43/maven-parent-43.pom
Downloaded artifact https://repo.maven.apache.org/maven2/org/apache/apache/33/apache-33.pom
ERROR: Failed to parse POMs
hudson.remoting.ProxyException: hudson.maven.MavenModuleSetBuild$MavenExecutionException: org.apache.maven.project.ProjectBuildingException: Some problems were encountered while processing the POMs:
[FATAL] Non-readable POM /home/jenkins/.m2/repository/org/junit/junit-bom/5.10.3/junit-bom-5.10.3.pom: input contained no data @ /home/jenkins/.m2/repository/org/junit/junit-bom/5.10.3/junit-bom-5.10.3.pom
[ERROR] 'dependencies.dependency.version' for org.jboss.shrinkwrap.resolver:shrinkwrap-resolver-depchain:pom is missing. @ line 98, column 17
[FATAL] Non-readable POM /home/jenkins/.m2/repository/org/junit/junit-bom/5.10.3/junit-bom-5.10.3.pom: input contained no data @ /home/jenkins/.m2/repository/org/junit/junit-bom/5.10.3/junit-bom-5.10.3.pom
[ERROR] 'dependencies.dependency.version' for org.jboss.shrinkwrap.resolver:shrinkwrap-resolver-depchain:pom is missing. @ line 121, column 17
[FATAL] Non-readable POM /home/jenkins/.m2/repository/org/junit/junit-bom/5.10.3/junit-bom-5.10.3.pom: input contained no data @ /home/jenkins/.m2/repository/org/junit/junit-bom/5.10.3/junit-bom-5.10.3.pom
[ERROR] 'dependencies.dependency.version' for org.jboss.shrinkwrap.resolver:shrinkwrap-resolver-depchain:pom is missing. @ line 146, column 17
[FATAL] Non-readable POM /home/jenkins/.m2/repository/org/junit/junit-bom/5.10.3/junit-bom-5.10.3.pom: input contained no data @ /home/jenkins/.m2/repository/org/junit/junit-bom/5.10.3/junit-bom-5.10.3.pom
[ERROR] 'dependencies.dependency.version' for org.jboss.shrinkwrap.resolver:shrinkwrap-resolver-depchain:pom is missing. @ line 111, column 21
[FATAL] Non-readable POM /home/jenkins/.m2/repository/org/junit/junit-bom/5.10.3/junit-bom-5.10.3.pom: input contained no data @ /home/jenkins/.m2/repository/org/junit/junit-bom/5.10.3/junit-bom-5.10.3.pom
[ERROR] 'dependencies.dependency.version' for org.jboss.shrinkwrap.resolver:shrinkwrap-resolver-depchain:pom is missing. @ line 129, column 17
[FATAL] Non-readable POM /home/jenkins/.m2/repository/org/junit/junit-bom/5.10.3/junit-bom-5.10.3.pom: input contained no data @ /home/jenkins/.m2/repository/org/junit/junit-bom/5.10.3/junit-bom-5.10.3.pom
[ERROR] 'dependencies.dependency.version' for org.jboss.shrinkwrap.resolver:shrinkwrap-resolver-depchain:pom is missing. @ line 129, column 17
[FATAL] Non-readable POM /home/jenkins/.m2/repository/org/junit/junit-bom/5.10.3/junit-bom-5.10.3.pom: input contained no data @ /home/jenkins/.m2/repository/org/junit/junit-bom/5.10.3/junit-bom-5.10.3.pom
[ERROR] 'dependencies.dependency.version' for org.jboss.shrinkwrap.resolver:shrinkwrap-resolver-depchain:pom is missing. @ line 125, column 17
[FATAL] Non-readable POM /home/jenkins/.m2/repository/org/junit/junit-bom/5.10.3/junit-bom-5.10.3.pom: input contained no data @ /home/jenkins/.m2/repository/org/junit/junit-bom/5.10.3/junit-bom-5.10.3.pom
[ERROR] 'dependencies.dependency.version' for org.jboss.shrinkwrap.resolver:shrinkwrap-resolver-depchain:pom is missing. @ line 154, column 17
[FATAL] Non-readable POM /home/jenkins/.m2/repository/org/junit/junit-bom/5.10.3/junit-bom-5.10.3.pom: input contained no data @ /home/jenkins/.m2/repository/org/junit/junit-bom/5.10.3/junit-bom-5.10.3.pom
[ERROR] 'dependencies.dependency.version' for org.jboss.shrinkwrap.resolver:shrinkwrap-resolver-depchain:pom is missing. @ line 112, column 17
[WARNING] 'build.plugins.plugin.version' for org.codehaus.mojo:build-helper-maven-plugin is missing. @ line 42, column 15
[WARNING] 'build.plugins.plugin.version' for org.codehaus.mojo:build-helper-maven-plugin is missing. @ line 45, column 15
[FATAL] Non-readable POM /home/jenkins/.m2/repository/org/junit/junit-bom/5.10.3/junit-bom-5.10.3.pom: input contained no data @ /home/jenkins/.m2/repository/org/junit/junit-bom/5.10.3/junit-bom-5.10.3.pom
[ERROR] 'dependencies.dependency.version' for org.jboss.shrinkwrap.resolver:shrinkwrap-resolver-depchain:pom is missing. @ line 77, column 17
[FATAL] Non-readable POM /home/jenkins/.m2/repository/org/junit/junit-bom/5.10.3/junit-bom-5.10.3.pom: input contained no data @ /home/jenkins/.m2/repository/org/junit/junit-bom/5.10.3/junit-bom-5.10.3.pom
[ERROR] 'dependencies.dependency.version' for org.jboss.shrinkwrap.resolver:shrinkwrap-resolver-depchain:pom is missing. @ line 186, column 17
[FATAL] Non-readable POM /home/jenkins/.m2/repository/org/junit/junit-bom/5.10.3/junit-bom-5.10.3.pom: input contained no data @ /home/jenkins/.m2/repository/org/junit/junit-bom/5.10.3/junit-bom-5.10.3.pom
[ERROR] 'dependencies.dependency.version' for org.jboss.shrinkwrap.resolver:shrinkwrap-resolver-depchain:pom is missing. @ line 169, column 17
[FATAL] Non-readable POM /home/jenkins/.m2/repository/org/junit/junit-bom/5.10.3/junit-bom-5.10.3.pom: input contained no data @ /home/jenkins/.m2/repository/org/junit/junit-bom/5.10.3/junit-bom-5.10.3.pom
[ERROR] 'dependencies.dependency.version' for org.jboss.shrinkwrap.resolver:shrinkwrap-resolver-depchain:pom is missing. @ line 124, column 17
[WARNING] 'dependencies.dependency.scope' for org.junit:junit-bom:pom must be one of [provided, compile, runtime, test, system] but is 'import'. @ line 43, column 20
[WARNING] 'dependencies.dependency.scope' for org.junit:junit-bom:pom must be one of [provided, compile, runtime, test, system] but is 'import'. @ line 44, column 20

	at PluginClassLoader for maven-plugin//hudson.maven.MavenModuleSetBuild$PomParser.invoke(MavenModuleSetBuild.java:1391)
	at PluginClassLoader for maven-plugin//hudson.maven.MavenModuleSetBuild$PomParser.invoke(MavenModuleSetBuild.java:1124)
	at hudson.FilePath$FileCallableWrapper.call(FilePath.java:3614)
	at hudson.remoting.UserRequest.perform(UserRequest.java:225)
	at hudson.remoting.UserRequest.perform(UserRequest.java:50)
	at hudson.remoting.Request$2.run(Request.java:391)
	at hudson.remoting.InterceptingExecutorService.lambda$wrap$0(InterceptingExecutorService.java:81)
	at java.base/java.util.concurrent.FutureTask.run(FutureTask.java:264)
	at java.base/java.util.concurrent.ThreadPoolExecutor.runWorker(ThreadPoolExecutor.java:1136)
	at java.base/java.util.concurrent.ThreadPoolExecutor$Worker.run(ThreadPoolExecutor.java:635)
	at java.base/java.lang.Thread.run(Thread.java:840)
	Suppressed: hudson.remoting.Channel$CallSiteStackTrace: Remote call to builds37
		at hudson.remoting.Channel.attachCallSiteStackTrace(Channel.java:1923)
		at hudson.remoting.UserRequest$ExceptionResponse.retrieve(UserRequest.java:384)
		at hudson.remoting.Channel.call(Channel.java:1112)
		at hudson.FilePath.act(FilePath.java:1228)
		at hudson.FilePath.act(FilePath.java:1217)
		at PluginClassLoader for maven-plugin//hudson.maven.MavenModuleSetBuild$MavenModuleSetBuildExecution.parsePoms(MavenModuleSetBuild.java:985)
		at PluginClassLoader for maven-plugin//hudson.maven.MavenModuleSetBuild$MavenModuleSetBuildExecution.doRun(MavenModuleSetBuild.java:689)
		at hudson.model.AbstractBuild$AbstractBuildExecution.run(AbstractBuild.java:527)
		at hudson.model.Run.execute(Run.java:1833)
		at PluginClassLoader for maven-plugin//hudson.maven.MavenModuleSetBuild.run(MavenModuleSetBuild.java:543)
		at hudson.model.ResourceController.execute(ResourceController.java:101)
		at hudson.model.Executor.run(Executor.java:446)
Caused by: hudson.remoting.ProxyException: org.apache.maven.project.ProjectBuildingException: Some problems were encountered while processing the POMs:
[FATAL] Non-readable POM /home/jenkins/.m2/repository/org/junit/junit-bom/5.10.3/junit-bom-5.10.3.pom: input contained no data @ /home/jenkins/.m2/repository/org/junit/junit-bom/5.10.3/junit-bom-5.10.3.pom
[ERROR] 'dependencies.dependency.version' for org.jboss.shrinkwrap.resolver:shrinkwrap-resolver-depchain:pom is missing. @ line 98, column 17
[FATAL] Non-readable POM /home/jenkins/.m2/repository/org/junit/junit-bom/5.10.3/junit-bom-5.10.3.pom: input contained no data @ /home/jenkins/.m2/repository/org/junit/junit-bom/5.10.3/junit-bom-5.10.3.pom
[ERROR] 'dependencies.dependency.version' for org.jboss.shrinkwrap.resolver:shrinkwrap-resolver-depchain:pom is missing. @ line 121, column 17
[FATAL] Non-readable POM /home/jenkins/.m2/repository/org/junit/junit-bom/5.10.3/junit-bom-5.10.3.pom: input contained no data @ /home/jenkins/.m2/repository/org/junit/junit-bom/5.10.3/junit-bom-5.10.3.pom
[ERROR] 'dependencies.dependency.version' for org.jboss.shrinkwrap.resolver:shrinkwrap-resolver-depchain:pom is missing. @ line 146, column 17
[FATAL] Non-readable POM /home/jenkins/.m2/repository/org/junit/junit-bom/5.10.3/junit-bom-5.10.3.pom: input contained no data @ /home/jenkins/.m2/repository/org/junit/junit-bom/5.10.3/junit-bom-5.10.3.pom
[ERROR] 'dependencies.dependency.version' for org.jboss.shrinkwrap.resolver:shrinkwrap-resolver-depchain:pom is missing. @ line 111, column 21
[FATAL] Non-readable POM /home/jenkins/.m2/repository/org/junit/junit-bom/5.10.3/junit-bom-5.10.3.pom: input contained no data @ /home/jenkins/.m2/repository/org/junit/junit-bom/5.10.3/junit-bom-5.10.3.pom
[ERROR] 'dependencies.dependency.version' for org.jboss.shrinkwrap.resolver:shrinkwrap-resolver-depchain:pom is missing. @ line 129, column 17
[FATAL] Non-readable POM /home/jenkins/.m2/repository/org/junit/junit-bom/5.10.3/junit-bom-5.10.3.pom: input contained no data @ /home/jenkins/.m2/repository/org/junit/junit-bom/5.10.3/junit-bom-5.10.3.pom
[ERROR] 'dependencies.dependency.version' for org.jboss.shrinkwrap.resolver:shrinkwrap-resolver-depchain:pom is missing. @ line 129, column 17
[FATAL] Non-readable POM /home/jenkins/.m2/repository/org/junit/junit-bom/5.10.3/junit-bom-5.10.3.pom: input contained no data @ /home/jenkins/.m2/repository/org/junit/junit-bom/5.10.3/junit-bom-5.10.3.pom
[ERROR] 'dependencies.dependency.version' for org.jboss.shrinkwrap.resolver:shrinkwrap-resolver-depchain:pom is missing. @ line 125, column 17
[FATAL] Non-readable POM /home/jenkins/.m2/repository/org/junit/junit-bom/5.10.3/junit-bom-5.10.3.pom: input contained no data @ /home/jenkins/.m2/repository/org/junit/junit-bom/5.10.3/junit-bom-5.10.3.pom
[ERROR] 'dependencies.dependency.version' for org.jboss.shrinkwrap.resolver:shrinkwrap-resolver-depchain:pom is missing. @ line 154, column 17
[FATAL] Non-readable POM /home/jenkins/.m2/repository/org/junit/junit-bom/5.10.3/junit-bom-5.10.3.pom: input contained no data @ /home/jenkins/.m2/repository/org/junit/junit-bom/5.10.3/junit-bom-5.10.3.pom
[ERROR] 'dependencies.dependency.version' for org.jboss.shrinkwrap.resolver:shrinkwrap-resolver-depchain:pom is missing. @ line 112, column 17
[WARNING] 'build.plugins.plugin.version' for org.codehaus.mojo:build-helper-maven-plugin is missing. @ line 42, column 15
[WARNING] 'build.plugins.plugin.version' for org.codehaus.mojo:build-helper-maven-plugin is missing. @ line 45, column 15
[FATAL] Non-readable POM /home/jenkins/.m2/repository/org/junit/junit-bom/5.10.3/junit-bom-5.10.3.pom: input contained no data @ /home/jenkins/.m2/repository/org/junit/junit-bom/5.10.3/junit-bom-5.10.3.pom
[ERROR] 'dependencies.dependency.version' for org.jboss.shrinkwrap.resolver:shrinkwrap-resolver-depchain:pom is missing. @ line 77, column 17
[FATAL] Non-readable POM /home/jenkins/.m2/repository/org/junit/junit-bom/5.10.3/junit-bom-5.10.3.pom: input contained no data @ /home/jenkins/.m2/repository/org/junit/junit-bom/5.10.3/junit-bom-5.10.3.pom
[ERROR] 'dependencies.dependency.version' for org.jboss.shrinkwrap.resolver:shrinkwrap-resolver-depchain:pom is missing. @ line 186, column 17
[FATAL] Non-readable POM /home/jenkins/.m2/repository/org/junit/junit-bom/5.10.3/junit-bom-5.10.3.pom: input contained no data @ /home/jenkins/.m2/repository/org/junit/junit-bom/5.10.3/junit-bom-5.10.3.pom
[ERROR] 'dependencies.dependency.version' for org.jboss.shrinkwrap.resolver:shrinkwrap-resolver-depchain:pom is missing. @ line 169, column 17
[FATAL] Non-readable POM /home/jenkins/.m2/repository/org/junit/junit-bom/5.10.3/junit-bom-5.10.3.pom: input contained no data @ /home/jenkins/.m2/repository/org/junit/junit-bom/5.10.3/junit-bom-5.10.3.pom
[ERROR] 'dependencies.dependency.version' for org.jboss.shrinkwrap.resolver:shrinkwrap-resolver-depchain:pom is missing. @ line 124, column 17
[WARNING] 'dependencies.dependency.scope' for org.junit:junit-bom:pom must be one of [provided, compile, runtime, test, system] but is 'import'. @ line 43, column 20
[WARNING] 'dependencies.dependency.scope' for org.junit:junit-bom:pom must be one of [provided, compile, runtime, test, system] but is 'import'. @ line 44, column 20

	at PluginClassLoader for maven-plugin//org.apache.maven.project.DefaultProjectBuilder.build(DefaultProjectBuilder.java:397)
	at PluginClassLoader for maven-plugin//hudson.maven.MavenEmbedder.buildProjects(MavenEmbedder.java:370)
	at PluginClassLoader for maven-plugin//hudson.maven.MavenEmbedder.readProjects(MavenEmbedder.java:340)
	at PluginClassLoader for maven-plugin//hudson.maven.MavenModuleSetBuild$PomParser.invoke(MavenModuleSetBuild.java:1330)
	... 10 more

Build failed in Jenkins: TomEE » master-build-full #2320

Posted by Apache Jenkins Server <je...@builds.apache.org>.
See <https://ci-builds.apache.org/job/Tomee/job/master-build-full/2320/display/redirect>

Changes:


------------------------------------------
Started by timer
Running as SYSTEM
[EnvInject] - Loading node environment variables.
Building remotely on builds37 (ubuntu) in workspace <https://ci-builds.apache.org/job/Tomee/job/master-build-full/ws/>
The recommended git tool is: NONE
No credentials specified
 > git rev-parse --resolve-git-dir <https://ci-builds.apache.org/job/Tomee/job/master-build-full/ws/.git> # timeout=10
Fetching changes from the remote Git repository
 > git config remote.origin.url https://github.com/apache/tomee # timeout=10
Cleaning workspace
 > git rev-parse --verify HEAD # timeout=10
Resetting working tree
 > git reset --hard # timeout=10
 > git clean -fdx # timeout=10
Fetching upstream changes from https://github.com/apache/tomee
 > git --version # timeout=10
 > git --version # 'git version 2.34.1'
 > git fetch --tags --force --progress -- https://github.com/apache/tomee +refs/heads/*:refs/remotes/origin/* # timeout=10
 > git rev-parse refs/remotes/origin/main^{commit} # timeout=10
Checking out Revision c90600ece534802be81f9fc1b5008cd3a37333f1 (refs/remotes/origin/main)
 > git config core.sparsecheckout # timeout=10
 > git checkout -f c90600ece534802be81f9fc1b5008cd3a37333f1 # timeout=10
Commit message: "use properties for the Hibernate libraries of the Jakarta Data TCK"
 > git rev-list --no-walk c90600ece534802be81f9fc1b5008cd3a37333f1 # timeout=10
[master-build-full] $ /bin/sh -xe /tmp/jenkins3131399013893916733.sh
+ rm -rf /home/jenkins/.m2/repository/org/apache
Parsing POMs
Downloaded artifact https://repository.apache.org/content/repositories/releases/org/apache/apache/40/apache-40.pom
Downloaded artifact https://repo.maven.apache.org/maven2/org/apache/maven/maven/3.5.2/maven-3.5.2.pom
Downloaded artifact https://repo.maven.apache.org/maven2/org/apache/maven/maven-parent/27/maven-parent-27.pom
Downloaded artifact https://repo.maven.apache.org/maven2/org/apache/apache/17/apache-17.pom
Downloaded artifact https://repo.maven.apache.org/maven2/org/apache/maven/maven/3.9.9/maven-3.9.9.pom
Downloaded artifact https://repo.maven.apache.org/maven2/org/apache/maven/maven-parent/43/maven-parent-43.pom
Downloaded artifact https://repo.maven.apache.org/maven2/org/apache/apache/33/apache-33.pom
ERROR: Failed to parse POMs
hudson.remoting.ProxyException: hudson.maven.MavenModuleSetBuild$MavenExecutionException: org.apache.maven.project.ProjectBuildingException: Some problems were encountered while processing the POMs:
[FATAL] Non-readable POM /home/jenkins/.m2/repository/org/junit/junit-bom/5.10.3/junit-bom-5.10.3.pom: input contained no data @ /home/jenkins/.m2/repository/org/junit/junit-bom/5.10.3/junit-bom-5.10.3.pom
[ERROR] 'dependencies.dependency.version' for org.jboss.shrinkwrap.resolver:shrinkwrap-resolver-depchain:pom is missing. @ line 98, column 17
[FATAL] Non-readable POM /home/jenkins/.m2/repository/org/junit/junit-bom/5.10.3/junit-bom-5.10.3.pom: input contained no data @ /home/jenkins/.m2/repository/org/junit/junit-bom/5.10.3/junit-bom-5.10.3.pom
[ERROR] 'dependencies.dependency.version' for org.jboss.shrinkwrap.resolver:shrinkwrap-resolver-depchain:pom is missing. @ line 121, column 17
[FATAL] Non-readable POM /home/jenkins/.m2/repository/org/junit/junit-bom/5.10.3/junit-bom-5.10.3.pom: input contained no data @ /home/jenkins/.m2/repository/org/junit/junit-bom/5.10.3/junit-bom-5.10.3.pom
[ERROR] 'dependencies.dependency.version' for org.jboss.shrinkwrap.resolver:shrinkwrap-resolver-depchain:pom is missing. @ line 146, column 17
[FATAL] Non-readable POM /home/jenkins/.m2/repository/org/junit/junit-bom/5.10.3/junit-bom-5.10.3.pom: input contained no data @ /home/jenkins/.m2/repository/org/junit/junit-bom/5.10.3/junit-bom-5.10.3.pom
[ERROR] 'dependencies.dependency.version' for org.jboss.shrinkwrap.resolver:shrinkwrap-resolver-depchain:pom is missing. @ line 111, column 21
[FATAL] Non-readable POM /home/jenkins/.m2/repository/org/junit/junit-bom/5.10.3/junit-bom-5.10.3.pom: input contained no data @ /home/jenkins/.m2/repository/org/junit/junit-bom/5.10.3/junit-bom-5.10.3.pom
[ERROR] 'dependencies.dependency.version' for org.jboss.shrinkwrap.resolver:shrinkwrap-resolver-depchain:pom is missing. @ line 129, column 17
[FATAL] Non-readable POM /home/jenkins/.m2/repository/org/junit/junit-bom/5.10.3/junit-bom-5.10.3.pom: input contained no data @ /home/jenkins/.m2/repository/org/junit/junit-bom/5.10.3/junit-bom-5.10.3.pom
[ERROR] 'dependencies.dependency.version' for org.jboss.shrinkwrap.resolver:shrinkwrap-resolver-depchain:pom is missing. @ line 129, column 17
[FATAL] Non-readable POM /home/jenkins/.m2/repository/org/junit/junit-bom/5.10.3/junit-bom-5.10.3.pom: input contained no data @ /home/jenkins/.m2/repository/org/junit/junit-bom/5.10.3/junit-bom-5.10.3.pom
[ERROR] 'dependencies.dependency.version' for org.jboss.shrinkwrap.resolver:shrinkwrap-resolver-depchain:pom is missing. @ line 125, column 17
[FATAL] Non-readable POM /home/jenkins/.m2/repository/org/junit/junit-bom/5.10.3/junit-bom-5.10.3.pom: input contained no data @ /home/jenkins/.m2/repository/org/junit/junit-bom/5.10.3/junit-bom-5.10.3.pom
[ERROR] 'dependencies.dependency.version' for org.jboss.shrinkwrap.resolver:shrinkwrap-resolver-depchain:pom is missing. @ line 154, column 17
[FATAL] Non-readable POM /home/jenkins/.m2/repository/org/junit/junit-bom/5.10.3/junit-bom-5.10.3.pom: input contained no data @ /home/jenkins/.m2/repository/org/junit/junit-bom/5.10.3/junit-bom-5.10.3.pom
[ERROR] 'dependencies.dependency.version' for org.jboss.shrinkwrap.resolver:shrinkwrap-resolver-depchain:pom is missing. @ line 112, column 17
[WARNING] 'build.plugins.plugin.version' for org.codehaus.mojo:build-helper-maven-plugin is missing. @ line 42, column 15
[WARNING] 'build.plugins.plugin.version' for org.codehaus.mojo:build-helper-maven-plugin is missing. @ line 45, column 15
[FATAL] Non-readable POM /home/jenkins/.m2/repository/org/junit/junit-bom/5.10.3/junit-bom-5.10.3.pom: input contained no data @ /home/jenkins/.m2/repository/org/junit/junit-bom/5.10.3/junit-bom-5.10.3.pom
[ERROR] 'dependencies.dependency.version' for org.jboss.shrinkwrap.resolver:shrinkwrap-resolver-depchain:pom is missing. @ line 77, column 17
[FATAL] Non-readable POM /home/jenkins/.m2/repository/org/junit/junit-bom/5.10.3/junit-bom-5.10.3.pom: input contained no data @ /home/jenkins/.m2/repository/org/junit/junit-bom/5.10.3/junit-bom-5.10.3.pom
[ERROR] 'dependencies.dependency.version' for org.jboss.shrinkwrap.resolver:shrinkwrap-resolver-depchain:pom is missing. @ line 186, column 17
[FATAL] Non-readable POM /home/jenkins/.m2/repository/org/junit/junit-bom/5.10.3/junit-bom-5.10.3.pom: input contained no data @ /home/jenkins/.m2/repository/org/junit/junit-bom/5.10.3/junit-bom-5.10.3.pom
[ERROR] 'dependencies.dependency.version' for org.jboss.shrinkwrap.resolver:shrinkwrap-resolver-depchain:pom is missing. @ line 169, column 17
[FATAL] Non-readable POM /home/jenkins/.m2/repository/org/junit/junit-bom/5.10.3/junit-bom-5.10.3.pom: input contained no data @ /home/jenkins/.m2/repository/org/junit/junit-bom/5.10.3/junit-bom-5.10.3.pom
[ERROR] 'dependencies.dependency.version' for org.jboss.shrinkwrap.resolver:shrinkwrap-resolver-depchain:pom is missing. @ line 124, column 17
[WARNING] 'dependencies.dependency.scope' for org.junit:junit-bom:pom must be one of [provided, compile, runtime, test, system] but is 'import'. @ line 43, column 20
[WARNING] 'dependencies.dependency.scope' for org.junit:junit-bom:pom must be one of [provided, compile, runtime, test, system] but is 'import'. @ line 44, column 20

	at PluginClassLoader for maven-plugin//hudson.maven.MavenModuleSetBuild$PomParser.invoke(MavenModuleSetBuild.java:1391)
	at PluginClassLoader for maven-plugin//hudson.maven.MavenModuleSetBuild$PomParser.invoke(MavenModuleSetBuild.java:1124)
	at hudson.FilePath$FileCallableWrapper.call(FilePath.java:3614)
	at hudson.remoting.UserRequest.perform(UserRequest.java:225)
	at hudson.remoting.UserRequest.perform(UserRequest.java:50)
	at hudson.remoting.Request$2.run(Request.java:391)
	at hudson.remoting.InterceptingExecutorService.lambda$wrap$0(InterceptingExecutorService.java:81)
	at java.base/java.util.concurrent.FutureTask.run(FutureTask.java:264)
	at java.base/java.util.concurrent.ThreadPoolExecutor.runWorker(ThreadPoolExecutor.java:1136)
	at java.base/java.util.concurrent.ThreadPoolExecutor$Worker.run(ThreadPoolExecutor.java:635)
	at java.base/java.lang.Thread.run(Thread.java:840)
	Suppressed: hudson.remoting.Channel$CallSiteStackTrace: Remote call to builds37
		at hudson.remoting.Channel.attachCallSiteStackTrace(Channel.java:1923)
		at hudson.remoting.UserRequest$ExceptionResponse.retrieve(UserRequest.java:384)
		at hudson.remoting.Channel.call(Channel.java:1112)
		at hudson.FilePath.act(FilePath.java:1228)
		at hudson.FilePath.act(FilePath.java:1217)
		at PluginClassLoader for maven-plugin//hudson.maven.MavenModuleSetBuild$MavenModuleSetBuildExecution.parsePoms(MavenModuleSetBuild.java:985)
		at PluginClassLoader for maven-plugin//hudson.maven.MavenModuleSetBuild$MavenModuleSetBuildExecution.doRun(MavenModuleSetBuild.java:689)
		at hudson.model.AbstractBuild$AbstractBuildExecution.run(AbstractBuild.java:527)
		at hudson.model.Run.execute(Run.java:1833)
		at PluginClassLoader for maven-plugin//hudson.maven.MavenModuleSetBuild.run(MavenModuleSetBuild.java:543)
		at hudson.model.ResourceController.execute(ResourceController.java:101)
		at hudson.model.Executor.run(Executor.java:446)
Caused by: hudson.remoting.ProxyException: org.apache.maven.project.ProjectBuildingException: Some problems were encountered while processing the POMs:
[FATAL] Non-readable POM /home/jenkins/.m2/repository/org/junit/junit-bom/5.10.3/junit-bom-5.10.3.pom: input contained no data @ /home/jenkins/.m2/repository/org/junit/junit-bom/5.10.3/junit-bom-5.10.3.pom
[ERROR] 'dependencies.dependency.version' for org.jboss.shrinkwrap.resolver:shrinkwrap-resolver-depchain:pom is missing. @ line 98, column 17
[FATAL] Non-readable POM /home/jenkins/.m2/repository/org/junit/junit-bom/5.10.3/junit-bom-5.10.3.pom: input contained no data @ /home/jenkins/.m2/repository/org/junit/junit-bom/5.10.3/junit-bom-5.10.3.pom
[ERROR] 'dependencies.dependency.version' for org.jboss.shrinkwrap.resolver:shrinkwrap-resolver-depchain:pom is missing. @ line 121, column 17
[FATAL] Non-readable POM /home/jenkins/.m2/repository/org/junit/junit-bom/5.10.3/junit-bom-5.10.3.pom: input contained no data @ /home/jenkins/.m2/repository/org/junit/junit-bom/5.10.3/junit-bom-5.10.3.pom
[ERROR] 'dependencies.dependency.version' for org.jboss.shrinkwrap.resolver:shrinkwrap-resolver-depchain:pom is missing. @ line 146, column 17
[FATAL] Non-readable POM /home/jenkins/.m2/repository/org/junit/junit-bom/5.10.3/junit-bom-5.10.3.pom: input contained no data @ /home/jenkins/.m2/repository/org/junit/junit-bom/5.10.3/junit-bom-5.10.3.pom
[ERROR] 'dependencies.dependency.version' for org.jboss.shrinkwrap.resolver:shrinkwrap-resolver-depchain:pom is missing. @ line 111, column 21
[FATAL] Non-readable POM /home/jenkins/.m2/repository/org/junit/junit-bom/5.10.3/junit-bom-5.10.3.pom: input contained no data @ /home/jenkins/.m2/repository/org/junit/junit-bom/5.10.3/junit-bom-5.10.3.pom
[ERROR] 'dependencies.dependency.version' for org.jboss.shrinkwrap.resolver:shrinkwrap-resolver-depchain:pom is missing. @ line 129, column 17
[FATAL] Non-readable POM /home/jenkins/.m2/repository/org/junit/junit-bom/5.10.3/junit-bom-5.10.3.pom: input contained no data @ /home/jenkins/.m2/repository/org/junit/junit-bom/5.10.3/junit-bom-5.10.3.pom
[ERROR] 'dependencies.dependency.version' for org.jboss.shrinkwrap.resolver:shrinkwrap-resolver-depchain:pom is missing. @ line 129, column 17
[FATAL] Non-readable POM /home/jenkins/.m2/repository/org/junit/junit-bom/5.10.3/junit-bom-5.10.3.pom: input contained no data @ /home/jenkins/.m2/repository/org/junit/junit-bom/5.10.3/junit-bom-5.10.3.pom
[ERROR] 'dependencies.dependency.version' for org.jboss.shrinkwrap.resolver:shrinkwrap-resolver-depchain:pom is missing. @ line 125, column 17
[FATAL] Non-readable POM /home/jenkins/.m2/repository/org/junit/junit-bom/5.10.3/junit-bom-5.10.3.pom: input contained no data @ /home/jenkins/.m2/repository/org/junit/junit-bom/5.10.3/junit-bom-5.10.3.pom
[ERROR] 'dependencies.dependency.version' for org.jboss.shrinkwrap.resolver:shrinkwrap-resolver-depchain:pom is missing. @ line 154, column 17
[FATAL] Non-readable POM /home/jenkins/.m2/repository/org/junit/junit-bom/5.10.3/junit-bom-5.10.3.pom: input contained no data @ /home/jenkins/.m2/repository/org/junit/junit-bom/5.10.3/junit-bom-5.10.3.pom
[ERROR] 'dependencies.dependency.version' for org.jboss.shrinkwrap.resolver:shrinkwrap-resolver-depchain:pom is missing. @ line 112, column 17
[WARNING] 'build.plugins.plugin.version' for org.codehaus.mojo:build-helper-maven-plugin is missing. @ line 42, column 15
[WARNING] 'build.plugins.plugin.version' for org.codehaus.mojo:build-helper-maven-plugin is missing. @ line 45, column 15
[FATAL] Non-readable POM /home/jenkins/.m2/repository/org/junit/junit-bom/5.10.3/junit-bom-5.10.3.pom: input contained no data @ /home/jenkins/.m2/repository/org/junit/junit-bom/5.10.3/junit-bom-5.10.3.pom
[ERROR] 'dependencies.dependency.version' for org.jboss.shrinkwrap.resolver:shrinkwrap-resolver-depchain:pom is missing. @ line 77, column 17
[FATAL] Non-readable POM /home/jenkins/.m2/repository/org/junit/junit-bom/5.10.3/junit-bom-5.10.3.pom: input contained no data @ /home/jenkins/.m2/repository/org/junit/junit-bom/5.10.3/junit-bom-5.10.3.pom
[ERROR] 'dependencies.dependency.version' for org.jboss.shrinkwrap.resolver:shrinkwrap-resolver-depchain:pom is missing. @ line 186, column 17
[FATAL] Non-readable POM /home/jenkins/.m2/repository/org/junit/junit-bom/5.10.3/junit-bom-5.10.3.pom: input contained no data @ /home/jenkins/.m2/repository/org/junit/junit-bom/5.10.3/junit-bom-5.10.3.pom
[ERROR] 'dependencies.dependency.version' for org.jboss.shrinkwrap.resolver:shrinkwrap-resolver-depchain:pom is missing. @ line 169, column 17
[FATAL] Non-readable POM /home/jenkins/.m2/repository/org/junit/junit-bom/5.10.3/junit-bom-5.10.3.pom: input contained no data @ /home/jenkins/.m2/repository/org/junit/junit-bom/5.10.3/junit-bom-5.10.3.pom
[ERROR] 'dependencies.dependency.version' for org.jboss.shrinkwrap.resolver:shrinkwrap-resolver-depchain:pom is missing. @ line 124, column 17
[WARNING] 'dependencies.dependency.scope' for org.junit:junit-bom:pom must be one of [provided, compile, runtime, test, system] but is 'import'. @ line 43, column 20
[WARNING] 'dependencies.dependency.scope' for org.junit:junit-bom:pom must be one of [provided, compile, runtime, test, system] but is 'import'. @ line 44, column 20

	at PluginClassLoader for maven-plugin//org.apache.maven.project.DefaultProjectBuilder.build(DefaultProjectBuilder.java:397)
	at PluginClassLoader for maven-plugin//hudson.maven.MavenEmbedder.buildProjects(MavenEmbedder.java:370)
	at PluginClassLoader for maven-plugin//hudson.maven.MavenEmbedder.readProjects(MavenEmbedder.java:340)
	at PluginClassLoader for maven-plugin//hudson.maven.MavenModuleSetBuild$PomParser.invoke(MavenModuleSetBuild.java:1330)
	... 10 more

Build failed in Jenkins: TomEE » master-build-full #2319

Posted by Apache Jenkins Server <je...@builds.apache.org>.
See <https://ci-builds.apache.org/job/Tomee/job/master-build-full/2319/display/redirect?page=changes>

Changes:

[github] Align the Jakarta Data TCK Hibernate libraries with hibernate-core 7.4.11 (#3089)

[Richard Zowalla] use properties for the Hibernate libraries of the Jakarta Data TCK


------------------------------------------
Started by timer
Running as SYSTEM
[EnvInject] - Loading node environment variables.
Building remotely on builds37 (ubuntu) in workspace <https://ci-builds.apache.org/job/Tomee/job/master-build-full/ws/>
The recommended git tool is: NONE
No credentials specified
 > git rev-parse --resolve-git-dir <https://ci-builds.apache.org/job/Tomee/job/master-build-full/ws/.git> # timeout=10
Fetching changes from the remote Git repository
 > git config remote.origin.url https://github.com/apache/tomee # timeout=10
Cleaning workspace
 > git rev-parse --verify HEAD # timeout=10
Resetting working tree
 > git reset --hard # timeout=10
 > git clean -fdx # timeout=10
Fetching upstream changes from https://github.com/apache/tomee
 > git --version # timeout=10
 > git --version # 'git version 2.34.1'
 > git fetch --tags --force --progress -- https://github.com/apache/tomee +refs/heads/*:refs/remotes/origin/* # timeout=10
 > git rev-parse refs/remotes/origin/main^{commit} # timeout=10
Checking out Revision c90600ece534802be81f9fc1b5008cd3a37333f1 (refs/remotes/origin/main)
 > git config core.sparsecheckout # timeout=10
 > git checkout -f c90600ece534802be81f9fc1b5008cd3a37333f1 # timeout=10
Commit message: "use properties for the Hibernate libraries of the Jakarta Data TCK"
 > git rev-list --no-walk 1d72919b50ebd447fe839d9b9dfa36add82e206e # timeout=10
[master-build-full] $ /bin/sh -xe /tmp/jenkins5347349538773699002.sh
+ rm -rf /home/jenkins/.m2/repository/org/apache
Parsing POMs
Downloaded artifact https://repository.apache.org/content/repositories/releases/org/apache/apache/40/apache-40.pom
Downloaded artifact https://repo.maven.apache.org/maven2/org/apache/maven/maven/3.5.2/maven-3.5.2.pom
Downloaded artifact https://repo.maven.apache.org/maven2/org/apache/maven/maven-parent/27/maven-parent-27.pom
Downloaded artifact https://repo.maven.apache.org/maven2/org/apache/apache/17/apache-17.pom
Downloaded artifact https://repo.maven.apache.org/maven2/org/apache/maven/maven/3.9.9/maven-3.9.9.pom
Downloaded artifact https://repo.maven.apache.org/maven2/org/apache/maven/maven-parent/43/maven-parent-43.pom
Downloaded artifact https://repo.maven.apache.org/maven2/org/apache/apache/33/apache-33.pom
ERROR: Failed to parse POMs
hudson.remoting.ProxyException: hudson.maven.MavenModuleSetBuild$MavenExecutionException: org.apache.maven.project.ProjectBuildingException: Some problems were encountered while processing the POMs:
[FATAL] Non-readable POM /home/jenkins/.m2/repository/org/junit/junit-bom/5.10.3/junit-bom-5.10.3.pom: input contained no data @ /home/jenkins/.m2/repository/org/junit/junit-bom/5.10.3/junit-bom-5.10.3.pom
[ERROR] 'dependencies.dependency.version' for org.jboss.shrinkwrap.resolver:shrinkwrap-resolver-depchain:pom is missing. @ line 98, column 17
[FATAL] Non-readable POM /home/jenkins/.m2/repository/org/junit/junit-bom/5.10.3/junit-bom-5.10.3.pom: input contained no data @ /home/jenkins/.m2/repository/org/junit/junit-bom/5.10.3/junit-bom-5.10.3.pom
[ERROR] 'dependencies.dependency.version' for org.jboss.shrinkwrap.resolver:shrinkwrap-resolver-depchain:pom is missing. @ line 121, column 17
[FATAL] Non-readable POM /home/jenkins/.m2/repository/org/junit/junit-bom/5.10.3/junit-bom-5.10.3.pom: input contained no data @ /home/jenkins/.m2/repository/org/junit/junit-bom/5.10.3/junit-bom-5.10.3.pom
[ERROR] 'dependencies.dependency.version' for org.jboss.shrinkwrap.resolver:shrinkwrap-resolver-depchain:pom is missing. @ line 146, column 17
[FATAL] Non-readable POM /home/jenkins/.m2/repository/org/junit/junit-bom/5.10.3/junit-bom-5.10.3.pom: input contained no data @ /home/jenkins/.m2/repository/org/junit/junit-bom/5.10.3/junit-bom-5.10.3.pom
[ERROR] 'dependencies.dependency.version' for org.jboss.shrinkwrap.resolver:shrinkwrap-resolver-depchain:pom is missing. @ line 111, column 21
[FATAL] Non-readable POM /home/jenkins/.m2/repository/org/junit/junit-bom/5.10.3/junit-bom-5.10.3.pom: input contained no data @ /home/jenkins/.m2/repository/org/junit/junit-bom/5.10.3/junit-bom-5.10.3.pom
[ERROR] 'dependencies.dependency.version' for org.jboss.shrinkwrap.resolver:shrinkwrap-resolver-depchain:pom is missing. @ line 129, column 17
[FATAL] Non-readable POM /home/jenkins/.m2/repository/org/junit/junit-bom/5.10.3/junit-bom-5.10.3.pom: input contained no data @ /home/jenkins/.m2/repository/org/junit/junit-bom/5.10.3/junit-bom-5.10.3.pom
[ERROR] 'dependencies.dependency.version' for org.jboss.shrinkwrap.resolver:shrinkwrap-resolver-depchain:pom is missing. @ line 129, column 17
[FATAL] Non-readable POM /home/jenkins/.m2/repository/org/junit/junit-bom/5.10.3/junit-bom-5.10.3.pom: input contained no data @ /home/jenkins/.m2/repository/org/junit/junit-bom/5.10.3/junit-bom-5.10.3.pom
[ERROR] 'dependencies.dependency.version' for org.jboss.shrinkwrap.resolver:shrinkwrap-resolver-depchain:pom is missing. @ line 125, column 17
[FATAL] Non-readable POM /home/jenkins/.m2/repository/org/junit/junit-bom/5.10.3/junit-bom-5.10.3.pom: input contained no data @ /home/jenkins/.m2/repository/org/junit/junit-bom/5.10.3/junit-bom-5.10.3.pom
[ERROR] 'dependencies.dependency.version' for org.jboss.shrinkwrap.resolver:shrinkwrap-resolver-depchain:pom is missing. @ line 154, column 17
[FATAL] Non-readable POM /home/jenkins/.m2/repository/org/junit/junit-bom/5.10.3/junit-bom-5.10.3.pom: input contained no data @ /home/jenkins/.m2/repository/org/junit/junit-bom/5.10.3/junit-bom-5.10.3.pom
[ERROR] 'dependencies.dependency.version' for org.jboss.shrinkwrap.resolver:shrinkwrap-resolver-depchain:pom is missing. @ line 112, column 17
[WARNING] 'build.plugins.plugin.version' for org.codehaus.mojo:build-helper-maven-plugin is missing. @ line 42, column 15
[WARNING] 'build.plugins.plugin.version' for org.codehaus.mojo:build-helper-maven-plugin is missing. @ line 45, column 15
[FATAL] Non-readable POM /home/jenkins/.m2/repository/org/junit/junit-bom/5.10.3/junit-bom-5.10.3.pom: input contained no data @ /home/jenkins/.m2/repository/org/junit/junit-bom/5.10.3/junit-bom-5.10.3.pom
[ERROR] 'dependencies.dependency.version' for org.jboss.shrinkwrap.resolver:shrinkwrap-resolver-depchain:pom is missing. @ line 77, column 17
[FATAL] Non-readable POM /home/jenkins/.m2/repository/org/junit/junit-bom/5.10.3/junit-bom-5.10.3.pom: input contained no data @ /home/jenkins/.m2/repository/org/junit/junit-bom/5.10.3/junit-bom-5.10.3.pom
[ERROR] 'dependencies.dependency.version' for org.jboss.shrinkwrap.resolver:shrinkwrap-resolver-depchain:pom is missing. @ line 186, column 17
[FATAL] Non-readable POM /home/jenkins/.m2/repository/org/junit/junit-bom/5.10.3/junit-bom-5.10.3.pom: input contained no data @ /home/jenkins/.m2/repository/org/junit/junit-bom/5.10.3/junit-bom-5.10.3.pom
[ERROR] 'dependencies.dependency.version' for org.jboss.shrinkwrap.resolver:shrinkwrap-resolver-depchain:pom is missing. @ line 169, column 17
[FATAL] Non-readable POM /home/jenkins/.m2/repository/org/junit/junit-bom/5.10.3/junit-bom-5.10.3.pom: input contained no data @ /home/jenkins/.m2/repository/org/junit/junit-bom/5.10.3/junit-bom-5.10.3.pom
[ERROR] 'dependencies.dependency.version' for org.jboss.shrinkwrap.resolver:shrinkwrap-resolver-depchain:pom is missing. @ line 124, column 17
[WARNING] 'dependencies.dependency.scope' for org.junit:junit-bom:pom must be one of [provided, compile, runtime, test, system] but is 'import'. @ line 43, column 20
[WARNING] 'dependencies.dependency.scope' for org.junit:junit-bom:pom must be one of [provided, compile, runtime, test, system] but is 'import'. @ line 44, column 20

	at PluginClassLoader for maven-plugin//hudson.maven.MavenModuleSetBuild$PomParser.invoke(MavenModuleSetBuild.java:1391)
	at PluginClassLoader for maven-plugin//hudson.maven.MavenModuleSetBuild$PomParser.invoke(MavenModuleSetBuild.java:1124)
	at hudson.FilePath$FileCallableWrapper.call(FilePath.java:3614)
	at hudson.remoting.UserRequest.perform(UserRequest.java:225)
	at hudson.remoting.UserRequest.perform(UserRequest.java:50)
	at hudson.remoting.Request$2.run(Request.java:391)
	at hudson.remoting.InterceptingExecutorService.lambda$wrap$0(InterceptingExecutorService.java:81)
	at java.base/java.util.concurrent.FutureTask.run(FutureTask.java:264)
	at java.base/java.util.concurrent.ThreadPoolExecutor.runWorker(ThreadPoolExecutor.java:1136)
	at java.base/java.util.concurrent.ThreadPoolExecutor$Worker.run(ThreadPoolExecutor.java:635)
	at java.base/java.lang.Thread.run(Thread.java:840)
	Suppressed: hudson.remoting.Channel$CallSiteStackTrace: Remote call to builds37
		at hudson.remoting.Channel.attachCallSiteStackTrace(Channel.java:1923)
		at hudson.remoting.UserRequest$ExceptionResponse.retrieve(UserRequest.java:384)
		at hudson.remoting.Channel.call(Channel.java:1112)
		at hudson.FilePath.act(FilePath.java:1228)
		at hudson.FilePath.act(FilePath.java:1217)
		at PluginClassLoader for maven-plugin//hudson.maven.MavenModuleSetBuild$MavenModuleSetBuildExecution.parsePoms(MavenModuleSetBuild.java:985)
		at PluginClassLoader for maven-plugin//hudson.maven.MavenModuleSetBuild$MavenModuleSetBuildExecution.doRun(MavenModuleSetBuild.java:689)
		at hudson.model.AbstractBuild$AbstractBuildExecution.run(AbstractBuild.java:527)
		at hudson.model.Run.execute(Run.java:1833)
		at PluginClassLoader for maven-plugin//hudson.maven.MavenModuleSetBuild.run(MavenModuleSetBuild.java:543)
		at hudson.model.ResourceController.execute(ResourceController.java:101)
		at hudson.model.Executor.run(Executor.java:446)
Caused by: hudson.remoting.ProxyException: org.apache.maven.project.ProjectBuildingException: Some problems were encountered while processing the POMs:
[FATAL] Non-readable POM /home/jenkins/.m2/repository/org/junit/junit-bom/5.10.3/junit-bom-5.10.3.pom: input contained no data @ /home/jenkins/.m2/repository/org/junit/junit-bom/5.10.3/junit-bom-5.10.3.pom
[ERROR] 'dependencies.dependency.version' for org.jboss.shrinkwrap.resolver:shrinkwrap-resolver-depchain:pom is missing. @ line 98, column 17
[FATAL] Non-readable POM /home/jenkins/.m2/repository/org/junit/junit-bom/5.10.3/junit-bom-5.10.3.pom: input contained no data @ /home/jenkins/.m2/repository/org/junit/junit-bom/5.10.3/junit-bom-5.10.3.pom
[ERROR] 'dependencies.dependency.version' for org.jboss.shrinkwrap.resolver:shrinkwrap-resolver-depchain:pom is missing. @ line 121, column 17
[FATAL] Non-readable POM /home/jenkins/.m2/repository/org/junit/junit-bom/5.10.3/junit-bom-5.10.3.pom: input contained no data @ /home/jenkins/.m2/repository/org/junit/junit-bom/5.10.3/junit-bom-5.10.3.pom
[ERROR] 'dependencies.dependency.version' for org.jboss.shrinkwrap.resolver:shrinkwrap-resolver-depchain:pom is missing. @ line 146, column 17
[FATAL] Non-readable POM /home/jenkins/.m2/repository/org/junit/junit-bom/5.10.3/junit-bom-5.10.3.pom: input contained no data @ /home/jenkins/.m2/repository/org/junit/junit-bom/5.10.3/junit-bom-5.10.3.pom
[ERROR] 'dependencies.dependency.version' for org.jboss.shrinkwrap.resolver:shrinkwrap-resolver-depchain:pom is missing. @ line 111, column 21
[FATAL] Non-readable POM /home/jenkins/.m2/repository/org/junit/junit-bom/5.10.3/junit-bom-5.10.3.pom: input contained no data @ /home/jenkins/.m2/repository/org/junit/junit-bom/5.10.3/junit-bom-5.10.3.pom
[ERROR] 'dependencies.dependency.version' for org.jboss.shrinkwrap.resolver:shrinkwrap-resolver-depchain:pom is missing. @ line 129, column 17
[FATAL] Non-readable POM /home/jenkins/.m2/repository/org/junit/junit-bom/5.10.3/junit-bom-5.10.3.pom: input contained no data @ /home/jenkins/.m2/repository/org/junit/junit-bom/5.10.3/junit-bom-5.10.3.pom
[ERROR] 'dependencies.dependency.version' for org.jboss.shrinkwrap.resolver:shrinkwrap-resolver-depchain:pom is missing. @ line 129, column 17
[FATAL] Non-readable POM /home/jenkins/.m2/repository/org/junit/junit-bom/5.10.3/junit-bom-5.10.3.pom: input contained no data @ /home/jenkins/.m2/repository/org/junit/junit-bom/5.10.3/junit-bom-5.10.3.pom
[ERROR] 'dependencies.dependency.version' for org.jboss.shrinkwrap.resolver:shrinkwrap-resolver-depchain:pom is missing. @ line 125, column 17
[FATAL] Non-readable POM /home/jenkins/.m2/repository/org/junit/junit-bom/5.10.3/junit-bom-5.10.3.pom: input contained no data @ /home/jenkins/.m2/repository/org/junit/junit-bom/5.10.3/junit-bom-5.10.3.pom
[ERROR] 'dependencies.dependency.version' for org.jboss.shrinkwrap.resolver:shrinkwrap-resolver-depchain:pom is missing. @ line 154, column 17
[FATAL] Non-readable POM /home/jenkins/.m2/repository/org/junit/junit-bom/5.10.3/junit-bom-5.10.3.pom: input contained no data @ /home/jenkins/.m2/repository/org/junit/junit-bom/5.10.3/junit-bom-5.10.3.pom
[ERROR] 'dependencies.dependency.version' for org.jboss.shrinkwrap.resolver:shrinkwrap-resolver-depchain:pom is missing. @ line 112, column 17
[WARNING] 'build.plugins.plugin.version' for org.codehaus.mojo:build-helper-maven-plugin is missing. @ line 42, column 15
[WARNING] 'build.plugins.plugin.version' for org.codehaus.mojo:build-helper-maven-plugin is missing. @ line 45, column 15
[FATAL] Non-readable POM /home/jenkins/.m2/repository/org/junit/junit-bom/5.10.3/junit-bom-5.10.3.pom: input contained no data @ /home/jenkins/.m2/repository/org/junit/junit-bom/5.10.3/junit-bom-5.10.3.pom
[ERROR] 'dependencies.dependency.version' for org.jboss.shrinkwrap.resolver:shrinkwrap-resolver-depchain:pom is missing. @ line 77, column 17
[FATAL] Non-readable POM /home/jenkins/.m2/repository/org/junit/junit-bom/5.10.3/junit-bom-5.10.3.pom: input contained no data @ /home/jenkins/.m2/repository/org/junit/junit-bom/5.10.3/junit-bom-5.10.3.pom
[ERROR] 'dependencies.dependency.version' for org.jboss.shrinkwrap.resolver:shrinkwrap-resolver-depchain:pom is missing. @ line 186, column 17
[FATAL] Non-readable POM /home/jenkins/.m2/repository/org/junit/junit-bom/5.10.3/junit-bom-5.10.3.pom: input contained no data @ /home/jenkins/.m2/repository/org/junit/junit-bom/5.10.3/junit-bom-5.10.3.pom
[ERROR] 'dependencies.dependency.version' for org.jboss.shrinkwrap.resolver:shrinkwrap-resolver-depchain:pom is missing. @ line 169, column 17
[FATAL] Non-readable POM /home/jenkins/.m2/repository/org/junit/junit-bom/5.10.3/junit-bom-5.10.3.pom: input contained no data @ /home/jenkins/.m2/repository/org/junit/junit-bom/5.10.3/junit-bom-5.10.3.pom
[ERROR] 'dependencies.dependency.version' for org.jboss.shrinkwrap.resolver:shrinkwrap-resolver-depchain:pom is missing. @ line 124, column 17
[WARNING] 'dependencies.dependency.scope' for org.junit:junit-bom:pom must be one of [provided, compile, runtime, test, system] but is 'import'. @ line 43, column 20
[WARNING] 'dependencies.dependency.scope' for org.junit:junit-bom:pom must be one of [provided, compile, runtime, test, system] but is 'import'. @ line 44, column 20

	at PluginClassLoader for maven-plugin//org.apache.maven.project.DefaultProjectBuilder.build(DefaultProjectBuilder.java:397)
	at PluginClassLoader for maven-plugin//hudson.maven.MavenEmbedder.buildProjects(MavenEmbedder.java:370)
	at PluginClassLoader for maven-plugin//hudson.maven.MavenEmbedder.readProjects(MavenEmbedder.java:340)
	at PluginClassLoader for maven-plugin//hudson.maven.MavenModuleSetBuild$PomParser.invoke(MavenModuleSetBuild.java:1330)
	... 10 more

Build failed in Jenkins: TomEE » master-build-full #2318

Posted by Apache Jenkins Server <je...@builds.apache.org>.
See <https://ci-builds.apache.org/job/Tomee/job/master-build-full/2318/display/redirect>

Changes:


------------------------------------------
Started by user Richard Zowalla
Running as SYSTEM
[EnvInject] - Loading node environment variables.
Building remotely on builds37 (ubuntu) in workspace <https://ci-builds.apache.org/job/Tomee/job/master-build-full/ws/>
The recommended git tool is: NONE
No credentials specified
 > git rev-parse --resolve-git-dir <https://ci-builds.apache.org/job/Tomee/job/master-build-full/ws/.git> # timeout=10
Fetching changes from the remote Git repository
 > git config remote.origin.url https://github.com/apache/tomee # timeout=10
Cleaning workspace
 > git rev-parse --verify HEAD # timeout=10
Resetting working tree
 > git reset --hard # timeout=10
 > git clean -fdx # timeout=10
Fetching upstream changes from https://github.com/apache/tomee
 > git --version # timeout=10
 > git --version # 'git version 2.34.1'
 > git fetch --tags --force --progress -- https://github.com/apache/tomee +refs/heads/*:refs/remotes/origin/* # timeout=10
 > git rev-parse refs/remotes/origin/main^{commit} # timeout=10
Checking out Revision 1d72919b50ebd447fe839d9b9dfa36add82e206e (refs/remotes/origin/main)
 > git config core.sparsecheckout # timeout=10
 > git checkout -f 1d72919b50ebd447fe839d9b9dfa36add82e206e # timeout=10
Commit message: "make the scan exclusion and async MP-JWT tests independent of their environment (#3088)"
 > git rev-list --no-walk 1d72919b50ebd447fe839d9b9dfa36add82e206e # timeout=10
[master-build-full] $ /bin/sh -xe /tmp/jenkins3419274219879922761.sh
+ rm -rf /home/jenkins/.m2/repository/org/apache
Parsing POMs
Downloaded artifact https://repository.apache.org/content/repositories/releases/org/apache/apache/40/apache-40.pom
Downloaded artifact https://repo.maven.apache.org/maven2/org/apache/maven/maven/3.5.2/maven-3.5.2.pom
Downloaded artifact https://repo.maven.apache.org/maven2/org/apache/maven/maven-parent/27/maven-parent-27.pom
Downloaded artifact https://repo.maven.apache.org/maven2/org/apache/apache/17/apache-17.pom
Downloaded artifact https://repo.maven.apache.org/maven2/org/apache/maven/maven/3.9.9/maven-3.9.9.pom
Downloaded artifact https://repo.maven.apache.org/maven2/org/apache/maven/maven-parent/43/maven-parent-43.pom
Downloaded artifact https://repo.maven.apache.org/maven2/org/apache/apache/33/apache-33.pom
ERROR: Failed to parse POMs
hudson.remoting.ProxyException: hudson.maven.MavenModuleSetBuild$MavenExecutionException: org.apache.maven.project.ProjectBuildingException: Some problems were encountered while processing the POMs:
[FATAL] Non-readable POM /home/jenkins/.m2/repository/org/junit/junit-bom/5.10.3/junit-bom-5.10.3.pom: input contained no data @ /home/jenkins/.m2/repository/org/junit/junit-bom/5.10.3/junit-bom-5.10.3.pom
[ERROR] 'dependencies.dependency.version' for org.jboss.shrinkwrap.resolver:shrinkwrap-resolver-depchain:pom is missing. @ line 98, column 17
[FATAL] Non-readable POM /home/jenkins/.m2/repository/org/junit/junit-bom/5.10.3/junit-bom-5.10.3.pom: input contained no data @ /home/jenkins/.m2/repository/org/junit/junit-bom/5.10.3/junit-bom-5.10.3.pom
[ERROR] 'dependencies.dependency.version' for org.jboss.shrinkwrap.resolver:shrinkwrap-resolver-depchain:pom is missing. @ line 121, column 17
[FATAL] Non-readable POM /home/jenkins/.m2/repository/org/junit/junit-bom/5.10.3/junit-bom-5.10.3.pom: input contained no data @ /home/jenkins/.m2/repository/org/junit/junit-bom/5.10.3/junit-bom-5.10.3.pom
[ERROR] 'dependencies.dependency.version' for org.jboss.shrinkwrap.resolver:shrinkwrap-resolver-depchain:pom is missing. @ line 146, column 17
[FATAL] Non-readable POM /home/jenkins/.m2/repository/org/junit/junit-bom/5.10.3/junit-bom-5.10.3.pom: input contained no data @ /home/jenkins/.m2/repository/org/junit/junit-bom/5.10.3/junit-bom-5.10.3.pom
[ERROR] 'dependencies.dependency.version' for org.jboss.shrinkwrap.resolver:shrinkwrap-resolver-depchain:pom is missing. @ line 111, column 21
[FATAL] Non-readable POM /home/jenkins/.m2/repository/org/junit/junit-bom/5.10.3/junit-bom-5.10.3.pom: input contained no data @ /home/jenkins/.m2/repository/org/junit/junit-bom/5.10.3/junit-bom-5.10.3.pom
[ERROR] 'dependencies.dependency.version' for org.jboss.shrinkwrap.resolver:shrinkwrap-resolver-depchain:pom is missing. @ line 129, column 17
[FATAL] Non-readable POM /home/jenkins/.m2/repository/org/junit/junit-bom/5.10.3/junit-bom-5.10.3.pom: input contained no data @ /home/jenkins/.m2/repository/org/junit/junit-bom/5.10.3/junit-bom-5.10.3.pom
[ERROR] 'dependencies.dependency.version' for org.jboss.shrinkwrap.resolver:shrinkwrap-resolver-depchain:pom is missing. @ line 129, column 17
[FATAL] Non-readable POM /home/jenkins/.m2/repository/org/junit/junit-bom/5.10.3/junit-bom-5.10.3.pom: input contained no data @ /home/jenkins/.m2/repository/org/junit/junit-bom/5.10.3/junit-bom-5.10.3.pom
[ERROR] 'dependencies.dependency.version' for org.jboss.shrinkwrap.resolver:shrinkwrap-resolver-depchain:pom is missing. @ line 125, column 17
[FATAL] Non-readable POM /home/jenkins/.m2/repository/org/junit/junit-bom/5.10.3/junit-bom-5.10.3.pom: input contained no data @ /home/jenkins/.m2/repository/org/junit/junit-bom/5.10.3/junit-bom-5.10.3.pom
[ERROR] 'dependencies.dependency.version' for org.jboss.shrinkwrap.resolver:shrinkwrap-resolver-depchain:pom is missing. @ line 154, column 17
[FATAL] Non-readable POM /home/jenkins/.m2/repository/org/junit/junit-bom/5.10.3/junit-bom-5.10.3.pom: input contained no data @ /home/jenkins/.m2/repository/org/junit/junit-bom/5.10.3/junit-bom-5.10.3.pom
[ERROR] 'dependencies.dependency.version' for org.jboss.shrinkwrap.resolver:shrinkwrap-resolver-depchain:pom is missing. @ line 112, column 17
[WARNING] 'build.plugins.plugin.version' for org.codehaus.mojo:build-helper-maven-plugin is missing. @ line 42, column 15
[WARNING] 'build.plugins.plugin.version' for org.codehaus.mojo:build-helper-maven-plugin is missing. @ line 45, column 15
[FATAL] Non-readable POM /home/jenkins/.m2/repository/org/junit/junit-bom/5.10.3/junit-bom-5.10.3.pom: input contained no data @ /home/jenkins/.m2/repository/org/junit/junit-bom/5.10.3/junit-bom-5.10.3.pom
[ERROR] 'dependencies.dependency.version' for org.jboss.shrinkwrap.resolver:shrinkwrap-resolver-depchain:pom is missing. @ line 77, column 17
[FATAL] Non-readable POM /home/jenkins/.m2/repository/org/junit/junit-bom/5.10.3/junit-bom-5.10.3.pom: input contained no data @ /home/jenkins/.m2/repository/org/junit/junit-bom/5.10.3/junit-bom-5.10.3.pom
[ERROR] 'dependencies.dependency.version' for org.jboss.shrinkwrap.resolver:shrinkwrap-resolver-depchain:pom is missing. @ line 186, column 17
[FATAL] Non-readable POM /home/jenkins/.m2/repository/org/junit/junit-bom/5.10.3/junit-bom-5.10.3.pom: input contained no data @ /home/jenkins/.m2/repository/org/junit/junit-bom/5.10.3/junit-bom-5.10.3.pom
[ERROR] 'dependencies.dependency.version' for org.jboss.shrinkwrap.resolver:shrinkwrap-resolver-depchain:pom is missing. @ line 169, column 17
[FATAL] Non-readable POM /home/jenkins/.m2/repository/org/junit/junit-bom/5.10.3/junit-bom-5.10.3.pom: input contained no data @ /home/jenkins/.m2/repository/org/junit/junit-bom/5.10.3/junit-bom-5.10.3.pom
[ERROR] 'dependencies.dependency.version' for org.jboss.shrinkwrap.resolver:shrinkwrap-resolver-depchain:pom is missing. @ line 124, column 17
[WARNING] 'dependencies.dependency.scope' for org.junit:junit-bom:pom must be one of [provided, compile, runtime, test, system] but is 'import'. @ line 43, column 20
[WARNING] 'dependencies.dependency.scope' for org.junit:junit-bom:pom must be one of [provided, compile, runtime, test, system] but is 'import'. @ line 44, column 20

	at PluginClassLoader for maven-plugin//hudson.maven.MavenModuleSetBuild$PomParser.invoke(MavenModuleSetBuild.java:1391)
	at PluginClassLoader for maven-plugin//hudson.maven.MavenModuleSetBuild$PomParser.invoke(MavenModuleSetBuild.java:1124)
	at hudson.FilePath$FileCallableWrapper.call(FilePath.java:3614)
	at hudson.remoting.UserRequest.perform(UserRequest.java:225)
	at hudson.remoting.UserRequest.perform(UserRequest.java:50)
	at hudson.remoting.Request$2.run(Request.java:391)
	at hudson.remoting.InterceptingExecutorService.lambda$wrap$0(InterceptingExecutorService.java:81)
	at java.base/java.util.concurrent.FutureTask.run(FutureTask.java:264)
	at java.base/java.util.concurrent.ThreadPoolExecutor.runWorker(ThreadPoolExecutor.java:1136)
	at java.base/java.util.concurrent.ThreadPoolExecutor$Worker.run(ThreadPoolExecutor.java:635)
	at java.base/java.lang.Thread.run(Thread.java:840)
	Suppressed: hudson.remoting.Channel$CallSiteStackTrace: Remote call to builds37
		at hudson.remoting.Channel.attachCallSiteStackTrace(Channel.java:1923)
		at hudson.remoting.UserRequest$ExceptionResponse.retrieve(UserRequest.java:384)
		at hudson.remoting.Channel.call(Channel.java:1112)
		at hudson.FilePath.act(FilePath.java:1228)
		at hudson.FilePath.act(FilePath.java:1217)
		at PluginClassLoader for maven-plugin//hudson.maven.MavenModuleSetBuild$MavenModuleSetBuildExecution.parsePoms(MavenModuleSetBuild.java:985)
		at PluginClassLoader for maven-plugin//hudson.maven.MavenModuleSetBuild$MavenModuleSetBuildExecution.doRun(MavenModuleSetBuild.java:689)
		at hudson.model.AbstractBuild$AbstractBuildExecution.run(AbstractBuild.java:527)
		at hudson.model.Run.execute(Run.java:1833)
		at PluginClassLoader for maven-plugin//hudson.maven.MavenModuleSetBuild.run(MavenModuleSetBuild.java:543)
		at hudson.model.ResourceController.execute(ResourceController.java:101)
		at hudson.model.Executor.run(Executor.java:446)
Caused by: hudson.remoting.ProxyException: org.apache.maven.project.ProjectBuildingException: Some problems were encountered while processing the POMs:
[FATAL] Non-readable POM /home/jenkins/.m2/repository/org/junit/junit-bom/5.10.3/junit-bom-5.10.3.pom: input contained no data @ /home/jenkins/.m2/repository/org/junit/junit-bom/5.10.3/junit-bom-5.10.3.pom
[ERROR] 'dependencies.dependency.version' for org.jboss.shrinkwrap.resolver:shrinkwrap-resolver-depchain:pom is missing. @ line 98, column 17
[FATAL] Non-readable POM /home/jenkins/.m2/repository/org/junit/junit-bom/5.10.3/junit-bom-5.10.3.pom: input contained no data @ /home/jenkins/.m2/repository/org/junit/junit-bom/5.10.3/junit-bom-5.10.3.pom
[ERROR] 'dependencies.dependency.version' for org.jboss.shrinkwrap.resolver:shrinkwrap-resolver-depchain:pom is missing. @ line 121, column 17
[FATAL] Non-readable POM /home/jenkins/.m2/repository/org/junit/junit-bom/5.10.3/junit-bom-5.10.3.pom: input contained no data @ /home/jenkins/.m2/repository/org/junit/junit-bom/5.10.3/junit-bom-5.10.3.pom
[ERROR] 'dependencies.dependency.version' for org.jboss.shrinkwrap.resolver:shrinkwrap-resolver-depchain:pom is missing. @ line 146, column 17
[FATAL] Non-readable POM /home/jenkins/.m2/repository/org/junit/junit-bom/5.10.3/junit-bom-5.10.3.pom: input contained no data @ /home/jenkins/.m2/repository/org/junit/junit-bom/5.10.3/junit-bom-5.10.3.pom
[ERROR] 'dependencies.dependency.version' for org.jboss.shrinkwrap.resolver:shrinkwrap-resolver-depchain:pom is missing. @ line 111, column 21
[FATAL] Non-readable POM /home/jenkins/.m2/repository/org/junit/junit-bom/5.10.3/junit-bom-5.10.3.pom: input contained no data @ /home/jenkins/.m2/repository/org/junit/junit-bom/5.10.3/junit-bom-5.10.3.pom
[ERROR] 'dependencies.dependency.version' for org.jboss.shrinkwrap.resolver:shrinkwrap-resolver-depchain:pom is missing. @ line 129, column 17
[FATAL] Non-readable POM /home/jenkins/.m2/repository/org/junit/junit-bom/5.10.3/junit-bom-5.10.3.pom: input contained no data @ /home/jenkins/.m2/repository/org/junit/junit-bom/5.10.3/junit-bom-5.10.3.pom
[ERROR] 'dependencies.dependency.version' for org.jboss.shrinkwrap.resolver:shrinkwrap-resolver-depchain:pom is missing. @ line 129, column 17
[FATAL] Non-readable POM /home/jenkins/.m2/repository/org/junit/junit-bom/5.10.3/junit-bom-5.10.3.pom: input contained no data @ /home/jenkins/.m2/repository/org/junit/junit-bom/5.10.3/junit-bom-5.10.3.pom
[ERROR] 'dependencies.dependency.version' for org.jboss.shrinkwrap.resolver:shrinkwrap-resolver-depchain:pom is missing. @ line 125, column 17
[FATAL] Non-readable POM /home/jenkins/.m2/repository/org/junit/junit-bom/5.10.3/junit-bom-5.10.3.pom: input contained no data @ /home/jenkins/.m2/repository/org/junit/junit-bom/5.10.3/junit-bom-5.10.3.pom
[ERROR] 'dependencies.dependency.version' for org.jboss.shrinkwrap.resolver:shrinkwrap-resolver-depchain:pom is missing. @ line 154, column 17
[FATAL] Non-readable POM /home/jenkins/.m2/repository/org/junit/junit-bom/5.10.3/junit-bom-5.10.3.pom: input contained no data @ /home/jenkins/.m2/repository/org/junit/junit-bom/5.10.3/junit-bom-5.10.3.pom
[ERROR] 'dependencies.dependency.version' for org.jboss.shrinkwrap.resolver:shrinkwrap-resolver-depchain:pom is missing. @ line 112, column 17
[WARNING] 'build.plugins.plugin.version' for org.codehaus.mojo:build-helper-maven-plugin is missing. @ line 42, column 15
[WARNING] 'build.plugins.plugin.version' for org.codehaus.mojo:build-helper-maven-plugin is missing. @ line 45, column 15
[FATAL] Non-readable POM /home/jenkins/.m2/repository/org/junit/junit-bom/5.10.3/junit-bom-5.10.3.pom: input contained no data @ /home/jenkins/.m2/repository/org/junit/junit-bom/5.10.3/junit-bom-5.10.3.pom
[ERROR] 'dependencies.dependency.version' for org.jboss.shrinkwrap.resolver:shrinkwrap-resolver-depchain:pom is missing. @ line 77, column 17
[FATAL] Non-readable POM /home/jenkins/.m2/repository/org/junit/junit-bom/5.10.3/junit-bom-5.10.3.pom: input contained no data @ /home/jenkins/.m2/repository/org/junit/junit-bom/5.10.3/junit-bom-5.10.3.pom
[ERROR] 'dependencies.dependency.version' for org.jboss.shrinkwrap.resolver:shrinkwrap-resolver-depchain:pom is missing. @ line 186, column 17
[FATAL] Non-readable POM /home/jenkins/.m2/repository/org/junit/junit-bom/5.10.3/junit-bom-5.10.3.pom: input contained no data @ /home/jenkins/.m2/repository/org/junit/junit-bom/5.10.3/junit-bom-5.10.3.pom
[ERROR] 'dependencies.dependency.version' for org.jboss.shrinkwrap.resolver:shrinkwrap-resolver-depchain:pom is missing. @ line 169, column 17
[FATAL] Non-readable POM /home/jenkins/.m2/repository/org/junit/junit-bom/5.10.3/junit-bom-5.10.3.pom: input contained no data @ /home/jenkins/.m2/repository/org/junit/junit-bom/5.10.3/junit-bom-5.10.3.pom
[ERROR] 'dependencies.dependency.version' for org.jboss.shrinkwrap.resolver:shrinkwrap-resolver-depchain:pom is missing. @ line 124, column 17
[WARNING] 'dependencies.dependency.scope' for org.junit:junit-bom:pom must be one of [provided, compile, runtime, test, system] but is 'import'. @ line 43, column 20
[WARNING] 'dependencies.dependency.scope' for org.junit:junit-bom:pom must be one of [provided, compile, runtime, test, system] but is 'import'. @ line 44, column 20

	at PluginClassLoader for maven-plugin//org.apache.maven.project.DefaultProjectBuilder.build(DefaultProjectBuilder.java:397)
	at PluginClassLoader for maven-plugin//hudson.maven.MavenEmbedder.buildProjects(MavenEmbedder.java:370)
	at PluginClassLoader for maven-plugin//hudson.maven.MavenEmbedder.readProjects(MavenEmbedder.java:340)
	at PluginClassLoader for maven-plugin//hudson.maven.MavenModuleSetBuild$PomParser.invoke(MavenModuleSetBuild.java:1330)
	... 10 more